[Date Prev][Date Next][Thread Prev][Thread Next][Date Index][Thread Index] [List Home]
Re: [mylyn-reviews-dev] mylyn-reviews-nightly test problem in gerrit.tests

We don't strictly need to use the unstable status in Hudson and could
simply fail builds that have failing tests, it's just a bit nicer.
Agreed that we should not have failing tests in the first place and we
generally don't but I have seen it happen :). That said, I am happy
with changing --fail-never to --fail-at-end.

Steffen


On Mon, Apr 4, 2011 at 3:58 AM, Sascha Scholz <sascha.scholz@xxxxxxxxx> wrote:
> Sorry, here is the correct link:
> http://dev.eclipse.org/mhonarc/lists/mylyn-reviews-dev/msg00382.html
>
> Why do we need --fail-never at all? All tests and integration tests
> are green. If some integration tests aren't reliable, maybe we could
> split them into a separate job (or better: make them reliable... ;-)
> )?
>
> Sascha
>
> On Mon, Apr 4, 2011 at 2:18 AM, Steffen Pingel
> <steffen.pingel@xxxxxxxxxxx> wrote:
>> The test pass is configured as --fail-never due to this Tycho
>> limitation: https://issues.sonatype.org/browse/TYCHO-333.
>>
>> Sorry, but the link points to a local gmail message, what is the cause
>> of the error?
>>
>> Steffen
>>
>>
>> On Sat, Apr 2, 2011 at 1:43 PM, Sascha Scholz <sascha.scholz@xxxxxxxxx>
>> wrote:
>>> Found out that the root cause is the same problem that I reported in
>>>
>>> https://mail.google.com/mail/?shva=1#label/Mylyn+Reviews+Dev/12f17ba12dda7357.
>>> But why is the build reported as successful?
>>>
>>> Sascha
>>>
>>> On Sat, Apr 2, 2011 at 10:40 PM, Sascha Scholz <sascha.scholz@xxxxxxxxx>
>>> wrote:
>>>> Hi,
>>>>
>>>> I'm confused about what happened in
>>>>
>>>> https://hudson.eclipse.org/hudson/me/my-views/view/My%20Jobs/job/mylyn-reviews-nightly/242/console.
>>>> The build is reported as successful. However, in the console the
>>>> following error appears:
>>>>
>>>> [ERROR] Failed to execute goal
>>>> org.sonatype.tycho:maven-osgi-test-plugin:0.10.0:test (default-test)
>>>> on project org.eclipse.mylyn.gerrit.tests: There are test failures.
>>>> [ERROR]
>>>> [ERROR] Please refer to
>>>>
>>>> /opt/users/hudsonbuild/workspace/mylyn-reviews-nightly/gerrit/org.eclipse.mylyn.gerrit.tests/target/surefire-reports
>>>> for the individual test results.
>>>> [ERROR] -> [Help 1]
>>>>
>>>> Unfortunately, there aren't any reports in
>>>> org.eclipse.mylyn.gerrit.tests/target/surefire-report.
>>>>
>>>> Sascha
>>>>
>>> _______________________________________________
>>> mylyn-reviews-dev mailing list
>>> mylyn-reviews-dev@xxxxxxxxxxx
>>> https://dev.eclipse.org/mailman/listinfo/mylyn-reviews-dev
>>>
>>
>>
>>
>> --
>> Steffen Pingel
>> Committer, http://eclipse.org/mylyn
>> Senior Developer, http://tasktop.com
>> _______________________________________________
>> mylyn-reviews-dev mailing list
>> mylyn-reviews-dev@xxxxxxxxxxx
>> https://dev.eclipse.org/mailman/listinfo/mylyn-reviews-dev
>>
>



-- 
Steffen Pingel
Committer, http://eclipse.org/mylyn
Senior Developer, http://tasktop.com