[Date Prev][Date Next][Thread Prev][Thread Next][Date Index][Thread Index] [List Home]
Re: [mylyn-reviews-dev] mylyn-reviews-nightly test problem in gerrit.tests

Found out that the root cause is the same problem that I reported in
https://mail.google.com/mail/?shva=1#label/Mylyn+Reviews+Dev/12f17ba12dda7357.
But why is the build reported as successful?

Sascha

On Sat, Apr 2, 2011 at 10:40 PM, Sascha Scholz <sascha.scholz@xxxxxxxxx> wrote:
> Hi,
>
> I'm confused about what happened in
> https://hudson.eclipse.org/hudson/me/my-views/view/My%20Jobs/job/mylyn-reviews-nightly/242/console.
> The build is reported as successful. However, in the console the
> following error appears:
>
> [ERROR] Failed to execute goal
> org.sonatype.tycho:maven-osgi-test-plugin:0.10.0:test (default-test)
> on project org.eclipse.mylyn.gerrit.tests: There are test failures.
> [ERROR]
> [ERROR] Please refer to
> /opt/users/hudsonbuild/workspace/mylyn-reviews-nightly/gerrit/org.eclipse.mylyn.gerrit.tests/target/surefire-reports
> for the individual test results.
> [ERROR] -> [Help 1]
>
> Unfortunately, there aren't any reports in
> org.eclipse.mylyn.gerrit.tests/target/surefire-report.
>
> Sascha
>