[Date Prev][Date Next][Thread Prev][Thread Next][Date Index][Thread Index] [List Home]
[wtp-releng] Build failed in Jenkins: WTP-R3_9_x_Maintenance #333

See <https://ci.eclipse.org/webtools/job/WTP-R3_9_x_Maintenance/333/display/redirect?page=changes>

Changes:

[nickboldt] update to latest webtools.buildSite =

------------------------------------------
[...truncated 291.61 KB...]
Downloading from sonatype-public-grid: https://repository.sonatype.org/content/groups/sonatype-public-grid/org/apache/maven/doxia/doxia/1.0-alpha-7/doxia-1.0-alpha-7.pom
Progress (1): 3.9 kB                    Downloaded from sonatype-public-grid: https://repository.sonatype.org/content/groups/sonatype-public-grid/org/apache/maven/doxia/doxia/1.0-alpha-7/doxia-1.0-alpha-7.pom (3.9 kB at 54 kB/s)
Downloading from tycho: https://oss.sonatype.org/content/repositories/public/org/apache/maven/maven-profile/2.0.6/maven-profile-2.0.6.pom
Downloading from cbi-repo: https://repo.eclipse.org/content/repositories/cbi/org/apache/maven/maven-profile/2.0.6/maven-profile-2.0.6.pom
Downloading from tycho-snapshot: https://repo.eclipse.org/content/repositories/tycho-snapshots/org/apache/maven/maven-profile/2.0.6/maven-profile-2.0.6.pom
Downloading from sonatype-public-grid: https://repository.sonatype.org/content/groups/sonatype-public-grid/org/apache/maven/maven-profile/2.0.6/maven-profile-2.0.6.pom
Progress (1): 2.0 kB                    Downloaded from sonatype-public-grid: https://repository.sonatype.org/content/groups/sonatype-public-grid/org/apache/maven/maven-profile/2.0.6/maven-profile-2.0.6.pom (2.0 kB at 28 kB/s)
Downloading from tycho: https://oss.sonatype.org/content/repositories/public/org/apache/maven/maven-repository-metadata/2.0.6/maven-repository-metadata-2.0.6.pom
Downloading from cbi-repo: https://repo.eclipse.org/content/repositories/cbi/org/apache/maven/maven-repository-metadata/2.0.6/maven-repository-metadata-2.0.6.pom
Downloading from tycho-snapshot: https://repo.eclipse.org/content/repositories/tycho-snapshots/org/apache/maven/maven-repository-metadata/2.0.6/maven-repository-metadata-2.0.6.pom
Downloading from sonatype-public-grid: https://repository.sonatype.org/content/groups/sonatype-public-grid/org/apache/maven/maven-repository-metadata/2.0.6/maven-repository-metadata-2.0.6.pom
Progress (1): 1.9 kB                    Downloaded from sonatype-public-grid: https://repository.sonatype.org/content/groups/sonatype-public-grid/org/apache/maven/maven-repository-metadata/2.0.6/maven-repository-metadata-2.0.6.pom (1.9 kB at 26 kB/s)
Downloading from tycho: https://oss.sonatype.org/content/repositories/public/org/apache/maven/maven-error-diagnostics/2.0.6/maven-error-diagnostics-2.0.6.pom
Downloading from cbi-repo: https://repo.eclipse.org/content/repositories/cbi/org/apache/maven/maven-error-diagnostics/2.0.6/maven-error-diagnostics-2.0.6.pom
Downloading from tycho-snapshot: https://repo.eclipse.org/content/repositories/tycho-snapshots/org/apache/maven/maven-error-diagnostics/2.0.6/maven-error-diagnostics-2.0.6.pom
Downloading from sonatype-public-grid: https://repository.sonatype.org/content/groups/sonatype-public-grid/org/apache/maven/maven-error-diagnostics/2.0.6/maven-error-diagnostics-2.0.6.pom
Progress (1): 1.7 kB                    Downloaded from sonatype-public-grid: https://repository.sonatype.org/content/groups/sonatype-public-grid/org/apache/maven/maven-error-diagnostics/2.0.6/maven-error-diagnostics-2.0.6.pom (1.7 kB at 24 kB/s)
Downloading from tycho: https://oss.sonatype.org/content/repositories/public/commons-cli/commons-cli/1.0/commons-cli-1.0.pom
Downloading from cbi-repo: https://repo.eclipse.org/content/repositories/cbi/commons-cli/commons-cli/1.0/commons-cli-1.0.pom
Downloading from tycho-snapshot: https://repo.eclipse.org/content/repositories/tycho-snapshots/commons-cli/commons-cli/1.0/commons-cli-1.0.pom
Downloading from sonatype-public-grid: https://repository.sonatype.org/content/groups/sonatype-public-grid/commons-cli/commons-cli/1.0/commons-cli-1.0.pom
Progress (1): 2.1 kB                    Downloaded from sonatype-public-grid: https://repository.sonatype.org/content/groups/sonatype-public-grid/commons-cli/commons-cli/1.0/commons-cli-1.0.pom (2.1 kB at 30 kB/s)
Downloading from tycho: https://oss.sonatype.org/content/repositories/public/org/apache/maven/maven-plugin-api/2.0.6/maven-plugin-api-2.0.6.pom
Downloading from cbi-repo: https://repo.eclipse.org/content/repositories/cbi/org/apache/maven/maven-plugin-api/2.0.6/maven-plugin-api-2.0.6.pom
Downloading from tycho-snapshot: https://repo.eclipse.org/content/repositories/tycho-snapshots/org/apache/maven/maven-plugin-api/2.0.6/maven-plugin-api-2.0.6.pom
Downloading from sonatype-public-grid: https://repository.sonatype.org/content/groups/sonatype-public-grid/org/apache/maven/maven-plugin-api/2.0.6/maven-plugin-api-2.0.6.pom
Progress (1): 1.5 kB                    Downloaded from sonatype-public-grid: https://repository.sonatype.org/content/groups/sonatype-public-grid/org/apache/maven/maven-plugin-api/2.0.6/maven-plugin-api-2.0.6.pom (1.5 kB at 21 kB/s)
Downloading from tycho: https://oss.sonatype.org/content/repositories/public/org/apache/maven/maven-plugin-descriptor/2.0.6/maven-plugin-descriptor-2.0.6.pom
Downloading from cbi-repo: https://repo.eclipse.org/content/repositories/cbi/org/apache/maven/maven-plugin-descriptor/2.0.6/maven-plugin-descriptor-2.0.6.pom
Downloading from tycho-snapshot: https://repo.eclipse.org/content/repositories/tycho-snapshots/org/apache/maven/maven-plugin-descriptor/2.0.6/maven-plugin-descriptor-2.0.6.pom
Downloading from sonatype-public-grid: https://repository.sonatype.org/content/groups/sonatype-public-grid/org/apache/maven/maven-plugin-descriptor/2.0.6/maven-plugin-descriptor-2.0.6.pom
Progress (1): 2.0 kB                    Downloaded from sonatype-public-grid: https://repository.sonatype.org/content/groups/sonatype-public-grid/org/apache/maven/maven-plugin-descriptor/2.0.6/maven-plugin-descriptor-2.0.6.pom (2.0 kB at 27 kB/s)
Downloading from tycho: https://oss.sonatype.org/content/repositories/public/org/codehaus/plexus/plexus-interactivity-api/1.0-alpha-4/plexus-interactivity-api-1.0-alpha-4.pom
Downloading from cbi-repo: https://repo.eclipse.org/content/repositories/cbi/org/codehaus/plexus/plexus-interactivity-api/1.0-alpha-4/plexus-interactivity-api-1.0-alpha-4.pom
Downloading from tycho-snapshot: https://repo.eclipse.org/content/repositories/tycho-snapshots/org/codehaus/plexus/plexus-interactivity-api/1.0-alpha-4/plexus-interactivity-api-1.0-alpha-4.pom
Downloading from sonatype-public-grid: https://repository.sonatype.org/content/groups/sonatype-public-grid/org/codehaus/plexus/plexus-interactivity-api/1.0-alpha-4/plexus-interactivity-api-1.0-alpha-4.pom
Progress (1): 4.1/7.1 kBProgress (1): 7.1 kB                        Downloaded from sonatype-public-grid: https://repository.sonatype.org/content/groups/sonatype-public-grid/org/codehaus/plexus/plexus-interactivity-api/1.0-alpha-4/plexus-interactivity-api-1.0-alpha-4.pom (7.1 kB at 97 kB/s)
Downloading from tycho: https://oss.sonatype.org/content/repositories/public/org/apache/maven/maven-artifact-manager/2.0.6/maven-artifact-manager-2.0.6.pom
Downloading from cbi-repo: https://repo.eclipse.org/content/repositories/cbi/org/apache/maven/maven-artifact-manager/2.0.6/maven-artifact-manager-2.0.6.pom
Downloading from tycho-snapshot: https://repo.eclipse.org/content/repositories/tycho-snapshots/org/apache/maven/maven-artifact-manager/2.0.6/maven-artifact-manager-2.0.6.pom
Downloading from sonatype-public-grid: https://repository.sonatype.org/content/groups/sonatype-public-grid/org/apache/maven/maven-artifact-manager/2.0.6/maven-artifact-manager-2.0.6.pom
Progress (1): 2.6 kB                    Downloaded from sonatype-public-grid: https://repository.sonatype.org/content/groups/sonatype-public-grid/org/apache/maven/maven-artifact-manager/2.0.6/maven-artifact-manager-2.0.6.pom (2.6 kB at 37 kB/s)
Downloading from tycho: https://oss.sonatype.org/content/repositories/public/org/apache/maven/maven-monitor/2.0.6/maven-monitor-2.0.6.pom
Downloading from cbi-repo: https://repo.eclipse.org/content/repositories/cbi/org/apache/maven/maven-monitor/2.0.6/maven-monitor-2.0.6.pom
Downloading from tycho-snapshot: https://repo.eclipse.org/content/repositories/tycho-snapshots/org/apache/maven/maven-monitor/2.0.6/maven-monitor-2.0.6.pom
Downloading from sonatype-public-grid: https://repository.sonatype.org/content/groups/sonatype-public-grid/org/apache/maven/maven-monitor/2.0.6/maven-monitor-2.0.6.pom
Progress (1): 1.3 kB                    Downloaded from sonatype-public-grid: https://repository.sonatype.org/content/groups/sonatype-public-grid/org/apache/maven/maven-monitor/2.0.6/maven-monitor-2.0.6.pom (1.3 kB at 18 kB/s)
Downloading from tycho: https://oss.sonatype.org/content/repositories/public/classworlds/classworlds/1.1/classworlds-1.1.pom
Downloading from cbi-repo: https://repo.eclipse.org/content/repositories/cbi/classworlds/classworlds/1.1/classworlds-1.1.pom
Downloading from tycho-snapshot: https://repo.eclipse.org/content/repositories/tycho-snapshots/classworlds/classworlds/1.1/classworlds-1.1.pom
Downloading from sonatype-public-grid: https://repository.sonatype.org/content/groups/sonatype-public-grid/classworlds/classworlds/1.1/classworlds-1.1.pom
Progress (1): 3.3 kB                    Downloaded from sonatype-public-grid: https://repository.sonatype.org/content/groups/sonatype-public-grid/classworlds/classworlds/1.1/classworlds-1.1.pom (3.3 kB at 47 kB/s)
Downloading from tycho: https://oss.sonatype.org/content/repositories/public/org/codehaus/plexus/plexus-archiver/2.1/plexus-archiver-2.1.pom
Downloading from cbi-repo: https://repo.eclipse.org/content/repositories/cbi/org/codehaus/plexus/plexus-archiver/2.1/plexus-archiver-2.1.pom
Downloading from tycho-snapshot: https://repo.eclipse.org/content/repositories/tycho-snapshots/org/codehaus/plexus/plexus-archiver/2.1/plexus-archiver-2.1.pom
Downloading from sonatype-public-grid: https://repository.sonatype.org/content/groups/sonatype-public-grid/org/codehaus/plexus/plexus-archiver/2.1/plexus-archiver-2.1.pom
Progress (1): 2.8 kB                    Downloaded from sonatype-public-grid: https://repository.sonatype.org/content/groups/sonatype-public-grid/org/codehaus/plexus/plexus-archiver/2.1/plexus-archiver-2.1.pom (2.8 kB at 40 kB/s)
Downloading from tycho: https://oss.sonatype.org/content/repositories/public/org/codehaus/plexus/plexus-io/2.0.2/plexus-io-2.0.2.pom
Downloading from cbi-repo: https://repo.eclipse.org/content/repositories/cbi/org/codehaus/plexus/plexus-io/2.0.2/plexus-io-2.0.2.pom
Downloading from tycho-snapshot: https://repo.eclipse.org/content/repositories/tycho-snapshots/org/codehaus/plexus/plexus-io/2.0.2/plexus-io-2.0.2.pom
Downloading from sonatype-public-grid: https://repository.sonatype.org/content/groups/sonatype-public-grid/org/codehaus/plexus/plexus-io/2.0.2/plexus-io-2.0.2.pom
Progress (1): 1.7 kB                    Downloaded from sonatype-public-grid: https://repository.sonatype.org/content/groups/sonatype-public-grid/org/codehaus/plexus/plexus-io/2.0.2/plexus-io-2.0.2.pom (1.7 kB at 24 kB/s)
Downloading from tycho: https://oss.sonatype.org/content/repositories/public/org/apache/maven/maven-archiver/2.4.2/maven-archiver-2.4.2.jar
Downloading from tycho: https://oss.sonatype.org/content/repositories/public/org/codehaus/plexus/plexus-archiver/2.0.1/plexus-archiver-2.0.1.jar
Downloading from tycho: https://oss.sonatype.org/content/repositories/public/org/codehaus/plexus/plexus-container-default/1.0-alpha-9-stable-1/plexus-container-default-1.0-alpha-9-stable-1.jar
Downloading from tycho: https://oss.sonatype.org/content/repositories/public/classworlds/classworlds/1.1-alpha-2/classworlds-1.1-alpha-2.jar
Downloading from tycho: https://oss.sonatype.org/content/repositories/public/org/codehaus/plexus/plexus-io/2.0.1/plexus-io-2.0.1.jar
Downloading from tycho: https://oss.sonatype.org/content/repositories/public/org/codehaus/plexus/plexus-utils/3.0/plexus-utils-3.0.jar
Downloading from tycho: https://oss.sonatype.org/content/repositories/public/org/codehaus/plexus/plexus-interpolation/1.13/plexus-interpolation-1.13.jar
Downloading from cbi-repo: https://repo.eclipse.org/content/repositories/cbi/org/apache/maven/maven-archiver/2.4.2/maven-archiver-2.4.2.jar
Downloading from cbi-repo: https://repo.eclipse.org/content/repositories/cbi/org/codehaus/plexus/plexus-archiver/2.0.1/plexus-archiver-2.0.1.jar
Downloading from cbi-repo: https://repo.eclipse.org/content/repositories/cbi/org/codehaus/plexus/plexus-container-default/1.0-alpha-9-stable-1/plexus-container-default-1.0-alpha-9-stable-1.jar
Downloading from cbi-repo: https://repo.eclipse.org/content/repositories/cbi/classworlds/classworlds/1.1-alpha-2/classworlds-1.1-alpha-2.jar
Downloading from cbi-repo: https://repo.eclipse.org/content/repositories/cbi/org/codehaus/plexus/plexus-io/2.0.1/plexus-io-2.0.1.jar
Downloading from cbi-repo: https://repo.eclipse.org/content/repositories/cbi/org/codehaus/plexus/plexus-utils/3.0/plexus-utils-3.0.jar
Downloading from cbi-repo: https://repo.eclipse.org/content/repositories/cbi/org/codehaus/plexus/plexus-interpolation/1.13/plexus-interpolation-1.13.jar
Downloading from tycho-snapshot: https://repo.eclipse.org/content/repositories/tycho-snapshots/org/apache/maven/maven-archiver/2.4.2/maven-archiver-2.4.2.jar
Downloading from tycho-snapshot: https://repo.eclipse.org/content/repositories/tycho-snapshots/org/codehaus/plexus/plexus-archiver/2.0.1/plexus-archiver-2.0.1.jar
Downloading from tycho-snapshot: https://repo.eclipse.org/content/repositories/tycho-snapshots/org/codehaus/plexus/plexus-container-default/1.0-alpha-9-stable-1/plexus-container-default-1.0-alpha-9-stable-1.jar
Downloading from tycho-snapshot: https://repo.eclipse.org/content/repositories/tycho-snapshots/classworlds/classworlds/1.1-alpha-2/classworlds-1.1-alpha-2.jar
Downloading from tycho-snapshot: https://repo.eclipse.org/content/repositories/tycho-snapshots/org/codehaus/plexus/plexus-io/2.0.1/plexus-io-2.0.1.jar
Downloading from tycho-snapshot: https://repo.eclipse.org/content/repositories/tycho-snapshots/org/codehaus/plexus/plexus-utils/3.0/plexus-utils-3.0.jar
Downloading from tycho-snapshot: https://repo.eclipse.org/content/repositories/tycho-snapshots/org/codehaus/plexus/plexus-interpolation/1.13/plexus-interpolation-1.13.jar
Downloading from sonatype-public-grid: https://repository.sonatype.org/content/groups/sonatype-public-grid/org/apache/maven/maven-archiver/2.4.2/maven-archiver-2.4.2.jar
Downloading from sonatype-public-grid: https://repository.sonatype.org/content/groups/sonatype-public-grid/org/codehaus/plexus/plexus-archiver/2.0.1/plexus-archiver-2.0.1.jar
Downloading from sonatype-public-grid: https://repository.sonatype.org/content/groups/sonatype-public-grid/org/codehaus/plexus/plexus-container-default/1.0-alpha-9-stable-1/plexus-container-default-1.0-alpha-9-stable-1.jar
Downloading from sonatype-public-grid: https://repository.sonatype.org/content/groups/sonatype-public-grid/classworlds/classworlds/1.1-alpha-2/classworlds-1.1-alpha-2.jar
Downloading from sonatype-public-grid: https://repository.sonatype.org/content/groups/sonatype-public-grid/org/codehaus/plexus/plexus-io/2.0.1/plexus-io-2.0.1.jar
Progress (1): 4.1/180 kBProgress (1): 7.8/180 kBProgress (1): 12/180 kB Progress (1): 16/180 kBProgress (1): 20/180 kBProgress (1): 24/180 kBProgress (1): 28/180 kBProgress (1): 32/180 kBProgress (1): 37/180 kBProgress (1): 41/180 kBProgress (1): 45/180 kBProgress (1): 49/180 kBProgress (1): 53/180 kBProgress (1): 57/180 kBProgress (1): 61/180 kBProgress (1): 61/180 kBProgress (2): 61/180 kB | 4.1/38 kBProgress (2): 61/180 kB | 7.8/38 kBProgress (2): 61/180 kB | 12/38 kB Progress (2): 61/180 kB | 16/38 kBProgress (2): 66/180 kB | 16/38 kBProgress (2): 70/180 kB | 16/38 kBProgress (2): 74/180 kB | 16/38 kBProgress (2): 78/180 kB | 16/38 kBProgress (2): 78/180 kB | 20/38 kBProgress (2): 78/180 kB | 24/38 kBProgress (2): 78/180 kB | 28/38 kBProgress (2): 78/180 kB | 32/38 kBProgress (2): 82/180 kB | 32/38 kBProgress (2): 86/180 kB | 32/38 kBProgress (2): 86/180 kB | 37/38 kBProgress (2): 90/180 kB | 37/38 kBProgress (2): 90/180 kB | 38 kB   Progress (2): 94/180 kB | 38 kBProgress (2): 98/180 kB | 38 kBProgress (2): 102/180 kB | 38 kBProgress (2): 106/180 kB | 38 kBProgress (2): 111/180 kB | 38 kBProgress (2): 115/180 kB | 38 kBProgress (2): 119/180 kB | 38 kBProgress (2): 123/180 kB | 38 kBProgress (2): 127/180 kB | 38 kBProgress (2): 131/180 kB | 38 kBProgress (2): 135/180 kB | 38 kBProgress (2): 139/180 kB | 38 kBProgress (2): 143/180 kB | 38 kBProgress (2): 147/180 kB | 38 kBProgress (2): 152/180 kB | 38 kBProgress (2): 156/180 kB | 38 kBProgress (2): 160/180 kB | 38 kBProgress (2): 164/180 kB | 38 kBProgress (2): 168/180 kB | 38 kBProgress (2): 172/180 kB | 38 kBProgress (2): 176/180 kB | 38 kBProgress (2): 180 kB | 38 kB                                Downloaded from sonatype-public-grid: https://repository.sonatype.org/content/groups/sonatype-public-grid/classworlds/classworlds/1.1-alpha-2/classworlds-1.1-alpha-2.jar (38 kB at 395 kB/s)
Downloading from sonatype-public-grid: https://repository.sonatype.org/content/groups/sonatype-public-grid/org/codehaus/plexus/plexus-utils/3.0/plexus-utils-3.0.jar
Downloaded from sonatype-public-grid: https://repository.sonatype.org/content/groups/sonatype-public-grid/org/codehaus/plexus/plexus-archiver/2.0.1/plexus-archiver-2.0.1.jar (180 kB at 1.8 MB/s)
Downloading from sonatype-public-grid: https://repository.sonatype.org/content/groups/sonatype-public-grid/org/codehaus/plexus/plexus-interpolation/1.13/plexus-interpolation-1.13.jar
Progress (1): 4.1/61 kBProgress (1): 7.8/61 kBProgress (1): 7.9/61 kBProgress (1): 12/61 kB Progress (1): 16/61 kBProgress (1): 20/61 kBProgress (1): 24/61 kBProgress (2): 24/61 kB | 4.1/226 kBProgress (2): 28/61 kB | 4.1/226 kBProgress (2): 28/61 kB | 7.8/226 kBProgress (2): 32/61 kB | 7.8/226 kBProgress (2): 32/61 kB | 12/226 kB Progress (2): 37/61 kB | 12/226 kBProgress (2): 37/61 kB | 16/226 kBProgress (2): 41/61 kB | 16/226 kBProgress (2): 41/61 kB | 20/226 kBProgress (2): 41/61 kB | 20/226 kBProgress (2): 45/61 kB | 20/226 kBProgress (2): 49/61 kB | 20/226 kBProgress (2): 53/61 kB | 20/226 kBProgress (2): 53/61 kB | 24/226 kBProgress (2): 57/61 kB | 24/226 kBProgress (2): 57/61 kB | 28/226 kBProgress (2): 57/61 kB | 32/226 kBProgress (2): 57/61 kB | 37/226 kBProgress (2): 61 kB | 37/226 kB   Progress (2): 61 kB | 41/226 kBProgress (2): 61 kB | 45/226 kBProgress (2): 61 kB | 49/226 kBProgress (2): 61 kB | 53/226 kBProgress (2): 61 kB | 57/226 kBProgress (2): 61 kB | 61/226 kBProgress (2): 61 kB | 65/226 kBProgress (2): 61 kB | 69/226 kBProgress (2): 61 kB | 73/226 kBProgress (2): 61 kB | 77/226 kBProgress (2): 61 kB | 82/226 kBProgress (2): 61 kB | 86/226 kBProgress (2): 61 kB | 90/226 kBProgress (2): 61 kB | 94/226 kBProgress (2): 61 kB | 98/226 kBProgress (2): 61 kB | 102/226 kBProgress (2): 61 kB | 102/226 kBProgress (2): 61 kB | 106/226 kBProgress (2): 61 kB | 111/226 kBProgress (2): 61 kB | 115/226 kBProgress (2): 61 kB | 119/226 kBProgress (2): 61 kB | 123/226 kBProgress (2): 61 kB | 127/226 kBProgress (2): 61 kB | 131/226 kBProgress (2): 61 kB | 135/226 kBProgress (2): 61 kB | 139/226 kBProgress (2): 61 kB | 143/226 kBProgress (2): 61 kB | 147/226 kBProgress (2): 61 kB | 152/226 kBProgress (2): 61 kB | 156/226 kBProgress (2): 61 kB | 160/226 kBProgress (2): 61 kB | 164/226 kBProgress (2): 61 kB | 168/226 kBProgress (2): 61 kB | 172/226 kBProgress (2): 61 kB | 176/226 kBProgress (2): 61 kB | 180/226 kBProgress (2): 61 kB | 182/226 kBProgress (2): 61 kB | 186/226 kBProgress (2): 61 kB | 190/226 kBProgress (2): 61 kB | 194/226 kBProgress (2): 61 kB | 198/226 kBProgress (2): 61 kB | 202/226 kBProgress (2): 61 kB | 207/226 kBProgress (2): 61 kB | 211/226 kBProgress (2): 61 kB | 215/226 kBProgress (2): 61 kB | 219/226 kBProgress (2): 61 kB | 223/226 kBProgress (2): 61 kB | 226 kB                                Downloaded from sonatype-public-grid: https://repository.sonatype.org/content/groups/sonatype-public-grid/org/codehaus/plexus/plexus-interpolation/1.13/plexus-interpolation-1.13.jar (61 kB at 345 kB/s)
Downloaded from sonatype-public-grid: https://repository.sonatype.org/content/groups/sonatype-public-grid/org/codehaus/plexus/plexus-utils/3.0/plexus-utils-3.0.jar (226 kB at 1.1 MB/s)
Progress (1): 4.1/58 kBProgress (1): 7.8/58 kBProgress (1): 7.9/58 kBProgress (2): 7.9/58 kB | 4.1/194 kBProgress (2): 7.9/58 kB | 7.8/194 kBProgress (2): 7.9/58 kB | 12/194 kB Progress (2): 7.9/58 kB | 16/194 kBProgress (2): 7.9/58 kB | 20/194 kBProgress (2): 7.9/58 kB | 20/194 kBProgress (2): 7.9/58 kB | 24/194 kBProgress (2): 7.9/58 kB | 28/194 kBProgress (2): 7.9/58 kB | 32/194 kBProgress (2): 7.9/58 kB | 37/194 kBProgress (3): 7.9/58 kB | 37/194 kB | 4.1/20 kBProgress (3): 7.9/58 kB | 37/194 kB | 7.8/20 kBProgress (3): 7.9/58 kB | 37/194 kB | 12/20 kB Progress (3): 7.9/58 kB | 37/194 kB | 16/20 kBProgress (3): 12/58 kB | 37/194 kB | 16/20 kB Progress (3): 16/58 kB | 37/194 kB | 16/20 kBProgress (3): 20/58 kB | 37/194 kB | 16/20 kBProgress (3): 24/58 kB | 37/194 kB | 16/20 kBProgress (3): 24/58 kB | 37/194 kB | 20/20 kBProgress (3): 24/58 kB | 37/194 kB | 20 kB   Progress (3): 28/58 kB | 37/194 kB | 20 kBProgress (3): 32/58 kB | 37/194 kB | 20 kBProgress (3): 37/58 kB | 37/194 kB | 20 kBProgress (3): 41/58 kB | 37/194 kB | 20 kBProgress (3): 41/58 kB | 41/194 kB | 20 kBProgress (3): 41/58 kB | 45/194 kB | 20 kBProgress (3): 41/58 kB | 49/194 kB | 20 kBProgress (3): 41/58 kB | 53/194 kB | 20 kBProgress (3): 41/58 kB | 57/194 kB | 20 kBProgress (3): 41/58 kB | 61/194 kB | 20 kBProgress (3): 41/58 kB | 61/194 kB | 20 kBProgress (3): 45/58 kB | 61/194 kB | 20 kBProgress (3): 49/58 kB | 61/194 kB | 20 kBProgress (3): 53/58 kB | 61/194 kB | 20 kBProgress (3): 57/58 kB | 61/194 kB | 20 kBProgress (3): 58 kB | 61/194 kB | 20 kB                                          Downloaded from sonatype-public-grid: https://repository.sonatype.org/content/groups/sonatype-public-grid/org/apache/maven/maven-archiver/2.4.2/maven-archiver-2.4.2.jar (20 kB at 61 kB/s)
Progress (2): 58 kB | 66/194 kBProgress (2): 58 kB | 70/194 kBProgress (2): 58 kB | 74/194 kBProgress (2): 58 kB | 78/194 kBProgress (2): 58 kB | 82/194 kBProgress (2): 58 kB | 86/194 kBProgress (2): 58 kB | 90/194 kBProgress (2): 58 kB | 94/194 kBProgress (2): 58 kB | 98/194 kBProgress (2): 58 kB | 102/194 kBProgress (2): 58 kB | 106/194 kBProgress (2): 58 kB | 111/194 kB                                Downloaded from sonatype-public-grid: https://repository.sonatype.org/content/groups/sonatype-public-grid/org/codehaus/plexus/plexus-io/2.0.1/plexus-io-2.0.1.jar (58 kB at 169 kB/s)
Progress (1): 115/194 kBProgress (1): 119/194 kBProgress (1): 123/194 kBProgress (1): 127/194 kBProgress (1): 131/194 kBProgress (1): 135/194 kBProgress (1): 139/194 kBProgress (1): 143/194 kBProgress (1): 147/194 kBProgress (1): 152/194 kBProgress (1): 156/194 kBProgress (1): 160/194 kBProgress (1): 164/194 kBProgress (1): 168/194 kBProgress (1): 172/194 kBProgress (1): 176/194 kBProgress (1): 180/194 kBProgress (1): 184/194 kBProgress (1): 188/194 kBProgress (1): 193/194 kBProgress (1): 194 kB                        Downloaded from sonatype-public-grid: https://repository.sonatype.org/content/groups/sonatype-public-grid/org/codehaus/plexus/plexus-container-default/1.0-alpha-9-stable-1/plexus-container-default-1.0-alpha-9-stable-1.jar (194 kB at 443 kB/s)
Downloading from tycho: https://oss.sonatype.org/content/repositories/public/org/eclipse/tycho/tycho-surefire-plugin/0.21.0/tycho-surefire-plugin-0.21.0.pom
Progress (1): 3.2 kB                    Downloaded from tycho: https://oss.sonatype.org/content/repositories/public/org/eclipse/tycho/tycho-surefire-plugin/0.21.0/tycho-surefire-plugin-0.21.0.pom (3.2 kB at 14 kB/s)
Downloading from tycho: https://oss.sonatype.org/content/repositories/public/org/eclipse/tycho/tycho-surefire/0.21.0/tycho-surefire-0.21.0.pom
Progress (1): 2.8 kB                    Downloaded from tycho: https://oss.sonatype.org/content/repositories/public/org/eclipse/tycho/tycho-surefire/0.21.0/tycho-surefire-0.21.0.pom (2.8 kB at 22 kB/s)
Downloading from tycho: https://oss.sonatype.org/content/repositories/public/org/eclipse/tycho/tycho-surefire-plugin/0.21.0/tycho-surefire-plugin-0.21.0.jar
Progress (1): 3.8/49 kBProgress (1): 7.9/49 kBProgress (1): 12/49 kB Progress (1): 16/49 kBProgress (1): 20/49 kBProgress (1): 24/49 kBProgress (1): 28/49 kBProgress (1): 32/49 kBProgress (1): 37/49 kBProgress (1): 41/49 kBProgress (1): 45/49 kBProgress (1): 49/49 kBProgress (1): 49 kB                      Downloaded from tycho: https://oss.sonatype.org/content/repositories/public/org/eclipse/tycho/tycho-surefire-plugin/0.21.0/tycho-surefire-plugin-0.21.0.jar (49 kB at 256 kB/s)
Downloading from tycho: https://oss.sonatype.org/content/repositories/public/org/eclipse/tycho/org.eclipse.tycho.surefire.osgibooter/0.21.0/org.eclipse.tycho.surefire.osgibooter-0.21.0.pom
Progress (1): 1.9 kB                    Downloaded from tycho: https://oss.sonatype.org/content/repositories/public/org/eclipse/tycho/org.eclipse.tycho.surefire.osgibooter/0.21.0/org.eclipse.tycho.surefire.osgibooter-0.21.0.pom (1.9 kB at 15 kB/s)
Downloading from tycho: https://oss.sonatype.org/content/repositories/public/org/eclipse/tycho/org.eclipse.tycho.surefire.junit/0.21.0/org.eclipse.tycho.surefire.junit-0.21.0.pom
Progress (1): 1.6 kB                    Downloaded from tycho: https://oss.sonatype.org/content/repositories/public/org/eclipse/tycho/org.eclipse.tycho.surefire.junit/0.21.0/org.eclipse.tycho.surefire.junit-0.21.0.pom (1.6 kB at 12 kB/s)
Downloading from tycho: https://oss.sonatype.org/content/repositories/public/org/eclipse/tycho/org.eclipse.tycho.surefire.junit4/0.21.0/org.eclipse.tycho.surefire.junit4-0.21.0.pom
Progress (1): 1.6 kB                    Downloaded from tycho: https://oss.sonatype.org/content/repositories/public/org/eclipse/tycho/org.eclipse.tycho.surefire.junit4/0.21.0/org.eclipse.tycho.surefire.junit4-0.21.0.pom (1.6 kB at 13 kB/s)
Downloading from tycho: https://oss.sonatype.org/content/repositories/public/org/eclipse/tycho/org.eclipse.tycho.surefire.junit47/0.21.0/org.eclipse.tycho.surefire.junit47-0.21.0.pom
Progress (1): 1.6 kB                    Downloaded from tycho: https://oss.sonatype.org/content/repositories/public/org/eclipse/tycho/org.eclipse.tycho.surefire.junit47/0.21.0/org.eclipse.tycho.surefire.junit47-0.21.0.pom (1.6 kB at 12 kB/s)
Downloading from tycho: https://oss.sonatype.org/content/repositories/public/org/apache/maven/surefire/surefire-api/2.10/surefire-api-2.10.pom
Downloading from cbi-repo: https://repo.eclipse.org/content/repositories/cbi/org/apache/maven/surefire/surefire-api/2.10/surefire-api-2.10.pom
Downloading from tycho-snapshot: https://repo.eclipse.org/content/repositories/tycho-snapshots/org/apache/maven/surefire/surefire-api/2.10/surefire-api-2.10.pom
Downloading from sonatype-public-grid: https://repository.sonatype.org/content/groups/sonatype-public-grid/org/apache/maven/surefire/surefire-api/2.10/surefire-api-2.10.pom
Progress (1): 2.3 kB                    Downloaded from sonatype-public-grid: https://repository.sonatype.org/content/groups/sonatype-public-grid/org/apache/maven/surefire/surefire-api/2.10/surefire-api-2.10.pom (2.3 kB at 30 kB/s)
Downloading from tycho: https://oss.sonatype.org/content/repositories/public/org/apache/maven/surefire/surefire/2.10/surefire-2.10.pom
Downloading from cbi-repo: https://repo.eclipse.org/content/repositories/cbi/org/apache/maven/surefire/surefire/2.10/surefire-2.10.pom
Downloading from tycho-snapshot: https://repo.eclipse.org/content/repositories/tycho-snapshots/org/apache/maven/surefire/surefire/2.10/surefire-2.10.pom
Downloading from sonatype-public-grid: https://repository.sonatype.org/content/groups/sonatype-public-grid/org/apache/maven/surefire/surefire/2.10/surefire-2.10.pom
Progress (1): 4.1/12 kBProgress (1): 7.9/12 kBProgress (1): 12 kB                       Downloaded from sonatype-public-grid: https://repository.sonatype.org/content/groups/sonatype-public-grid/org/apache/maven/surefire/surefire/2.10/surefire-2.10.pom (12 kB at 155 kB/s)
Downloading from tycho: https://oss.sonatype.org/content/repositories/public/org/apache/maven/maven-parent/20/maven-parent-20.pom
Downloading from cbi-repo: https://repo.eclipse.org/content/repositories/cbi/org/apache/maven/maven-parent/20/maven-parent-20.pom
Downloading from tycho-snapshot: https://repo.eclipse.org/content/repositories/tycho-snapshots/org/apache/maven/maven-parent/20/maven-parent-20.pom
Downloading from sonatype-public-grid: https://repository.sonatype.org/content/groups/sonatype-public-grid/org/apache/maven/maven-parent/20/maven-parent-20.pom
Progress (1): 4.1/25 kBProgress (1): 7.9/25 kBProgress (1): 7.9/25 kBProgress (1): 12/25 kB Progress (1): 16/25 kBProgress (1): 20/25 kBProgress (1): 24/25 kBProgress (1): 25 kB                      Downloaded from sonatype-public-grid: https://repository.sonatype.org/content/groups/sonatype-public-grid/org/apache/maven/maven-parent/20/maven-parent-20.pom (25 kB at 320 kB/s)
Downloading from tycho: https://oss.sonatype.org/content/repositories/public/org/eclipse/tycho/org.eclipse.tycho.surefire.osgibooter/0.21.0/org.eclipse.tycho.surefire.osgibooter-0.21.0.jar
Downloading from tycho: https://oss.sonatype.org/content/repositories/public/org/eclipse/tycho/org.eclipse.tycho.surefire.junit4/0.21.0/org.eclipse.tycho.surefire.junit4-0.21.0.jar
Downloading from tycho: https://oss.sonatype.org/content/repositories/public/org/eclipse/tycho/org.eclipse.tycho.surefire.junit/0.21.0/org.eclipse.tycho.surefire.junit-0.21.0.jar
Downloading from tycho: https://oss.sonatype.org/content/repositories/public/org/eclipse/tycho/org.eclipse.tycho.surefire.junit47/0.21.0/org.eclipse.tycho.surefire.junit47-0.21.0.jar
Downloading from tycho: https://oss.sonatype.org/content/repositories/public/org/apache/maven/surefire/surefire-api/2.10/surefire-api-2.10.jar
Progress (1): 3.8/25 kBProgress (2): 3.8/25 kB | 3.8/30 kBProgress (2): 7.9/25 kB | 3.8/30 kBProgress (2): 12/25 kB | 3.8/30 kB Progress (2): 16/25 kB | 3.8/30 kBProgress (2): 20/25 kB | 3.8/30 kBProgress (2): 20/25 kB | 7.9/30 kBProgress (2): 24/25 kB | 7.9/30 kBProgress (2): 25 kB | 7.9/30 kB   Progress (2): 25 kB | 12/30 kB Progress (2): 25 kB | 16/30 kBProgress (2): 25 kB | 20/30 kBProgress (2): 25 kB | 24/30 kBProgress (2): 25 kB | 28/30 kBProgress (2): 25 kB | 30 kB   Progress (3): 25 kB | 30 kB | 3.8/185 kB                                        Downloaded from tycho: https://oss.sonatype.org/content/repositories/public/org/eclipse/tycho/org.eclipse.tycho.surefire.junit4/0.21.0/org.eclipse.tycho.surefire.junit4-0.21.0.jar (30 kB at 85 kB/s)
Progress (3): 25 kB | 3.8/185 kB | 4.1/50 kBProgress (3): 25 kB | 3.8/185 kB | 7.8/50 kB                                            Downloaded from tycho: https://oss.sonatype.org/content/repositories/public/org/eclipse/tycho/org.eclipse.tycho.surefire.junit/0.21.0/org.eclipse.tycho.surefire.junit-0.21.0.jar (25 kB at 70 kB/s)
Progress (2): 3.8/185 kB | 12/50 kBProgress (2): 3.8/185 kB | 16/50 kBProgress (2): 3.8/185 kB | 20/50 kBProgress (2): 3.8/185 kB | 24/50 kBProgress (2): 3.8/185 kB | 28/50 kBProgress (2): 3.8/185 kB | 32/50 kBProgress (2): 3.8/185 kB | 37/50 kBProgress (2): 3.8/185 kB | 41/50 kBProgress (2): 3.8/185 kB | 41/50 kBProgress (2): 7.9/185 kB | 41/50 kBProgress (2): 12/185 kB | 41/50 kB Progress (2): 16/185 kB | 41/50 kBProgress (2): 20/185 kB | 41/50 kBProgress (2): 24/185 kB | 41/50 kBProgress (2): 28/185 kB | 41/50 kBProgress (2): 32/185 kB | 41/50 kBProgress (2): 37/185 kB | 41/50 kBProgress (2): 37/185 kB | 41/50 kBProgress (2): 37/185 kB | 45/50 kBProgress (2): 37/185 kB | 49/50 kBProgress (2): 37/185 kB | 50 kB   Progress (2): 41/185 kB | 50 kBProgress (2): 45/185 kB | 50 kBProgress (2): 49/185 kB | 50 kBProgress (2): 53/185 kB | 50 kBProgress (2): 57/185 kB | 50 kBProgress (2): 61/185 kB | 50 kBProgress (2): 66/185 kB | 50 kBProgress (2): 70/185 kB | 50 kBProgress (2): 74/185 kB | 50 kBProgress (2): 78/185 kB | 50 kBProgress (2): 82/185 kB | 50 kBProgress (2): 86/185 kB | 50 kBProgress (2): 90/185 kB | 50 kBProgress (2): 94/185 kB | 50 kBProgress (2): 98/185 kB | 50 kBProgress (2): 102/185 kB | 50 kBProgress (2): 106/185 kB | 50 kBProgress (2): 111/185 kB | 50 kBProgress (2): 115/185 kB | 50 kBProgress (2): 119/185 kB | 50 kBProgress (2): 123/185 kB | 50 kBProgress (2): 127/185 kB | 50 kBProgress (2): 131/185 kB | 50 kBProgress (2): 135/185 kB | 50 kB                                Downloaded from tycho: https://oss.sonatype.org/content/repositories/public/org/eclipse/tycho/org.eclipse.tycho.surefire.junit47/0.21.0/org.eclipse.tycho.surefire.junit47-0.21.0.jar (50 kB at 110 kB/s)
Progress (1): 139/185 kBProgress (1): 143/185 kBProgress (1): 147/185 kBProgress (1): 152/185 kBProgress (1): 156/185 kBProgress (1): 160/185 kBProgress (1): 164/185 kBProgress (1): 168/185 kBProgress (1): 172/185 kBProgress (1): 176/185 kBProgress (1): 180/185 kBProgress (1): 184/185 kBProgress (1): 185 kB                        Downloaded from tycho: https://oss.sonatype.org/content/repositories/public/org/eclipse/tycho/org.eclipse.tycho.surefire.osgibooter/0.21.0/org.eclipse.tycho.surefire.osgibooter-0.21.0.jar (185 kB at 351 kB/s)
Downloading from cbi-repo: https://repo.eclipse.org/content/repositories/cbi/org/apache/maven/surefire/surefire-api/2.10/surefire-api-2.10.jar
Downloading from tycho-snapshot: https://repo.eclipse.org/content/repositories/tycho-snapshots/org/apache/maven/surefire/surefire-api/2.10/surefire-api-2.10.jar
Downloading from sonatype-public-grid: https://repository.sonatype.org/content/groups/sonatype-public-grid/org/apache/maven/surefire/surefire-api/2.10/surefire-api-2.10.jar
Progress (1): 4.1/161 kBProgress (1): 7.8/161 kBProgress (1): 12/161 kB Progress (1): 16/161 kBProgress (1): 20/161 kBProgress (1): 20/161 kBProgress (1): 24/161 kBProgress (1): 28/161 kBProgress (1): 32/161 kBProgress (1): 37/161 kBProgress (1): 41/161 kBProgress (1): 45/161 kBProgress (1): 49/161 kBProgress (1): 53/161 kBProgress (1): 57/161 kBProgress (1): 61/161 kBProgress (1): 61/161 kBProgress (1): 66/161 kBProgress (1): 70/161 kBProgress (1): 74/161 kBProgress (1): 78/161 kBProgress (1): 82/161 kBProgress (1): 86/161 kBProgress (1): 88/161 kBProgress (1): 92/161 kBProgress (1): 96/161 kBProgress (1): 101/161 kBProgress (1): 105/161 kBProgress (1): 109/161 kBProgress (1): 113/161 kBProgress (1): 117/161 kBProgress (1): 121/161 kBProgress (1): 125/161 kBProgress (1): 129/161 kBProgress (1): 133/161 kBProgress (1): 137/161 kBProgress (1): 142/161 kBProgress (1): 146/161 kBProgress (1): 150/161 kBProgress (1): 154/161 kBProgress (1): 158/161 kBProgress (1): 161 kB                        Downloaded from sonatype-public-grid: https://repository.sonatype.org/content/groups/sonatype-public-grid/org/apache/maven/surefire/surefire-api/2.10/surefire-api-2.10.jar (161 kB at 1.1 MB/s)
Downloading from tycho: https://oss.sonatype.org/content/repositories/public/org/eclipse/tycho/extras/tycho-eclipserun-plugin/0.21.0/tycho-eclipserun-plugin-0.21.0.pom
Progress (1): 1.7 kB                    Downloaded from tycho: https://oss.sonatype.org/content/repositories/public/org/eclipse/tycho/extras/tycho-eclipserun-plugin/0.21.0/tycho-eclipserun-plugin-0.21.0.pom (1.7 kB at 1.7 kB/s)
Downloading from tycho: https://oss.sonatype.org/content/repositories/public/org/eclipse/tycho/extras/tycho-eclipserun-plugin/0.21.0/tycho-eclipserun-plugin-0.21.0.jar
Progress (1): 4.1/11 kBProgress (1): 7.8/11 kBProgress (1): 11 kB                       Downloaded from tycho: https://oss.sonatype.org/content/repositories/public/org/eclipse/tycho/extras/tycho-eclipserun-plugin/0.21.0/tycho-eclipserun-plugin-0.21.0.jar (11 kB at 86 kB/s)
Downloading from tycho: https://oss.sonatype.org/content/repositories/public/org/apache/maven/plugins/maven-javadoc-plugin/2.7/maven-javadoc-plugin-2.7.pom
Downloading from cbi-repo: https://repo.eclipse.org/content/repositories/cbi/org/apache/maven/plugins/maven-javadoc-plugin/2.7/maven-javadoc-plugin-2.7.pom
Downloading from tycho-snapshot: https://repo.eclipse.org/content/repositories/tycho-snapshots/org/apache/maven/plugins/maven-javadoc-plugin/2.7/maven-javadoc-plugin-2.7.pom
Downloading from sonatype-public-grid: https://repository.sonatype.org/content/groups/sonatype-public-grid/org/apache/maven/plugins/maven-javadoc-plugin/2.7/maven-javadoc-plugin-2.7.pom
Progress (1): 4.1/16 kBProgress (1): 7.9/16 kBProgress (1): 12/16 kB Progress (1): 16/16 kBProgress (1): 16 kB                      Downloaded from sonatype-public-grid: https://repository.sonatype.org/content/groups/sonatype-public-grid/org/apache/maven/plugins/maven-javadoc-plugin/2.7/maven-javadoc-plugin-2.7.pom (16 kB at 206 kB/s)
Downloading from tycho: https://oss.sonatype.org/content/repositories/public/org/apache/maven/plugins/maven-plugins/17/maven-plugins-17.pom
Downloading from cbi-repo: https://repo.eclipse.org/content/repositories/cbi/org/apache/maven/plugins/maven-plugins/17/maven-plugins-17.pom
Downloading from tycho-snapshot: https://repo.eclipse.org/content/repositories/tycho-snapshots/org/apache/maven/plugins/maven-plugins/17/maven-plugins-17.pom
Downloading from sonatype-public-grid: https://repository.sonatype.org/content/groups/sonatype-public-grid/org/apache/maven/plugins/maven-plugins/17/maven-plugins-17.pom
Progress (1): 4.1/13 kBProgress (1): 7.9/13 kBProgress (1): 12/13 kB Progress (1): 13 kB                      Downloaded from sonatype-public-grid: https://repository.sonatype.org/content/groups/sonatype-public-grid/org/apache/maven/plugins/maven-plugins/17/maven-plugins-17.pom (13 kB at 166 kB/s)
Downloading from tycho: https://oss.sonatype.org/content/repositories/public/org/apache/maven/plugins/maven-javadoc-plugin/2.7/maven-javadoc-plugin-2.7.jar
Downloading from cbi-repo: https://repo.eclipse.org/content/repositories/cbi/org/apache/maven/plugins/maven-javadoc-plugin/2.7/maven-javadoc-plugin-2.7.jar
Downloading from tycho-snapshot: https://repo.eclipse.org/content/repositories/tycho-snapshots/org/apache/maven/plugins/maven-javadoc-plugin/2.7/maven-javadoc-plugin-2.7.jar
Downloading from sonatype-public-grid: https://repository.sonatype.org/content/groups/sonatype-public-grid/org/apache/maven/plugins/maven-javadoc-plugin/2.7/maven-javadoc-plugin-2.7.jar
Progress (1): 4.1/274 kBProgress (1): 7.8/274 kBProgress (1): 7.9/274 kBProgress (1): 12/274 kB Progress (1): 16/274 kBProgress (1): 20/274 kBProgress (1): 24/274 kBProgress (1): 28/274 kBProgress (1): 32/274 kBProgress (1): 37/274 kBProgress (1): 41/274 kBProgress (1): 45/274 kBProgress (1): 49/274 kBProgress (1): 53/274 kBProgress (1): 57/274 kBProgress (1): 61/274 kBProgress (1): 61/274 kBProgress (1): 66/274 kBProgress (1): 70/274 kBProgress (1): 74/274 kBProgress (1): 78/274 kBProgress (1): 82/274 kBProgress (1): 86/274 kBProgress (1): 88/274 kBProgress (1): 92/274 kBProgress (1): 96/274 kBProgress (1): 101/274 kBProgress (1): 105/274 kBProgress (1): 109/274 kBProgress (1): 113/274 kBProgress (1): 117/274 kBProgress (1): 121/274 kBProgress (1): 125/274 kBProgress (1): 129/274 kBProgress (1): 133/274 kBProgress (1): 137/274 kBProgress (1): 142/274 kBProgress (1): 146/274 kBProgress (1): 150/274 kBProgress (1): 154/274 kBProgress (1): 158/274 kBProgress (1): 162/274 kBProgress (1): 166/274 kBProgress (1): 170/274 kBProgress (1): 174/274 kBProgress (1): 178/274 kBProgress (1): 182/274 kBProgress (1): 187/274 kBProgress (1): 191/274 kBProgress (1): 195/274 kBProgress (1): 199/274 kBProgress (1): 203/274 kBProgress (1): 207/274 kBProgress (1): 211/274 kBProgress (1): 215/274 kBProgress (1): 219/274 kBProgress (1): 223/274 kBProgress (1): 228/274 kBProgress (1): 232/274 kBProgress (1): 236/274 kBProgress (1): 240/274 kBProgress (1): 244/274 kBProgress (1): 248/274 kBProgress (1): 252/274 kBProgress (1): 256/274 kBProgress (1): 260/274 kBProgress (1): 264/274 kBProgress (1): 269/274 kBProgress (1): 273/274 kBProgress (1): 274 kB                        Downloaded from sonatype-public-grid: https://repository.sonatype.org/content/groups/sonatype-public-grid/org/apache/maven/plugins/maven-javadoc-plugin/2.7/maven-javadoc-plugin-2.7.jar (274 kB at 2.2 MB/s)
[INFO] Computing target platform for MavenProject: org.eclipse.webtools.releng:org.eclipse.wtp.releng.versionchecker:1.0.1-SNAPSHOT @ /jobs/genie.webtools/WTP-R3_9_x_Maintenance/workspace/webtools.releng/org.eclipse.wtp.releng.versionchecker/pom.xml
[INFO] Adding repository http://download.eclipse.org/webtools/downloads/drops/R3.9.5/R-3.9.5-20180409100740/repository
[INFO] Fetching content.jar from http://download.eclipse.org/webtools/downloads/drops/R3.9.5/R-3.9.5-20180409100740/repository/ (0B of 250.32kB at 0B/s)
[INFO] Adding repository http://download.eclipse.org/webtools/downloads/drops/R3.9.5/R-3.9.5-20180409100740/repositoryunittests
[INFO] Fetching content.jar from http://download.eclipse.org/webtools/downloads/drops/R3.9.5/R-3.9.5-20180409100740/repositoryunittests/ (0B of 48.6kB at 0B/s)
[INFO] Fetching p2.index from http://download.eclipse.org/cbi/updates/license/ (0B at 0B/s)
[INFO] Adding repository http://download.eclipse.org/cbi/updates/license
[INFO] Fetching compositeContent.jar from http://download.eclipse.org/cbi/updates/license/ (0B of 430B at 0B/s)
[INFO] Fetching content.jar from http://download.eclipse.org/cbi/updates/license/1.0.0.v20131003-1638/ (0B of 3.87kB at 0B/s)
[INFO] Fetching content.jar from http://download.eclipse.org/cbi/updates/license/1.0.1.v20140414-1359/ (0B of 3.83kB at 0B/s)
[INFO] Fetching p2.index from http://download.eclipse.org/cbi/updates/license/2.0.0.v20180130-0820/ (0B at 0B/s)
[INFO] Fetching content.jar from http://download.eclipse.org/cbi/updates/license/2.0.0.v20180130-0820/ (0B of 3.84kB at 0B/s)
[INFO] Fetching p2.index from http://download.eclipse.org/cbi/updates/license/2.0.1.v20180423-1114/ (0B at 0B/s)
[INFO] Fetching content.jar from http://download.eclipse.org/cbi/updates/license/2.0.1.v20180423-1114/ (0B of 3.85kB at 0B/s)
[INFO] Adding repository http://download.eclipse.org/eclipse/updates/4.7-M-builds
[ERROR] Internal error: java.lang.RuntimeException: Failed to load p2 repository with ID 'platform' from location http://download.eclipse.org/eclipse/updates/4.7-M-builds/: No repository found at http://download.eclipse.org/eclipse/updates/4.7-M-builds. -> [Help 1]
org.apache.maven.InternalErrorException: Internal error: java.lang.RuntimeException: Failed to load p2 repository with ID 'platform' from location http://download.eclipse.org/eclipse/updates/4.7-M-builds/
    at org.apache.maven.DefaultMaven.execute (DefaultMaven.java:122)
    at org.apache.maven.cli.MavenCli.execute (MavenCli.java:955)
    at org.apache.maven.cli.MavenCli.doMain (MavenCli.java:290)
    at org.apache.maven.cli.MavenCli.main (MavenCli.java:194)
    at sun.reflect.NativeMethodAccessorImpl.invoke0 (Native Method)
    at sun.reflect.NativeMethodAccessorImpl.invoke (NativeMethodAccessorImpl.java:62)
    at sun.reflect.DelegatingMethodAccessorImpl.invoke (DelegatingMethodAccessorImpl.java:43)
    at java.lang.reflect.Method.invoke (Method.java:498)
    at org.codehaus.plexus.classworlds.launcher.Launcher.launchEnhanced (Launcher.java:289)
    at org.codehaus.plexus.classworlds.launcher.Launcher.launch (Launcher.java:229)
    at org.codehaus.plexus.classworlds.launcher.Launcher.mainWithExitCode (Launcher.java:415)
    at org.codehaus.plexus.classworlds.launcher.Launcher.main (Launcher.java:356)
Caused by: java.lang.RuntimeException: Failed to load p2 repository with ID 'platform' from location http://download.eclipse.org/eclipse/updates/4.7-M-builds/
    at org.eclipse.tycho.p2.target.TargetPlatformFactoryImpl.loadMetadataRepository (TargetPlatformFactoryImpl.java:301)
    at org.eclipse.tycho.p2.target.TargetPlatformFactoryImpl.gatherExternalInstallableUnits (TargetPlatformFactoryImpl.java:269)
    at org.eclipse.tycho.p2.target.TargetPlatformFactoryImpl.createTargetPlatform (TargetPlatformFactoryImpl.java:174)
    at org.eclipse.tycho.p2.target.TargetPlatformFactoryImpl.createTargetPlatform (TargetPlatformFactoryImpl.java:126)
    at org.eclipse.tycho.p2.target.TargetPlatformFactoryImpl.createTargetPlatform (TargetPlatformFactoryImpl.java:1)
    at org.eclipse.tycho.p2.manager.ReactorRepositoryManagerImpl.computePreliminaryTargetPlatform (ReactorRepositoryManagerImpl.java:82)
    at org.eclipse.tycho.p2.resolver.P2DependencyResolver.computePreliminaryTargetPlatform (P2DependencyResolver.java:215)
    at org.eclipse.tycho.core.resolver.DefaultTychoResolver.resolveProject (DefaultTychoResolver.java:99)
    at org.eclipse.tycho.core.maven.TychoMavenLifecycleParticipant.afterProjectsRead (TychoMavenLifecycleParticipant.java:75)
    at org.apache.maven.DefaultMaven.doExecute (DefaultMaven.java:267)
    at org.apache.maven.DefaultMaven.doExecute (DefaultMaven.java:194)
    at org.apache.maven.DefaultMaven.execute (DefaultMaven.java:107)
    at org.apache.maven.cli.MavenCli.execute (MavenCli.java:955)
    at org.apache.maven.cli.MavenCli.doMain (MavenCli.java:290)
    at org.apache.maven.cli.MavenCli.main (MavenCli.java:194)
    at sun.reflect.NativeMethodAccessorImpl.invoke0 (Native Method)
    at sun.reflect.NativeMethodAccessorImpl.invoke (NativeMethodAccessorImpl.java:62)
    at sun.reflect.DelegatingMethodAccessorImpl.invoke (DelegatingMethodAccessorImpl.java:43)
    at java.lang.reflect.Method.invoke (Method.java:498)
    at org.codehaus.plexus.classworlds.launcher.Launcher.launchEnhanced (Launcher.java:289)
    at org.codehaus.plexus.classworlds.launcher.Launcher.launch (Launcher.java:229)
    at org.codehaus.plexus.classworlds.launcher.Launcher.mainWithExitCode (Launcher.java:415)
    at org.codehaus.plexus.classworlds.launcher.Launcher.main (Launcher.java:356)
Caused by: org.eclipse.equinox.p2.core.ProvisionException: No repository found at http://download.eclipse.org/eclipse/updates/4.7-M-builds.
    at org.eclipse.equinox.internal.p2.repository.helpers.AbstractRepositoryManager.fail (AbstractRepositoryManager.java:395)
    at org.eclipse.equinox.internal.p2.repository.helpers.AbstractRepositoryManager.loadRepository (AbstractRepositoryManager.java:692)
    at org.eclipse.equinox.internal.p2.metadata.repository.MetadataRepositoryManager.loadRepository (MetadataRepositoryManager.java:96)
    at org.eclipse.tycho.p2.remote.RemoteMetadataRepositoryManager.loadRepository (RemoteMetadataRepositoryManager.java:59)
    at org.eclipse.tycho.p2.remote.RemoteMetadataRepositoryManager.loadRepository (RemoteMetadataRepositoryManager.java:52)
    at org.eclipse.tycho.p2.target.TargetPlatformFactoryImpl.loadMetadataRepository (TargetPlatformFactoryImpl.java:297)
    at org.eclipse.tycho.p2.target.TargetPlatformFactoryImpl.gatherExternalInstallableUnits (TargetPlatformFactoryImpl.java:269)
    at org.eclipse.tycho.p2.target.TargetPlatformFactoryImpl.createTargetPlatform (TargetPlatformFactoryImpl.java:174)
    at org.eclipse.tycho.p2.target.TargetPlatformFactoryImpl.createTargetPlatform (TargetPlatformFactoryImpl.java:126)
    at org.eclipse.tycho.p2.target.TargetPlatformFactoryImpl.createTargetPlatform (TargetPlatformFactoryImpl.java:1)
    at org.eclipse.tycho.p2.manager.ReactorRepositoryManagerImpl.computePreliminaryTargetPlatform (ReactorRepositoryManagerImpl.java:82)
    at org.eclipse.tycho.p2.resolver.P2DependencyResolver.computePreliminaryTargetPlatform (P2DependencyResolver.java:215)
    at org.eclipse.tycho.core.resolver.DefaultTychoResolver.resolveProject (DefaultTychoResolver.java:99)
    at org.eclipse.tycho.core.maven.TychoMavenLifecycleParticipant.afterProjectsRead (TychoMavenLifecycleParticipant.java:75)
    at org.apache.maven.DefaultMaven.doExecute (DefaultMaven.java:267)
    at org.apache.maven.DefaultMaven.doExecute (DefaultMaven.java:194)
    at org.apache.maven.DefaultMaven.execute (DefaultMaven.java:107)
    at org.apache.maven.cli.MavenCli.execute (MavenCli.java:955)
    at org.apache.maven.cli.MavenCli.doMain (MavenCli.java:290)
    at org.apache.maven.cli.MavenCli.main (MavenCli.java:194)
    at sun.reflect.NativeMethodAccessorImpl.invoke0 (Native Method)
    at sun.reflect.NativeMethodAccessorImpl.invoke (NativeMethodAccessorImpl.java:62)
    at sun.reflect.DelegatingMethodAccessorImpl.invoke (DelegatingMethodAccessorImpl.java:43)
    at java.lang.reflect.Method.invoke (Method.java:498)
    at org.codehaus.plexus.classworlds.launcher.Launcher.launchEnhanced (Launcher.java:289)
    at org.codehaus.plexus.classworlds.launcher.Launcher.launch (Launcher.java:229)
    at org.codehaus.plexus.classworlds.launcher.Launcher.mainWithExitCode (Launcher.java:415)
    at org.codehaus.plexus.classworlds.launcher.Launcher.main (Launcher.java:356)
[ERROR] 
[ERROR] To see the full stack trace of the errors, re-run Maven with the -e switch.
[ERROR] Re-run Maven using the -X switch to enable full debug logging.
[ERROR] 
[ERROR] For more information about the errors and possible solutions, please read the following articles:
[ERROR] [Help 1] http://cwiki.apache.org/confluence/display/MAVEN/InternalErrorException
Build step 'Invoke top-level Maven targets' marked build as failure
Terminating xvnc.
Not sending mail to unregistered user nickboldt@xxxxxxxxx