[Date Prev][Date Next][Thread Prev][Thread Next][Date Index][Thread Index] [List Home]
[wtp-releng] Build failed in Jenkins: WTP-R3_9_x_Maintenance #332

See <https://ci.eclipse.org/webtools/job/WTP-R3_9_x_Maintenance/332/display/redirect>

------------------------------------------
[...truncated 284.65 KB...]
Progress (1): 2.1 kB                    Downloaded from sonatype-public-grid: https://repository.sonatype.org/content/groups/sonatype-public-grid/commons-cli/commons-cli/1.0/commons-cli-1.0.pom (2.1 kB at 28 kB/s)
Downloading from tycho: https://oss.sonatype.org/content/repositories/public/org/apache/maven/maven-plugin-api/2.0.6/maven-plugin-api-2.0.6.pom
Downloading from cbi-repo: https://repo.eclipse.org/content/repositories/cbi/org/apache/maven/maven-plugin-api/2.0.6/maven-plugin-api-2.0.6.pom
Downloading from tycho-snapshot: https://repo.eclipse.org/content/repositories/tycho-snapshots/org/apache/maven/maven-plugin-api/2.0.6/maven-plugin-api-2.0.6.pom
Downloading from sonatype-public-grid: https://repository.sonatype.org/content/groups/sonatype-public-grid/org/apache/maven/maven-plugin-api/2.0.6/maven-plugin-api-2.0.6.pom
Progress (1): 1.5 kB                    Downloaded from sonatype-public-grid: https://repository.sonatype.org/content/groups/sonatype-public-grid/org/apache/maven/maven-plugin-api/2.0.6/maven-plugin-api-2.0.6.pom (1.5 kB at 18 kB/s)
Downloading from tycho: https://oss.sonatype.org/content/repositories/public/org/apache/maven/maven-plugin-descriptor/2.0.6/maven-plugin-descriptor-2.0.6.pom
Downloading from cbi-repo: https://repo.eclipse.org/content/repositories/cbi/org/apache/maven/maven-plugin-descriptor/2.0.6/maven-plugin-descriptor-2.0.6.pom
Downloading from tycho-snapshot: https://repo.eclipse.org/content/repositories/tycho-snapshots/org/apache/maven/maven-plugin-descriptor/2.0.6/maven-plugin-descriptor-2.0.6.pom
Downloading from sonatype-public-grid: https://repository.sonatype.org/content/groups/sonatype-public-grid/org/apache/maven/maven-plugin-descriptor/2.0.6/maven-plugin-descriptor-2.0.6.pom
Progress (1): 2.0 kB                    Downloaded from sonatype-public-grid: https://repository.sonatype.org/content/groups/sonatype-public-grid/org/apache/maven/maven-plugin-descriptor/2.0.6/maven-plugin-descriptor-2.0.6.pom (2.0 kB at 26 kB/s)
Downloading from tycho: https://oss.sonatype.org/content/repositories/public/org/codehaus/plexus/plexus-interactivity-api/1.0-alpha-4/plexus-interactivity-api-1.0-alpha-4.pom
Downloading from cbi-repo: https://repo.eclipse.org/content/repositories/cbi/org/codehaus/plexus/plexus-interactivity-api/1.0-alpha-4/plexus-interactivity-api-1.0-alpha-4.pom
Downloading from tycho-snapshot: https://repo.eclipse.org/content/repositories/tycho-snapshots/org/codehaus/plexus/plexus-interactivity-api/1.0-alpha-4/plexus-interactivity-api-1.0-alpha-4.pom
Downloading from sonatype-public-grid: https://repository.sonatype.org/content/groups/sonatype-public-grid/org/codehaus/plexus/plexus-interactivity-api/1.0-alpha-4/plexus-interactivity-api-1.0-alpha-4.pom
Progress (1): 4.1/7.1 kBProgress (1): 7.1 kB                        Downloaded from sonatype-public-grid: https://repository.sonatype.org/content/groups/sonatype-public-grid/org/codehaus/plexus/plexus-interactivity-api/1.0-alpha-4/plexus-interactivity-api-1.0-alpha-4.pom (7.1 kB at 92 kB/s)
Downloading from tycho: https://oss.sonatype.org/content/repositories/public/org/apache/maven/maven-artifact-manager/2.0.6/maven-artifact-manager-2.0.6.pom
Downloading from cbi-repo: https://repo.eclipse.org/content/repositories/cbi/org/apache/maven/maven-artifact-manager/2.0.6/maven-artifact-manager-2.0.6.pom
Downloading from tycho-snapshot: https://repo.eclipse.org/content/repositories/tycho-snapshots/org/apache/maven/maven-artifact-manager/2.0.6/maven-artifact-manager-2.0.6.pom
Downloading from sonatype-public-grid: https://repository.sonatype.org/content/groups/sonatype-public-grid/org/apache/maven/maven-artifact-manager/2.0.6/maven-artifact-manager-2.0.6.pom
Progress (1): 2.6 kB                    Downloaded from sonatype-public-grid: https://repository.sonatype.org/content/groups/sonatype-public-grid/org/apache/maven/maven-artifact-manager/2.0.6/maven-artifact-manager-2.0.6.pom (2.6 kB at 35 kB/s)
Downloading from tycho: https://oss.sonatype.org/content/repositories/public/org/apache/maven/maven-monitor/2.0.6/maven-monitor-2.0.6.pom
Downloading from cbi-repo: https://repo.eclipse.org/content/repositories/cbi/org/apache/maven/maven-monitor/2.0.6/maven-monitor-2.0.6.pom
Downloading from tycho-snapshot: https://repo.eclipse.org/content/repositories/tycho-snapshots/org/apache/maven/maven-monitor/2.0.6/maven-monitor-2.0.6.pom
Downloading from sonatype-public-grid: https://repository.sonatype.org/content/groups/sonatype-public-grid/org/apache/maven/maven-monitor/2.0.6/maven-monitor-2.0.6.pom
Progress (1): 1.3 kB                    Downloaded from sonatype-public-grid: https://repository.sonatype.org/content/groups/sonatype-public-grid/org/apache/maven/maven-monitor/2.0.6/maven-monitor-2.0.6.pom (1.3 kB at 16 kB/s)
Downloading from tycho: https://oss.sonatype.org/content/repositories/public/classworlds/classworlds/1.1/classworlds-1.1.pom
Downloading from cbi-repo: https://repo.eclipse.org/content/repositories/cbi/classworlds/classworlds/1.1/classworlds-1.1.pom
Downloading from tycho-snapshot: https://repo.eclipse.org/content/repositories/tycho-snapshots/classworlds/classworlds/1.1/classworlds-1.1.pom
Downloading from sonatype-public-grid: https://repository.sonatype.org/content/groups/sonatype-public-grid/classworlds/classworlds/1.1/classworlds-1.1.pom
Progress (1): 3.3 kB                    Downloaded from sonatype-public-grid: https://repository.sonatype.org/content/groups/sonatype-public-grid/classworlds/classworlds/1.1/classworlds-1.1.pom (3.3 kB at 44 kB/s)
Downloading from tycho: https://oss.sonatype.org/content/repositories/public/org/codehaus/plexus/plexus-archiver/2.1/plexus-archiver-2.1.pom
Downloading from cbi-repo: https://repo.eclipse.org/content/repositories/cbi/org/codehaus/plexus/plexus-archiver/2.1/plexus-archiver-2.1.pom
Downloading from tycho-snapshot: https://repo.eclipse.org/content/repositories/tycho-snapshots/org/codehaus/plexus/plexus-archiver/2.1/plexus-archiver-2.1.pom
Downloading from sonatype-public-grid: https://repository.sonatype.org/content/groups/sonatype-public-grid/org/codehaus/plexus/plexus-archiver/2.1/plexus-archiver-2.1.pom
Progress (1): 2.8 kB                    Downloaded from sonatype-public-grid: https://repository.sonatype.org/content/groups/sonatype-public-grid/org/codehaus/plexus/plexus-archiver/2.1/plexus-archiver-2.1.pom (2.8 kB at 34 kB/s)
Downloading from tycho: https://oss.sonatype.org/content/repositories/public/org/codehaus/plexus/plexus-io/2.0.2/plexus-io-2.0.2.pom
Downloading from cbi-repo: https://repo.eclipse.org/content/repositories/cbi/org/codehaus/plexus/plexus-io/2.0.2/plexus-io-2.0.2.pom
Downloading from tycho-snapshot: https://repo.eclipse.org/content/repositories/tycho-snapshots/org/codehaus/plexus/plexus-io/2.0.2/plexus-io-2.0.2.pom
Downloading from sonatype-public-grid: https://repository.sonatype.org/content/groups/sonatype-public-grid/org/codehaus/plexus/plexus-io/2.0.2/plexus-io-2.0.2.pom
Progress (1): 1.7 kB                    Downloaded from sonatype-public-grid: https://repository.sonatype.org/content/groups/sonatype-public-grid/org/codehaus/plexus/plexus-io/2.0.2/plexus-io-2.0.2.pom (1.7 kB at 19 kB/s)
Downloading from tycho: https://oss.sonatype.org/content/repositories/public/org/apache/maven/maven-archiver/2.4.2/maven-archiver-2.4.2.jar
Downloading from tycho: https://oss.sonatype.org/content/repositories/public/org/codehaus/plexus/plexus-archiver/2.0.1/plexus-archiver-2.0.1.jar
Downloading from tycho: https://oss.sonatype.org/content/repositories/public/org/codehaus/plexus/plexus-container-default/1.0-alpha-9-stable-1/plexus-container-default-1.0-alpha-9-stable-1.jar
Downloading from tycho: https://oss.sonatype.org/content/repositories/public/classworlds/classworlds/1.1-alpha-2/classworlds-1.1-alpha-2.jar
Downloading from tycho: https://oss.sonatype.org/content/repositories/public/org/codehaus/plexus/plexus-io/2.0.1/plexus-io-2.0.1.jar
Downloading from tycho: https://oss.sonatype.org/content/repositories/public/org/codehaus/plexus/plexus-utils/3.0/plexus-utils-3.0.jar
Downloading from tycho: https://oss.sonatype.org/content/repositories/public/org/codehaus/plexus/plexus-interpolation/1.13/plexus-interpolation-1.13.jar
Downloading from cbi-repo: https://repo.eclipse.org/content/repositories/cbi/org/apache/maven/maven-archiver/2.4.2/maven-archiver-2.4.2.jar
Downloading from cbi-repo: https://repo.eclipse.org/content/repositories/cbi/org/codehaus/plexus/plexus-archiver/2.0.1/plexus-archiver-2.0.1.jar
Downloading from cbi-repo: https://repo.eclipse.org/content/repositories/cbi/org/codehaus/plexus/plexus-container-default/1.0-alpha-9-stable-1/plexus-container-default-1.0-alpha-9-stable-1.jar
Downloading from cbi-repo: https://repo.eclipse.org/content/repositories/cbi/classworlds/classworlds/1.1-alpha-2/classworlds-1.1-alpha-2.jar
Downloading from cbi-repo: https://repo.eclipse.org/content/repositories/cbi/org/codehaus/plexus/plexus-io/2.0.1/plexus-io-2.0.1.jar
Downloading from cbi-repo: https://repo.eclipse.org/content/repositories/cbi/org/codehaus/plexus/plexus-utils/3.0/plexus-utils-3.0.jar
Downloading from cbi-repo: https://repo.eclipse.org/content/repositories/cbi/org/codehaus/plexus/plexus-interpolation/1.13/plexus-interpolation-1.13.jar
Downloading from tycho-snapshot: https://repo.eclipse.org/content/repositories/tycho-snapshots/org/apache/maven/maven-archiver/2.4.2/maven-archiver-2.4.2.jar
Downloading from tycho-snapshot: https://repo.eclipse.org/content/repositories/tycho-snapshots/org/codehaus/plexus/plexus-archiver/2.0.1/plexus-archiver-2.0.1.jar
Downloading from tycho-snapshot: https://repo.eclipse.org/content/repositories/tycho-snapshots/org/codehaus/plexus/plexus-container-default/1.0-alpha-9-stable-1/plexus-container-default-1.0-alpha-9-stable-1.jar
Downloading from tycho-snapshot: https://repo.eclipse.org/content/repositories/tycho-snapshots/classworlds/classworlds/1.1-alpha-2/classworlds-1.1-alpha-2.jar
Downloading from tycho-snapshot: https://repo.eclipse.org/content/repositories/tycho-snapshots/org/codehaus/plexus/plexus-io/2.0.1/plexus-io-2.0.1.jar
Downloading from tycho-snapshot: https://repo.eclipse.org/content/repositories/tycho-snapshots/org/codehaus/plexus/plexus-utils/3.0/plexus-utils-3.0.jar
Downloading from tycho-snapshot: https://repo.eclipse.org/content/repositories/tycho-snapshots/org/codehaus/plexus/plexus-interpolation/1.13/plexus-interpolation-1.13.jar
Downloading from sonatype-public-grid: https://repository.sonatype.org/content/groups/sonatype-public-grid/org/apache/maven/maven-archiver/2.4.2/maven-archiver-2.4.2.jar
Downloading from sonatype-public-grid: https://repository.sonatype.org/content/groups/sonatype-public-grid/org/codehaus/plexus/plexus-archiver/2.0.1/plexus-archiver-2.0.1.jar
Downloading from sonatype-public-grid: https://repository.sonatype.org/content/groups/sonatype-public-grid/org/codehaus/plexus/plexus-container-default/1.0-alpha-9-stable-1/plexus-container-default-1.0-alpha-9-stable-1.jar
Downloading from sonatype-public-grid: https://repository.sonatype.org/content/groups/sonatype-public-grid/classworlds/classworlds/1.1-alpha-2/classworlds-1.1-alpha-2.jar
Downloading from sonatype-public-grid: https://repository.sonatype.org/content/groups/sonatype-public-grid/org/codehaus/plexus/plexus-io/2.0.1/plexus-io-2.0.1.jar
Progress (1): 4.1/20 kBProgress (2): 4.1/20 kB | 4.1/38 kBProgress (2): 7.8/20 kB | 4.1/38 kBProgress (2): 7.8/20 kB | 7.8/38 kBProgress (2): 12/20 kB | 7.8/38 kB Progress (2): 12/20 kB | 12/38 kB Progress (2): 16/20 kB | 12/38 kBProgress (2): 16/20 kB | 16/38 kBProgress (2): 17/20 kB | 16/38 kBProgress (3): 17/20 kB | 16/38 kB | 4.1/180 kBProgress (3): 20 kB | 16/38 kB | 4.1/180 kB   Progress (3): 20 kB | 16/38 kB | 7.8/180 kBProgress (3): 20 kB | 16/38 kB | 12/180 kB Progress (3): 20 kB | 16/38 kB | 16/180 kBProgress (3): 20 kB | 16/38 kB | 20/180 kBProgress (3): 20 kB | 20/38 kB | 20/180 kBProgress (3): 20 kB | 20/38 kB | 20/180 kBProgress (3): 20 kB | 24/38 kB | 20/180 kBProgress (3): 20 kB | 28/38 kB | 20/180 kBProgress (3): 20 kB | 32/38 kB | 20/180 kBProgress (3): 20 kB | 32/38 kB | 20/180 kBProgress (3): 20 kB | 37/38 kB | 20/180 kBProgress (3): 20 kB | 38 kB | 20/180 kB   Progress (3): 20 kB | 38 kB | 24/180 kBProgress (3): 20 kB | 38 kB | 28/180 kBProgress (3): 20 kB | 38 kB | 32/180 kBProgress (3): 20 kB | 38 kB | 37/180 kBProgress (4): 20 kB | 38 kB | 37/180 kB | 4.1/58 kBProgress (4): 20 kB | 38 kB | 37/180 kB | 7.8/58 kBProgress (4): 20 kB | 38 kB | 37/180 kB | 7.9/58 kBProgress (4): 20 kB | 38 kB | 41/180 kB | 7.9/58 kBProgress (4): 20 kB | 38 kB | 45/180 kB | 7.9/58 kBProgress (4): 20 kB | 38 kB | 49/180 kB | 7.9/58 kBProgress (4): 20 kB | 38 kB | 53/180 kB | 7.9/58 kBProgress (4): 20 kB | 38 kB | 53/180 kB | 12/58 kB Progress (4): 20 kB | 38 kB | 54/180 kB | 12/58 kBProgress (4): 20 kB | 38 kB | 54/180 kB | 16/58 kBProgress (4): 20 kB | 38 kB | 54/180 kB | 20/58 kBProgress (4): 20 kB | 38 kB | 54/180 kB | 24/58 kBProgress (4): 20 kB | 38 kB | 54/180 kB | 26/58 kBProgress (4): 20 kB | 38 kB | 58/180 kB | 26/58 kBProgress (4): 20 kB | 38 kB | 62/180 kB | 26/58 kBProgress (4): 20 kB | 38 kB | 66/180 kB | 26/58 kBProgress (4): 20 kB | 38 kB | 70/180 kB | 26/58 kBProgress (4): 20 kB | 38 kB | 70/180 kB | 30/58 kBProgress (4): 20 kB | 38 kB | 70/180 kB | 34/58 kBProgress (4): 20 kB | 38 kB | 70/180 kB | 38/58 kBProgress (4): 20 kB | 38 kB | 70/180 kB | 42/58 kBProgress (4): 20 kB | 38 kB | 70/180 kB | 44/58 kBProgress (4): 20 kB | 38 kB | 74/180 kB | 44/58 kBProgress (4): 20 kB | 38 kB | 79/180 kB | 44/58 kBProgress (4): 20 kB | 38 kB | 81/180 kB | 44/58 kBProgress (4): 20 kB | 38 kB | 81/180 kB | 48/58 kBProgress (4): 20 kB | 38 kB | 81/180 kB | 52/58 kBProgress (4): 20 kB | 38 kB | 81/180 kB | 56/58 kBProgress (4): 20 kB | 38 kB | 81/180 kB | 58 kB   Progress (4): 20 kB | 38 kB | 85/180 kB | 58 kBProgress (4): 20 kB | 38 kB | 89/180 kB | 58 kBProgress (4): 20 kB | 38 kB | 93/180 kB | 58 kBProgress (4): 20 kB | 38 kB | 97/180 kB | 58 kBProgress (4): 20 kB | 38 kB | 101/180 kB | 58 kBProgress (4): 20 kB | 38 kB | 105/180 kB | 58 kBProgress (4): 20 kB | 38 kB | 110/180 kB | 58 kBProgress (4): 20 kB | 38 kB | 114/180 kB | 58 kBProgress (4): 20 kB | 38 kB | 118/180 kB | 58 kBProgress (4): 20 kB | 38 kB | 122/180 kB | 58 kBProgress (4): 20 kB | 38 kB | 126/180 kB | 58 kBProgress (4): 20 kB | 38 kB | 130/180 kB | 58 kBProgress (4): 20 kB | 38 kB | 134/180 kB | 58 kBProgress (4): 20 kB | 38 kB | 138/180 kB | 58 kBProgress (4): 20 kB | 38 kB | 142/180 kB | 58 kBProgress (4): 20 kB | 38 kB | 143/180 kB | 58 kBProgress (5): 20 kB | 38 kB | 143/180 kB | 58 kB | 4.1/194 kBProgress (5): 20 kB | 38 kB | 143/180 kB | 58 kB | 7.8/194 kBProgress (5): 20 kB | 38 kB | 143/180 kB | 58 kB | 7.9/194 kBProgress (5): 20 kB | 38 kB | 148/180 kB | 58 kB | 7.9/194 kBProgress (5): 20 kB | 38 kB | 152/180 kB | 58 kB | 7.9/194 kBProgress (5): 20 kB | 38 kB | 156/180 kB | 58 kB | 7.9/194 kBProgress (5): 20 kB | 38 kB | 160/180 kB | 58 kB | 7.9/194 kBProgress (5): 20 kB | 38 kB | 160/180 kB | 58 kB | 12/194 kB Progress (5): 20 kB | 38 kB | 160/180 kB | 58 kB | 16/194 kBProgress (5): 20 kB | 38 kB | 160/180 kB | 58 kB | 20/194 kBProgress (5): 20 kB | 38 kB | 164/180 kB | 58 kB | 20/194 kBProgress (5): 20 kB | 38 kB | 168/180 kB | 58 kB | 20/194 kBProgress (5): 20 kB | 38 kB | 170/180 kB | 58 kB | 20/194 kBProgress (5): 20 kB | 38 kB | 170/180 kB | 58 kB | 24/194 kBProgress (5): 20 kB | 38 kB | 174/180 kB | 58 kB | 24/194 kBProgress (5): 20 kB | 38 kB | 174/180 kB | 58 kB | 28/194 kBProgress (5): 20 kB | 38 kB | 179/180 kB | 58 kB | 28/194 kBProgress (5): 20 kB | 38 kB | 179/180 kB | 58 kB | 32/194 kBProgress (5): 20 kB | 38 kB | 180 kB | 58 kB | 32/194 kB    Progress (5): 20 kB | 38 kB | 180 kB | 58 kB | 37/194 kBProgress (5): 20 kB | 38 kB | 180 kB | 58 kB | 41/194 kBProgress (5): 20 kB | 38 kB | 180 kB | 58 kB | 45/194 kBProgress (5): 20 kB | 38 kB | 180 kB | 58 kB | 49/194 kBProgress (5): 20 kB | 38 kB | 180 kB | 58 kB | 53/194 kBProgress (5): 20 kB | 38 kB | 180 kB | 58 kB | 57/194 kBProgress (5): 20 kB | 38 kB | 180 kB | 58 kB | 61/194 kBProgress (5): 20 kB | 38 kB | 180 kB | 58 kB | 65/194 kBProgress (5): 20 kB | 38 kB | 180 kB | 58 kB | 69/194 kBProgress (5): 20 kB | 38 kB | 180 kB | 58 kB | 70/194 kBProgress (5): 20 kB | 38 kB | 180 kB | 58 kB | 74/194 kBProgress (5): 20 kB | 38 kB | 180 kB | 58 kB | 78/194 kBProgress (5): 20 kB | 38 kB | 180 kB | 58 kB | 82/194 kBProgress (5): 20 kB | 38 kB | 180 kB | 58 kB | 86/194 kBProgress (5): 20 kB | 38 kB | 180 kB | 58 kB | 90/194 kBProgress (5): 20 kB | 38 kB | 180 kB | 58 kB | 94/194 kBProgress (5): 20 kB | 38 kB | 180 kB | 58 kB | 96/194 kBProgress (5): 20 kB | 38 kB | 180 kB | 58 kB | 101/194 kBProgress (5): 20 kB | 38 kB | 180 kB | 58 kB | 105/194 kBProgress (5): 20 kB | 38 kB | 180 kB | 58 kB | 109/194 kBProgress (5): 20 kB | 38 kB | 180 kB | 58 kB | 113/194 kBProgress (5): 20 kB | 38 kB | 180 kB | 58 kB | 117/194 kBProgress (5): 20 kB | 38 kB | 180 kB | 58 kB | 121/194 kBProgress (5): 20 kB | 38 kB | 180 kB | 58 kB | 125/194 kBProgress (5): 20 kB | 38 kB | 180 kB | 58 kB | 129/194 kBProgress (5): 20 kB | 38 kB | 180 kB | 58 kB | 133/194 kBProgress (5): 20 kB | 38 kB | 180 kB | 58 kB | 137/194 kBProgress (5): 20 kB | 38 kB | 180 kB | 58 kB | 142/194 kBProgress (5): 20 kB | 38 kB | 180 kB | 58 kB | 146/194 kBProgress (5): 20 kB | 38 kB | 180 kB | 58 kB | 150/194 kBProgress (5): 20 kB | 38 kB | 180 kB | 58 kB | 154/194 kBProgress (5): 20 kB | 38 kB | 180 kB | 58 kB | 158/194 kBProgress (5): 20 kB | 38 kB | 180 kB | 58 kB | 162/194 kBProgress (5): 20 kB | 38 kB | 180 kB | 58 kB | 166/194 kBProgress (5): 20 kB | 38 kB | 180 kB | 58 kB | 170/194 kBProgress (5): 20 kB | 38 kB | 180 kB | 58 kB | 174/194 kBProgress (5): 20 kB | 38 kB | 180 kB | 58 kB | 178/194 kBProgress (5): 20 kB | 38 kB | 180 kB | 58 kB | 182/194 kBProgress (5): 20 kB | 38 kB | 180 kB | 58 kB | 187/194 kBProgress (5): 20 kB | 38 kB | 180 kB | 58 kB | 191/194 kBProgress (5): 20 kB | 38 kB | 180 kB | 58 kB | 194 kB                                                         Downloaded from sonatype-public-grid: https://repository.sonatype.org/content/groups/sonatype-public-grid/classworlds/classworlds/1.1-alpha-2/classworlds-1.1-alpha-2.jar (38 kB at 447 kB/s)
Downloading from sonatype-public-grid: https://repository.sonatype.org/content/groups/sonatype-public-grid/org/codehaus/plexus/plexus-utils/3.0/plexus-utils-3.0.jar
Downloaded from sonatype-public-grid: https://repository.sonatype.org/content/groups/sonatype-public-grid/org/codehaus/plexus/plexus-io/2.0.1/plexus-io-2.0.1.jar (58 kB at 660 kB/s)
Downloading from sonatype-public-grid: https://repository.sonatype.org/content/groups/sonatype-public-grid/org/codehaus/plexus/plexus-interpolation/1.13/plexus-interpolation-1.13.jar
Downloaded from sonatype-public-grid: https://repository.sonatype.org/content/groups/sonatype-public-grid/org/apache/maven/maven-archiver/2.4.2/maven-archiver-2.4.2.jar (20 kB at 215 kB/s)
Downloaded from sonatype-public-grid: https://repository.sonatype.org/content/groups/sonatype-public-grid/org/codehaus/plexus/plexus-archiver/2.0.1/plexus-archiver-2.0.1.jar (180 kB at 1.9 MB/s)
Downloaded from sonatype-public-grid: https://repository.sonatype.org/content/groups/sonatype-public-grid/org/codehaus/plexus/plexus-container-default/1.0-alpha-9-stable-1/plexus-container-default-1.0-alpha-9-stable-1.jar (194 kB at 1.8 MB/s)
Progress (1): 4.1/226 kBProgress (1): 7.8/226 kBProgress (1): 7.9/226 kBProgress (1): 12/226 kB Progress (1): 16/226 kBProgress (1): 20/226 kBProgress (1): 24/226 kBProgress (1): 28/226 kBProgress (1): 32/226 kBProgress (1): 37/226 kBProgress (2): 37/226 kB | 4.1/61 kBProgress (2): 37/226 kB | 7.8/61 kBProgress (2): 37/226 kB | 7.9/61 kBProgress (2): 41/226 kB | 7.9/61 kBProgress (2): 45/226 kB | 7.9/61 kBProgress (2): 49/226 kB | 7.9/61 kBProgress (2): 53/226 kB | 7.9/61 kBProgress (2): 53/226 kB | 12/61 kB Progress (2): 53/226 kB | 16/61 kBProgress (2): 57/226 kB | 16/61 kBProgress (2): 57/226 kB | 20/61 kBProgress (2): 61/226 kB | 20/61 kBProgress (2): 61/226 kB | 24/61 kBProgress (2): 63/226 kB | 24/61 kBProgress (2): 67/226 kB | 24/61 kBProgress (2): 72/226 kB | 24/61 kBProgress (2): 72/226 kB | 28/61 kBProgress (2): 76/226 kB | 28/61 kBProgress (2): 76/226 kB | 32/61 kBProgress (2): 80/226 kB | 32/61 kBProgress (2): 80/226 kB | 37/61 kBProgress (2): 80/226 kB | 41/61 kBProgress (2): 84/226 kB | 41/61 kBProgress (2): 88/226 kB | 41/61 kBProgress (2): 92/226 kB | 41/61 kBProgress (2): 96/226 kB | 41/61 kBProgress (2): 96/226 kB | 45/61 kBProgress (2): 96/226 kB | 49/61 kBProgress (2): 98/226 kB | 49/61 kBProgress (2): 98/226 kB | 53/61 kBProgress (2): 98/226 kB | 57/61 kBProgress (2): 102/226 kB | 57/61 kBProgress (2): 102/226 kB | 61 kB   Progress (2): 106/226 kB | 61 kBProgress (2): 111/226 kB | 61 kBProgress (2): 115/226 kB | 61 kBProgress (2): 119/226 kB | 61 kBProgress (2): 120/226 kB | 61 kBProgress (2): 124/226 kB | 61 kBProgress (2): 128/226 kB | 61 kBProgress (2): 132/226 kB | 61 kBProgress (2): 136/226 kB | 61 kBProgress (2): 137/226 kB | 61 kBProgress (2): 141/226 kB | 61 kBProgress (2): 145/226 kB | 61 kBProgress (2): 149/226 kB | 61 kBProgress (2): 153/226 kB | 61 kBProgress (2): 155/226 kB | 61 kBProgress (2): 159/226 kB | 61 kBProgress (2): 163/226 kB | 61 kBProgress (2): 167/226 kB | 61 kBProgress (2): 171/226 kB | 61 kBProgress (2): 175/226 kB | 61 kBProgress (2): 179/226 kB | 61 kBProgress (2): 181/226 kB | 61 kBProgress (2): 185/226 kB | 61 kBProgress (2): 190/226 kB | 61 kBProgress (2): 194/226 kB | 61 kBProgress (2): 198/226 kB | 61 kBProgress (2): 199/226 kB | 61 kBProgress (2): 203/226 kB | 61 kBProgress (2): 207/226 kB | 61 kBProgress (2): 212/226 kB | 61 kBProgress (2): 216/226 kB | 61 kBProgress (2): 220/226 kB | 61 kBProgress (2): 224/226 kB | 61 kBProgress (2): 226 kB | 61 kB                                Downloaded from sonatype-public-grid: https://repository.sonatype.org/content/groups/sonatype-public-grid/org/codehaus/plexus/plexus-interpolation/1.13/plexus-interpolation-1.13.jar (61 kB at 361 kB/s)
Downloaded from sonatype-public-grid: https://repository.sonatype.org/content/groups/sonatype-public-grid/org/codehaus/plexus/plexus-utils/3.0/plexus-utils-3.0.jar (226 kB at 1.1 MB/s)
Downloading from tycho: https://oss.sonatype.org/content/repositories/public/org/eclipse/tycho/tycho-surefire-plugin/0.21.0/tycho-surefire-plugin-0.21.0.pom
Progress (1): 3.2 kB                    Downloaded from tycho: https://oss.sonatype.org/content/repositories/public/org/eclipse/tycho/tycho-surefire-plugin/0.21.0/tycho-surefire-plugin-0.21.0.pom (3.2 kB at 14 kB/s)
Downloading from tycho: https://oss.sonatype.org/content/repositories/public/org/eclipse/tycho/tycho-surefire/0.21.0/tycho-surefire-0.21.0.pom
Progress (1): 2.8 kB                    Downloaded from tycho: https://oss.sonatype.org/content/repositories/public/org/eclipse/tycho/tycho-surefire/0.21.0/tycho-surefire-0.21.0.pom (2.8 kB at 22 kB/s)
Downloading from tycho: https://oss.sonatype.org/content/repositories/public/org/eclipse/tycho/tycho-surefire-plugin/0.21.0/tycho-surefire-plugin-0.21.0.jar
Progress (1): 3.8/49 kBProgress (1): 7.9/49 kBProgress (1): 12/49 kB Progress (1): 16/49 kBProgress (1): 20/49 kBProgress (1): 24/49 kBProgress (1): 28/49 kBProgress (1): 32/49 kBProgress (1): 37/49 kBProgress (1): 41/49 kBProgress (1): 45/49 kBProgress (1): 49/49 kBProgress (1): 49 kB                      Downloaded from tycho: https://oss.sonatype.org/content/repositories/public/org/eclipse/tycho/tycho-surefire-plugin/0.21.0/tycho-surefire-plugin-0.21.0.jar (49 kB at 266 kB/s)
Downloading from tycho: https://oss.sonatype.org/content/repositories/public/org/eclipse/tycho/org.eclipse.tycho.surefire.osgibooter/0.21.0/org.eclipse.tycho.surefire.osgibooter-0.21.0.pom
Progress (1): 1.9 kB                    Downloaded from tycho: https://oss.sonatype.org/content/repositories/public/org/eclipse/tycho/org.eclipse.tycho.surefire.osgibooter/0.21.0/org.eclipse.tycho.surefire.osgibooter-0.21.0.pom (1.9 kB at 16 kB/s)
Downloading from tycho: https://oss.sonatype.org/content/repositories/public/org/eclipse/tycho/org.eclipse.tycho.surefire.junit/0.21.0/org.eclipse.tycho.surefire.junit-0.21.0.pom
Progress (1): 1.6 kB                    Downloaded from tycho: https://oss.sonatype.org/content/repositories/public/org/eclipse/tycho/org.eclipse.tycho.surefire.junit/0.21.0/org.eclipse.tycho.surefire.junit-0.21.0.pom (1.6 kB at 13 kB/s)
Downloading from tycho: https://oss.sonatype.org/content/repositories/public/org/eclipse/tycho/org.eclipse.tycho.surefire.junit4/0.21.0/org.eclipse.tycho.surefire.junit4-0.21.0.pom
Progress (1): 1.6 kB                    Downloaded from tycho: https://oss.sonatype.org/content/repositories/public/org/eclipse/tycho/org.eclipse.tycho.surefire.junit4/0.21.0/org.eclipse.tycho.surefire.junit4-0.21.0.pom (1.6 kB at 13 kB/s)
Downloading from tycho: https://oss.sonatype.org/content/repositories/public/org/eclipse/tycho/org.eclipse.tycho.surefire.junit47/0.21.0/org.eclipse.tycho.surefire.junit47-0.21.0.pom
Progress (1): 1.6 kB                    Downloaded from tycho: https://oss.sonatype.org/content/repositories/public/org/eclipse/tycho/org.eclipse.tycho.surefire.junit47/0.21.0/org.eclipse.tycho.surefire.junit47-0.21.0.pom (1.6 kB at 12 kB/s)
Downloading from tycho: https://oss.sonatype.org/content/repositories/public/org/apache/maven/surefire/surefire-api/2.10/surefire-api-2.10.pom
Downloading from cbi-repo: https://repo.eclipse.org/content/repositories/cbi/org/apache/maven/surefire/surefire-api/2.10/surefire-api-2.10.pom
Downloading from tycho-snapshot: https://repo.eclipse.org/content/repositories/tycho-snapshots/org/apache/maven/surefire/surefire-api/2.10/surefire-api-2.10.pom
Downloading from sonatype-public-grid: https://repository.sonatype.org/content/groups/sonatype-public-grid/org/apache/maven/surefire/surefire-api/2.10/surefire-api-2.10.pom
Progress (1): 2.3 kB                    Downloaded from sonatype-public-grid: https://repository.sonatype.org/content/groups/sonatype-public-grid/org/apache/maven/surefire/surefire-api/2.10/surefire-api-2.10.pom (2.3 kB at 30 kB/s)
Downloading from tycho: https://oss.sonatype.org/content/repositories/public/org/apache/maven/surefire/surefire/2.10/surefire-2.10.pom
Downloading from cbi-repo: https://repo.eclipse.org/content/repositories/cbi/org/apache/maven/surefire/surefire/2.10/surefire-2.10.pom
Downloading from tycho-snapshot: https://repo.eclipse.org/content/repositories/tycho-snapshots/org/apache/maven/surefire/surefire/2.10/surefire-2.10.pom
Downloading from sonatype-public-grid: https://repository.sonatype.org/content/groups/sonatype-public-grid/org/apache/maven/surefire/surefire/2.10/surefire-2.10.pom
Progress (1): 4.1/12 kBProgress (1): 7.9/12 kBProgress (1): 12 kB                       Downloaded from sonatype-public-grid: https://repository.sonatype.org/content/groups/sonatype-public-grid/org/apache/maven/surefire/surefire/2.10/surefire-2.10.pom (12 kB at 157 kB/s)
Downloading from tycho: https://oss.sonatype.org/content/repositories/public/org/apache/maven/maven-parent/20/maven-parent-20.pom
Downloading from cbi-repo: https://repo.eclipse.org/content/repositories/cbi/org/apache/maven/maven-parent/20/maven-parent-20.pom
Downloading from tycho-snapshot: https://repo.eclipse.org/content/repositories/tycho-snapshots/org/apache/maven/maven-parent/20/maven-parent-20.pom
Downloading from sonatype-public-grid: https://repository.sonatype.org/content/groups/sonatype-public-grid/org/apache/maven/maven-parent/20/maven-parent-20.pom
Progress (1): 4.1/25 kBProgress (1): 7.9/25 kBProgress (1): 7.9/25 kBProgress (1): 12/25 kB Progress (1): 16/25 kBProgress (1): 20/25 kBProgress (1): 24/25 kBProgress (1): 25 kB                      Downloaded from sonatype-public-grid: https://repository.sonatype.org/content/groups/sonatype-public-grid/org/apache/maven/maven-parent/20/maven-parent-20.pom (25 kB at 312 kB/s)
Downloading from tycho: https://oss.sonatype.org/content/repositories/public/org/eclipse/tycho/org.eclipse.tycho.surefire.osgibooter/0.21.0/org.eclipse.tycho.surefire.osgibooter-0.21.0.jar
Downloading from tycho: https://oss.sonatype.org/content/repositories/public/org/eclipse/tycho/org.eclipse.tycho.surefire.junit/0.21.0/org.eclipse.tycho.surefire.junit-0.21.0.jar
Downloading from tycho: https://oss.sonatype.org/content/repositories/public/org/eclipse/tycho/org.eclipse.tycho.surefire.junit4/0.21.0/org.eclipse.tycho.surefire.junit4-0.21.0.jar
Downloading from tycho: https://oss.sonatype.org/content/repositories/public/org/eclipse/tycho/org.eclipse.tycho.surefire.junit47/0.21.0/org.eclipse.tycho.surefire.junit47-0.21.0.jar
Downloading from tycho: https://oss.sonatype.org/content/repositories/public/org/apache/maven/surefire/surefire-api/2.10/surefire-api-2.10.jar
Progress (1): 3.8/185 kBProgress (2): 3.8/185 kB | 3.8/25 kBProgress (3): 3.8/185 kB | 3.8/25 kB | 4.1/50 kBProgress (3): 3.8/185 kB | 3.8/25 kB | 7.8/50 kBProgress (3): 3.8/185 kB | 3.8/25 kB | 12/50 kB Progress (3): 3.8/185 kB | 3.8/25 kB | 16/50 kBProgress (3): 7.9/185 kB | 3.8/25 kB | 16/50 kBProgress (3): 12/185 kB | 3.8/25 kB | 16/50 kB Progress (3): 16/185 kB | 3.8/25 kB | 16/50 kBProgress (3): 16/185 kB | 3.8/25 kB | 20/50 kBProgress (3): 20/185 kB | 3.8/25 kB | 20/50 kBProgress (3): 20/185 kB | 3.8/25 kB | 24/50 kBProgress (3): 20/185 kB | 3.8/25 kB | 28/50 kBProgress (3): 20/185 kB | 3.8/25 kB | 32/50 kBProgress (4): 20/185 kB | 3.8/25 kB | 32/50 kB | 4.1/30 kBProgress (4): 20/185 kB | 3.8/25 kB | 32/50 kB | 7.8/30 kBProgress (4): 20/185 kB | 3.8/25 kB | 32/50 kB | 12/30 kB Progress (4): 20/185 kB | 3.8/25 kB | 32/50 kB | 16/30 kBProgress (4): 24/185 kB | 3.8/25 kB | 32/50 kB | 16/30 kBProgress (4): 28/185 kB | 3.8/25 kB | 32/50 kB | 16/30 kBProgress (4): 32/185 kB | 3.8/25 kB | 32/50 kB | 16/30 kBProgress (4): 37/185 kB | 3.8/25 kB | 32/50 kB | 16/30 kBProgress (4): 37/185 kB | 3.8/25 kB | 32/50 kB | 20/30 kBProgress (4): 37/185 kB | 3.8/25 kB | 32/50 kB | 24/30 kBProgress (4): 37/185 kB | 3.8/25 kB | 32/50 kB | 28/30 kBProgress (4): 37/185 kB | 3.8/25 kB | 32/50 kB | 30 kB   Progress (4): 37/185 kB | 7.9/25 kB | 32/50 kB | 30 kBProgress (4): 37/185 kB | 12/25 kB | 32/50 kB | 30 kB Progress (4): 37/185 kB | 16/25 kB | 32/50 kB | 30 kBProgress (4): 37/185 kB | 20/25 kB | 32/50 kB | 30 kBProgress (4): 37/185 kB | 24/25 kB | 32/50 kB | 30 kBProgress (4): 37/185 kB | 25 kB | 32/50 kB | 30 kB   Progress (4): 37/185 kB | 25 kB | 37/50 kB | 30 kBProgress (4): 37/185 kB | 25 kB | 41/50 kB | 30 kBProgress (4): 37/185 kB | 25 kB | 45/50 kB | 30 kBProgress (4): 37/185 kB | 25 kB | 49/50 kB | 30 kBProgress (4): 37/185 kB | 25 kB | 50 kB | 30 kB   Progress (4): 41/185 kB | 25 kB | 50 kB | 30 kBProgress (4): 45/185 kB | 25 kB | 50 kB | 30 kBProgress (4): 49/185 kB | 25 kB | 50 kB | 30 kBProgress (4): 53/185 kB | 25 kB | 50 kB | 30 kBProgress (4): 57/185 kB | 25 kB | 50 kB | 30 kBProgress (4): 61/185 kB | 25 kB | 50 kB | 30 kBProgress (4): 65/185 kB | 25 kB | 50 kB | 30 kBProgress (4): 69/185 kB | 25 kB | 50 kB | 30 kB                                               Downloaded from tycho: https://oss.sonatype.org/content/repositories/public/org/eclipse/tycho/org.eclipse.tycho.surefire.junit4/0.21.0/org.eclipse.tycho.surefire.junit4-0.21.0.jar (30 kB at 108 kB/s)
Progress (3): 73/185 kB | 25 kB | 50 kBProgress (3): 77/185 kB | 25 kB | 50 kBProgress (3): 82/185 kB | 25 kB | 50 kBProgress (3): 86/185 kB | 25 kB | 50 kBProgress (3): 90/185 kB | 25 kB | 50 kBProgress (3): 94/185 kB | 25 kB | 50 kBProgress (3): 98/185 kB | 25 kB | 50 kBProgress (3): 102/185 kB | 25 kB | 50 kB                                        Downloaded from tycho: https://oss.sonatype.org/content/repositories/public/org/eclipse/tycho/org.eclipse.tycho.surefire.junit/0.21.0/org.eclipse.tycho.surefire.junit-0.21.0.jar (25 kB at 88 kB/s)
Downloaded from tycho: https://oss.sonatype.org/content/repositories/public/org/eclipse/tycho/org.eclipse.tycho.surefire.junit47/0.21.0/org.eclipse.tycho.surefire.junit47-0.21.0.jar (50 kB at 164 kB/s)
Progress (1): 106/185 kBProgress (1): 110/185 kBProgress (1): 114/185 kBProgress (1): 118/185 kBProgress (1): 123/185 kBProgress (1): 127/185 kBProgress (1): 131/185 kBProgress (1): 135/185 kBProgress (1): 139/185 kBProgress (1): 143/185 kBProgress (1): 147/185 kBProgress (1): 151/185 kBProgress (1): 155/185 kBProgress (1): 159/185 kBProgress (1): 164/185 kBProgress (1): 168/185 kBProgress (1): 172/185 kBProgress (1): 176/185 kBProgress (1): 180/185 kBProgress (1): 184/185 kBProgress (1): 185 kB                        Downloaded from tycho: https://oss.sonatype.org/content/repositories/public/org/eclipse/tycho/org.eclipse.tycho.surefire.osgibooter/0.21.0/org.eclipse.tycho.surefire.osgibooter-0.21.0.jar (185 kB at 469 kB/s)
Downloading from cbi-repo: https://repo.eclipse.org/content/repositories/cbi/org/apache/maven/surefire/surefire-api/2.10/surefire-api-2.10.jar
Downloading from tycho-snapshot: https://repo.eclipse.org/content/repositories/tycho-snapshots/org/apache/maven/surefire/surefire-api/2.10/surefire-api-2.10.jar
Downloading from sonatype-public-grid: https://repository.sonatype.org/content/groups/sonatype-public-grid/org/apache/maven/surefire/surefire-api/2.10/surefire-api-2.10.jar
Progress (1): 4.1/161 kBProgress (1): 7.8/161 kBProgress (1): 7.9/161 kBProgress (1): 12/161 kB Progress (1): 16/161 kBProgress (1): 20/161 kBProgress (1): 24/161 kBProgress (1): 28/161 kBProgress (1): 32/161 kBProgress (1): 37/161 kBProgress (1): 37/161 kBProgress (1): 41/161 kBProgress (1): 45/161 kBProgress (1): 49/161 kBProgress (1): 53/161 kBProgress (1): 57/161 kBProgress (1): 61/161 kBProgress (1): 66/161 kBProgress (1): 70/161 kBProgress (1): 74/161 kBProgress (1): 75/161 kBProgress (1): 79/161 kBProgress (1): 83/161 kBProgress (1): 88/161 kBProgress (1): 92/161 kBProgress (1): 96/161 kBProgress (1): 100/161 kBProgress (1): 104/161 kBProgress (1): 108/161 kBProgress (1): 112/161 kBProgress (1): 116/161 kBProgress (1): 120/161 kBProgress (1): 124/161 kBProgress (1): 128/161 kBProgress (1): 132/161 kBProgress (1): 136/161 kBProgress (1): 140/161 kBProgress (1): 145/161 kBProgress (1): 149/161 kBProgress (1): 153/161 kBProgress (1): 157/161 kBProgress (1): 161/161 kBProgress (1): 161 kB                        Downloaded from sonatype-public-grid: https://repository.sonatype.org/content/groups/sonatype-public-grid/org/apache/maven/surefire/surefire-api/2.10/surefire-api-2.10.jar (161 kB at 1.6 MB/s)
Downloading from tycho: https://oss.sonatype.org/content/repositories/public/org/eclipse/tycho/extras/tycho-eclipserun-plugin/0.21.0/tycho-eclipserun-plugin-0.21.0.pom
Progress (1): 1.7 kB                    Downloaded from tycho: https://oss.sonatype.org/content/repositories/public/org/eclipse/tycho/extras/tycho-eclipserun-plugin/0.21.0/tycho-eclipserun-plugin-0.21.0.pom (1.7 kB at 14 kB/s)
Downloading from tycho: https://oss.sonatype.org/content/repositories/public/org/eclipse/tycho/extras/tycho-eclipserun-plugin/0.21.0/tycho-eclipserun-plugin-0.21.0.jar
Progress (1): 4.1/11 kBProgress (1): 7.8/11 kBProgress (1): 11 kB                       Downloaded from tycho: https://oss.sonatype.org/content/repositories/public/org/eclipse/tycho/extras/tycho-eclipserun-plugin/0.21.0/tycho-eclipserun-plugin-0.21.0.jar (11 kB at 50 kB/s)
Downloading from tycho: https://oss.sonatype.org/content/repositories/public/org/apache/maven/plugins/maven-javadoc-plugin/2.7/maven-javadoc-plugin-2.7.pom
Downloading from cbi-repo: https://repo.eclipse.org/content/repositories/cbi/org/apache/maven/plugins/maven-javadoc-plugin/2.7/maven-javadoc-plugin-2.7.pom
Downloading from tycho-snapshot: https://repo.eclipse.org/content/repositories/tycho-snapshots/org/apache/maven/plugins/maven-javadoc-plugin/2.7/maven-javadoc-plugin-2.7.pom
Downloading from sonatype-public-grid: https://repository.sonatype.org/content/groups/sonatype-public-grid/org/apache/maven/plugins/maven-javadoc-plugin/2.7/maven-javadoc-plugin-2.7.pom
Progress (1): 4.1/16 kBProgress (1): 7.9/16 kBProgress (1): 7.9/16 kBProgress (1): 12/16 kB Progress (1): 16/16 kBProgress (1): 16 kB                      Downloaded from sonatype-public-grid: https://repository.sonatype.org/content/groups/sonatype-public-grid/org/apache/maven/plugins/maven-javadoc-plugin/2.7/maven-javadoc-plugin-2.7.pom (16 kB at 220 kB/s)
Downloading from tycho: https://oss.sonatype.org/content/repositories/public/org/apache/maven/plugins/maven-plugins/17/maven-plugins-17.pom
Downloading from cbi-repo: https://repo.eclipse.org/content/repositories/cbi/org/apache/maven/plugins/maven-plugins/17/maven-plugins-17.pom
Downloading from tycho-snapshot: https://repo.eclipse.org/content/repositories/tycho-snapshots/org/apache/maven/plugins/maven-plugins/17/maven-plugins-17.pom
Downloading from sonatype-public-grid: https://repository.sonatype.org/content/groups/sonatype-public-grid/org/apache/maven/plugins/maven-plugins/17/maven-plugins-17.pom
Progress (1): 4.1/13 kBProgress (1): 7.9/13 kBProgress (1): 12/13 kB Progress (1): 13 kB                      Downloaded from sonatype-public-grid: https://repository.sonatype.org/content/groups/sonatype-public-grid/org/apache/maven/plugins/maven-plugins/17/maven-plugins-17.pom (13 kB at 173 kB/s)
Downloading from tycho: https://oss.sonatype.org/content/repositories/public/org/apache/maven/plugins/maven-javadoc-plugin/2.7/maven-javadoc-plugin-2.7.jar
Downloading from cbi-repo: https://repo.eclipse.org/content/repositories/cbi/org/apache/maven/plugins/maven-javadoc-plugin/2.7/maven-javadoc-plugin-2.7.jar
Downloading from tycho-snapshot: https://repo.eclipse.org/content/repositories/tycho-snapshots/org/apache/maven/plugins/maven-javadoc-plugin/2.7/maven-javadoc-plugin-2.7.jar
Downloading from sonatype-public-grid: https://repository.sonatype.org/content/groups/sonatype-public-grid/org/apache/maven/plugins/maven-javadoc-plugin/2.7/maven-javadoc-plugin-2.7.jar
Progress (1): 4.1/274 kBProgress (1): 7.8/274 kBProgress (1): 12/274 kB Progress (1): 16/274 kBProgress (1): 20/274 kBProgress (1): 20/274 kBProgress (1): 24/274 kBProgress (1): 28/274 kBProgress (1): 32/274 kBProgress (1): 37/274 kBProgress (1): 41/274 kBProgress (1): 45/274 kBProgress (1): 49/274 kBProgress (1): 53/274 kBProgress (1): 57/274 kBProgress (1): 61/274 kBProgress (1): 61/274 kBProgress (1): 66/274 kBProgress (1): 70/274 kBProgress (1): 74/274 kBProgress (1): 78/274 kBProgress (1): 82/274 kBProgress (1): 86/274 kBProgress (1): 88/274 kBProgress (1): 92/274 kBProgress (1): 96/274 kBProgress (1): 101/274 kBProgress (1): 105/274 kBProgress (1): 109/274 kBProgress (1): 113/274 kBProgress (1): 117/274 kBProgress (1): 121/274 kBProgress (1): 125/274 kBProgress (1): 129/274 kBProgress (1): 133/274 kBProgress (1): 137/274 kBProgress (1): 142/274 kBProgress (1): 146/274 kBProgress (1): 150/274 kBProgress (1): 154/274 kBProgress (1): 158/274 kBProgress (1): 162/274 kBProgress (1): 166/274 kBProgress (1): 170/274 kBProgress (1): 174/274 kBProgress (1): 178/274 kBProgress (1): 182/274 kBProgress (1): 187/274 kBProgress (1): 191/274 kBProgress (1): 195/274 kBProgress (1): 199/274 kBProgress (1): 203/274 kBProgress (1): 207/274 kBProgress (1): 211/274 kBProgress (1): 215/274 kBProgress (1): 219/274 kBProgress (1): 223/274 kBProgress (1): 228/274 kBProgress (1): 232/274 kBProgress (1): 233/274 kBProgress (1): 238/274 kBProgress (1): 242/274 kBProgress (1): 246/274 kBProgress (1): 250/274 kBProgress (1): 254/274 kBProgress (1): 258/274 kBProgress (1): 262/274 kBProgress (1): 266/274 kBProgress (1): 270/274 kBProgress (1): 274 kB                        Downloaded from sonatype-public-grid: https://repository.sonatype.org/content/groups/sonatype-public-grid/org/apache/maven/plugins/maven-javadoc-plugin/2.7/maven-javadoc-plugin-2.7.jar (274 kB at 2.7 MB/s)
[INFO] Computing target platform for MavenProject: org.eclipse.webtools.releng:org.eclipse.wtp.releng.versionchecker:1.0.1-SNAPSHOT @ /jobs/genie.webtools/WTP-R3_9_x_Maintenance/workspace/webtools.releng/org.eclipse.wtp.releng.versionchecker/pom.xml
[INFO] Fetching p2.index from http://build.eclipse.org/webtools/committers/wtp-R3.9.4-M/20180322133713/R-3.9.4.RC1-20180322133713/repository/ (0B at 0B/s)
[INFO] Adding repository http://build.eclipse.org/webtools/committers/wtp-R3.9.4-M/20180322133713/R-3.9.4.RC1-20180322133713//repository
[INFO] Fetching content.jar from http://build.eclipse.org/webtools/committers/wtp-R3.9.4-M/20180322133713/R-3.9.4.RC1-20180322133713/repository/ (0B at 0B/s)
[ERROR] Internal error: java.lang.RuntimeException: Failed to load p2 repository with ID 'webtools-repo' from location http://build.eclipse.org/webtools/committers/wtp-R3.9.4-M/20180322133713/R-3.9.4.RC1-20180322133713//repository: Unable to read repository at http://build.eclipse.org/webtools/committers/wtp-R3.9.4-M/20180322133713/R-3.9.4.RC1-20180322133713//repository. http://build.eclipse.org/webtools/committers/wtp-R3.9.4-M/20180322133713/R-3.9.4.RC1-20180322133713//repository is not a valid repository location. -> [Help 1]
org.apache.maven.InternalErrorException: Internal error: java.lang.RuntimeException: Failed to load p2 repository with ID 'webtools-repo' from location http://build.eclipse.org/webtools/committers/wtp-R3.9.4-M/20180322133713/R-3.9.4.RC1-20180322133713//repository
    at org.apache.maven.DefaultMaven.execute (DefaultMaven.java:122)
    at org.apache.maven.cli.MavenCli.execute (MavenCli.java:955)
    at org.apache.maven.cli.MavenCli.doMain (MavenCli.java:290)
    at org.apache.maven.cli.MavenCli.main (MavenCli.java:194)
    at sun.reflect.NativeMethodAccessorImpl.invoke0 (Native Method)
    at sun.reflect.NativeMethodAccessorImpl.invoke (NativeMethodAccessorImpl.java:62)
    at sun.reflect.DelegatingMethodAccessorImpl.invoke (DelegatingMethodAccessorImpl.java:43)
    at java.lang.reflect.Method.invoke (Method.java:498)
    at org.codehaus.plexus.classworlds.launcher.Launcher.launchEnhanced (Launcher.java:289)
    at org.codehaus.plexus.classworlds.launcher.Launcher.launch (Launcher.java:229)
    at org.codehaus.plexus.classworlds.launcher.Launcher.mainWithExitCode (Launcher.java:415)
    at org.codehaus.plexus.classworlds.launcher.Launcher.main (Launcher.java:356)
Caused by: java.lang.RuntimeException: Failed to load p2 repository with ID 'webtools-repo' from location http://build.eclipse.org/webtools/committers/wtp-R3.9.4-M/20180322133713/R-3.9.4.RC1-20180322133713//repository
    at org.eclipse.tycho.p2.target.TargetPlatformFactoryImpl.loadMetadataRepository (TargetPlatformFactoryImpl.java:301)
    at org.eclipse.tycho.p2.target.TargetPlatformFactoryImpl.gatherExternalInstallableUnits (TargetPlatformFactoryImpl.java:269)
    at org.eclipse.tycho.p2.target.TargetPlatformFactoryImpl.createTargetPlatform (TargetPlatformFactoryImpl.java:174)
    at org.eclipse.tycho.p2.target.TargetPlatformFactoryImpl.createTargetPlatform (TargetPlatformFactoryImpl.java:126)
    at org.eclipse.tycho.p2.target.TargetPlatformFactoryImpl.createTargetPlatform (TargetPlatformFactoryImpl.java:1)
    at org.eclipse.tycho.p2.manager.ReactorRepositoryManagerImpl.computePreliminaryTargetPlatform (ReactorRepositoryManagerImpl.java:82)
    at org.eclipse.tycho.p2.resolver.P2DependencyResolver.computePreliminaryTargetPlatform (P2DependencyResolver.java:215)
    at org.eclipse.tycho.core.resolver.DefaultTychoResolver.resolveProject (DefaultTychoResolver.java:99)
    at org.eclipse.tycho.core.maven.TychoMavenLifecycleParticipant.afterProjectsRead (TychoMavenLifecycleParticipant.java:75)
    at org.apache.maven.DefaultMaven.doExecute (DefaultMaven.java:267)
    at org.apache.maven.DefaultMaven.doExecute (DefaultMaven.java:194)
    at org.apache.maven.DefaultMaven.execute (DefaultMaven.java:107)
    at org.apache.maven.cli.MavenCli.execute (MavenCli.java:955)
    at org.apache.maven.cli.MavenCli.doMain (MavenCli.java:290)
    at org.apache.maven.cli.MavenCli.main (MavenCli.java:194)
    at sun.reflect.NativeMethodAccessorImpl.invoke0 (Native Method)
    at sun.reflect.NativeMethodAccessorImpl.invoke (NativeMethodAccessorImpl.java:62)
    at sun.reflect.DelegatingMethodAccessorImpl.invoke (DelegatingMethodAccessorImpl.java:43)
    at java.lang.reflect.Method.invoke (Method.java:498)
    at org.codehaus.plexus.classworlds.launcher.Launcher.launchEnhanced (Launcher.java:289)
    at org.codehaus.plexus.classworlds.launcher.Launcher.launch (Launcher.java:229)
    at org.codehaus.plexus.classworlds.launcher.Launcher.mainWithExitCode (Launcher.java:415)
    at org.codehaus.plexus.classworlds.launcher.Launcher.main (Launcher.java:356)
Caused by: org.eclipse.equinox.p2.core.ProvisionException: Unable to read repository at http://build.eclipse.org/webtools/committers/wtp-R3.9.4-M/20180322133713/R-3.9.4.RC1-20180322133713//repository.
    at org.eclipse.equinox.internal.p2.metadata.repository.SimpleMetadataRepositoryFactory.load (SimpleMetadataRepositoryFactory.java:128)
    at org.eclipse.equinox.internal.p2.metadata.repository.MetadataRepositoryManager.factoryLoad (MetadataRepositoryManager.java:57)
    at org.eclipse.equinox.internal.p2.repository.helpers.AbstractRepositoryManager.loadRepository (AbstractRepositoryManager.java:768)
    at org.eclipse.equinox.internal.p2.repository.helpers.AbstractRepositoryManager.loadRepository (AbstractRepositoryManager.java:668)
    at org.eclipse.equinox.internal.p2.metadata.repository.MetadataRepositoryManager.loadRepository (MetadataRepositoryManager.java:96)
    at org.eclipse.tycho.p2.remote.RemoteMetadataRepositoryManager.loadRepository (RemoteMetadataRepositoryManager.java:59)
    at org.eclipse.tycho.p2.remote.RemoteMetadataRepositoryManager.loadRepository (RemoteMetadataRepositoryManager.java:52)
    at org.eclipse.tycho.p2.target.TargetPlatformFactoryImpl.loadMetadataRepository (TargetPlatformFactoryImpl.java:297)
    at org.eclipse.tycho.p2.target.TargetPlatformFactoryImpl.gatherExternalInstallableUnits (TargetPlatformFactoryImpl.java:269)
    at org.eclipse.tycho.p2.target.TargetPlatformFactoryImpl.createTargetPlatform (TargetPlatformFactoryImpl.java:174)
    at org.eclipse.tycho.p2.target.TargetPlatformFactoryImpl.createTargetPlatform (TargetPlatformFactoryImpl.java:126)
    at org.eclipse.tycho.p2.target.TargetPlatformFactoryImpl.createTargetPlatform (TargetPlatformFactoryImpl.java:1)
    at org.eclipse.tycho.p2.manager.ReactorRepositoryManagerImpl.computePreliminaryTargetPlatform (ReactorRepositoryManagerImpl.java:82)
    at org.eclipse.tycho.p2.resolver.P2DependencyResolver.computePreliminaryTargetPlatform (P2DependencyResolver.java:215)
    at org.eclipse.tycho.core.resolver.DefaultTychoResolver.resolveProject (DefaultTychoResolver.java:99)
    at org.eclipse.tycho.core.maven.TychoMavenLifecycleParticipant.afterProjectsRead (TychoMavenLifecycleParticipant.java:75)
    at org.apache.maven.DefaultMaven.doExecute (DefaultMaven.java:267)
    at org.apache.maven.DefaultMaven.doExecute (DefaultMaven.java:194)
    at org.apache.maven.DefaultMaven.execute (DefaultMaven.java:107)
    at org.apache.maven.cli.MavenCli.execute (MavenCli.java:955)
    at org.apache.maven.cli.MavenCli.doMain (MavenCli.java:290)
    at org.apache.maven.cli.MavenCli.main (MavenCli.java:194)
    at sun.reflect.NativeMethodAccessorImpl.invoke0 (Native Method)
    at sun.reflect.NativeMethodAccessorImpl.invoke (NativeMethodAccessorImpl.java:62)
    at sun.reflect.DelegatingMethodAccessorImpl.invoke (DelegatingMethodAccessorImpl.java:43)
    at java.lang.reflect.Method.invoke (Method.java:498)
    at org.codehaus.plexus.classworlds.launcher.Launcher.launchEnhanced (Launcher.java:289)
    at org.codehaus.plexus.classworlds.launcher.Launcher.launch (Launcher.java:229)
    at org.codehaus.plexus.classworlds.launcher.Launcher.mainWithExitCode (Launcher.java:415)
    at org.codehaus.plexus.classworlds.launcher.Launcher.main (Launcher.java:356)
Caused by: java.io.IOException: http://build.eclipse.org/webtools/committers/wtp-R3.9.4-M/20180322133713/R-3.9.4.RC1-20180322133713//repository is not a valid repository location.
    at org.eclipse.equinox.internal.p2.metadata.repository.SimpleMetadataRepositoryFactory.load (SimpleMetadataRepositoryFactory.java:102)
    at org.eclipse.equinox.internal.p2.metadata.repository.MetadataRepositoryManager.factoryLoad (MetadataRepositoryManager.java:57)
    at org.eclipse.equinox.internal.p2.repository.helpers.AbstractRepositoryManager.loadRepository (AbstractRepositoryManager.java:768)
    at org.eclipse.equinox.internal.p2.repository.helpers.AbstractRepositoryManager.loadRepository (AbstractRepositoryManager.java:668)
    at org.eclipse.equinox.internal.p2.metadata.repository.MetadataRepositoryManager.loadRepository (MetadataRepositoryManager.java:96)
    at org.eclipse.tycho.p2.remote.RemoteMetadataRepositoryManager.loadRepository (RemoteMetadataRepositoryManager.java:59)
    at org.eclipse.tycho.p2.remote.RemoteMetadataRepositoryManager.loadRepository (RemoteMetadataRepositoryManager.java:52)
    at org.eclipse.tycho.p2.target.TargetPlatformFactoryImpl.loadMetadataRepository (TargetPlatformFactoryImpl.java:297)
    at org.eclipse.tycho.p2.target.TargetPlatformFactoryImpl.gatherExternalInstallableUnits (TargetPlatformFactoryImpl.java:269)
    at org.eclipse.tycho.p2.target.TargetPlatformFactoryImpl.createTargetPlatform (TargetPlatformFactoryImpl.java:174)
    at org.eclipse.tycho.p2.target.TargetPlatformFactoryImpl.createTargetPlatform (TargetPlatformFactoryImpl.java:126)
    at org.eclipse.tycho.p2.target.TargetPlatformFactoryImpl.createTargetPlatform (TargetPlatformFactoryImpl.java:1)
    at org.eclipse.tycho.p2.manager.ReactorRepositoryManagerImpl.computePreliminaryTargetPlatform (ReactorRepositoryManagerImpl.java:82)
    at org.eclipse.tycho.p2.resolver.P2DependencyResolver.computePreliminaryTargetPlatform (P2DependencyResolver.java:215)
    at org.eclipse.tycho.core.resolver.DefaultTychoResolver.resolveProject (DefaultTychoResolver.java:99)
    at org.eclipse.tycho.core.maven.TychoMavenLifecycleParticipant.afterProjectsRead (TychoMavenLifecycleParticipant.java:75)
    at org.apache.maven.DefaultMaven.doExecute (DefaultMaven.java:267)
    at org.apache.maven.DefaultMaven.doExecute (DefaultMaven.java:194)
    at org.apache.maven.DefaultMaven.execute (DefaultMaven.java:107)
    at org.apache.maven.cli.MavenCli.execute (MavenCli.java:955)
    at org.apache.maven.cli.MavenCli.doMain (MavenCli.java:290)
    at org.apache.maven.cli.MavenCli.main (MavenCli.java:194)
    at sun.reflect.NativeMethodAccessorImpl.invoke0 (Native Method)
    at sun.reflect.NativeMethodAccessorImpl.invoke (NativeMethodAccessorImpl.java:62)
    at sun.reflect.DelegatingMethodAccessorImpl.invoke (DelegatingMethodAccessorImpl.java:43)
    at java.lang.reflect.Method.invoke (Method.java:498)
    at org.codehaus.plexus.classworlds.launcher.Launcher.launchEnhanced (Launcher.java:289)
    at org.codehaus.plexus.classworlds.launcher.Launcher.launch (Launcher.java:229)
    at org.codehaus.plexus.classworlds.launcher.Launcher.mainWithExitCode (Launcher.java:415)
    at org.codehaus.plexus.classworlds.launcher.Launcher.main (Launcher.java:356)
[ERROR] 
[ERROR] To see the full stack trace of the errors, re-run Maven with the -e switch.
[ERROR] Re-run Maven using the -X switch to enable full debug logging.
[ERROR] 
[ERROR] For more information about the errors and possible solutions, please read the following articles:
[ERROR] [Help 1] http://cwiki.apache.org/confluence/display/MAVEN/InternalErrorException
Build step 'Invoke top-level Maven targets' marked build as failure
Terminating xvnc.