[Date Prev][Date Next][Thread Prev][Thread Next][Date Index][Thread Index] [List Home]
[linuxtools-dev] Build failed in Hudson: linuxtools-master #747

See <https://hudson.eclipse.org/hudson/job/linuxtools-master/747/>

------------------------------------------
Started by user jjohnston
Building remotely on hudson-slave6
Checkout:linuxtools-master / <https://hudson.eclipse.org/hudson/job/linuxtools-master/ws/> - hudson.remoting.Channel@35bf50b4:hudson-slave6
Using strategy: Default
Last Built Revision: Revision 0a0dcbe574689fbb87bdfc9d9c4ef9b3577a3f3e (origin/master)
Checkout:linuxtools-master / <https://hudson.eclipse.org/hudson/job/linuxtools-master/ws/> - hudson.remoting.LocalChannel@bd649c5
Fetching changes from the remote Git repository
Fetching upstream changes from git://git.eclipse.org/gitroot/linuxtools/org.eclipse.linuxtools.git
Commencing build of Revision 0a0dcbe574689fbb87bdfc9d9c4ef9b3577a3f3e (origin/master)
Checking out Revision 0a0dcbe574689fbb87bdfc9d9c4ef9b3577a3f3e (origin/master)
Deleting old artifacts from #745
Starting xvnc
[linuxtools-master] $ Xvnc :13 -geometry 1024x768 -depth 24 -ac
20/03/2012 08:29:42 Xvnc version X.org/xf4vnc custom version
20/03/2012 08:29:42 Copyright (C) 2001-2004 Alan Hourihane.
20/03/2012 08:29:42 Copyright (C) 2000-2004 Constantin Kaplinsky
20/03/2012 08:29:42 Copyright (C) 1999 AT&T Laboratories Cambridge
20/03/2012 08:29:42 All Rights Reserved.
20/03/2012 08:29:42 See http://www.tightvnc.com/ for information on TightVNC
20/03/2012 08:29:42 See http://xf4vnc.sf.net for xf4vnc-specific information
20/03/2012 08:29:42 Desktop name 'x11' (hudson-slave6:13)
20/03/2012 08:29:42 Protocol versions supported: 3.7, 3.3
20/03/2012 08:29:42 RGB format 8 8 8
20/03/2012 08:29:42 Listening for VNC connections on TCP port 5913
(EE) AIGLX error: dlopen of /usr/lib64/dri/swrast_dri.so failed (/usr/lib64/dri/swrast_dri.so: cannot open shared object file: No such file or directory)
(EE) GLX: could not load software renderer
[linuxtools-master] $ /bin/sh -xe /tmp/hudson1337798754700874813.sh
[dix] Could not init font path element /usr/share/fonts/truetype/, removing from list!
[dix] Could not init font path element /usr/share/fonts/TTF/, removing from list!
[dix] Could not init font path element /usr/share/fonts/OTF, removing from list!
[dix] Could not init font path element /usr/share/fonts/Type1/, removing from list!
[dix] Could not init font path element /usr/share/fonts/100dpi:unscaled, removing from list!
(EE) XKB: Couldn't open rules file /usr/share/X11/xkb/rules/base
(EE) XKB: No components provided for device Virtual core keyboard
(EE) config/hal: NewInputDeviceRequest failed (2)
(EE) config/hal: NewInputDeviceRequest failed (2)
+ rm -fr /opt/users/hudsonbuild/.m2/repository/org/eclipse/linuxtools/
[INFO] Using bundled Maven 3 installation
[INFO] Checking Maven 3 installation environment
[linuxtools-master] $ /opt/users/hudsonbuild/maven/slavebundle/bundled-maven/bin/mvn --help
[INFO] Checking Maven 3 installation version
[linuxtools-master] $ /opt/users/hudsonbuild/maven/slavebundle/bundled-maven/bin/mvn --version
[INFO] Detected Maven 3 installation version: 3.0.3
[DEBUG] Waiting for connection on port: 56461
[linuxtools-master] $ /opt/users/hudsonbuild/maven/slavebundle/bundled-maven/bin/mvn clean javadoc:aggregate install -V -e "-Dmaven.test.failure.ignore=true platform-version-name=juno" -Dmaven.ext.class.path=/opt/users/hudsonbuild/maven/slavebundle/resources:/opt/users/hudsonbuild/maven/slavebundle/lib/maven3-eventspy-3.0.jar:/opt/users/hudsonbuild/slave.jar -Dhudson.eventspy.port=56461 -Dmaven.repo.local=<https://hudson.eclipse.org/hudson/job/linuxtools-master/ws/.maven/repo> -f pom.xml -P build-server -P platform-juno -P analysis -fn -U
Apache Maven 3.0.3 (r1075438; 2011-02-28 12:31:09-0500)
Maven home: /opt/users/hudsonbuild/maven/slavebundle/bundled-maven
Java version: 1.6.0_21, vendor: Sun Microsystems Inc.
Java home: /opt/public/common/sun-jdk1.6.0_21_x64/jre
Default locale: en_US, platform encoding: UTF-8
OS name: "linux", version: "2.6.32.49-0.3-default", arch: "amd64", family: "unix"
[DEBUG] Connected to remote
[INFO] Error stacktraces are turned on.
[INFO] Scanning for projects...
Downloading: http://maven.eclipse.org/nexus/content/groups/public/org/eclipse/tycho/tycho-maven-plugin/0.14.1/tycho-maven-plugin-0.14.1.pom
Downloading: http://repo1.maven.org/maven2/org/eclipse/tycho/tycho-maven-plugin/0.14.1/tycho-maven-plugin-0.14.1.pom
[INFO] o.h.m.e.h.MavenExecutionResultHandler - Build failed with exception(s)
[INFO] o.h.m.e.h.MavenExecutionResultHandler - [1] org.apache.maven.project.ProjectBuildingException: Some problems were encountered while processing the POMs:
[ERROR] Unresolveable build extension: Plugin org.eclipse.tycho:tycho-maven-plugin:0.14.1 or one of its dependencies could not be resolved: Failed to collect dependencies for org.eclipse.tycho:tycho-maven-plugin:jar:0.14.1 () @ 

[DEBUG] Closing connection to remote
[ERROR] The build could not read 1 project -> [Help 1]
org.apache.maven.project.ProjectBuildingException: Some problems were encountered while processing the POMs:
[ERROR] Unresolveable build extension: Plugin org.eclipse.tycho:tycho-maven-plugin:0.14.1 or one of its dependencies could not be resolved: Failed to collect dependencies for org.eclipse.tycho:tycho-maven-plugin:jar:0.14.1 () @ 

	at org.apache.maven.project.DefaultProjectBuilder.build(DefaultProjectBuilder.java:339)
	at org.apache.maven.DefaultMaven.collectProjects(DefaultMaven.java:632)
	at org.apache.maven.DefaultMaven.getProjectsForMavenReactor(DefaultMaven.java:581)
	at org.apache.maven.DefaultMaven.doExecute(DefaultMaven.java:233)
	at org.apache.maven.DefaultMaven.execute(DefaultMaven.java:156)
	at org.apache.maven.cli.MavenCli.execute(MavenCli.java:537)
	at org.apache.maven.cli.MavenCli.doMain(MavenCli.java:196)
	at org.apache.maven.cli.MavenCli.main(MavenCli.java:141)
	at sun.reflect.NativeMethodAccessorImpl.invoke0(Native Method)
	at sun.reflect.NativeMethodAccessorImpl.invoke(NativeMethodAccessorImpl.java:39)
	at sun.reflect.DelegatingMethodAccessorImpl.invoke(DelegatingMethodAccessorImpl.java:25)
	at java.lang.reflect.Method.invoke(Method.java:597)
	at org.codehaus.plexus.classworlds.launcher.Launcher.launchEnhanced(Launcher.java:290)
	at org.codehaus.plexus.classworlds.launcher.Launcher.launch(Launcher.java:230)
	at org.codehaus.plexus.classworlds.launcher.Launcher.mainWithExitCode(Launcher.java:409)
	at org.codehaus.plexus.classworlds.launcher.Launcher.main(Launcher.java:352)
[ERROR]   
[ERROR]   The project org.eclipse.linuxtools:linuxtools-parent:0.11.0-SNAPSHOT (<https://hudson.eclipse.org/hudson/job/linuxtools-master/ws/pom.xml)> has 1 error
[ERROR]     Unresolveable build extension: Plugin org.eclipse.tycho:tycho-maven-plugin:0.14.1 or one of its dependencies could not be resolved: Failed to collect dependencies for org.eclipse.tycho:tycho-maven-plugin:jar:0.14.1 (): Failed to read artifact descriptor for org.eclipse.tycho:tycho-maven-plugin:jar:0.14.1: Could not transfer artifact org.eclipse.tycho:tycho-maven-plugin:pom:0.14.1 from/to central (http://repo1.maven.org/maven2): Error transferring file: Connection timed out -> [Help 2]
org.apache.maven.plugin.PluginResolutionException: Plugin org.eclipse.tycho:tycho-maven-plugin:0.14.1 or one of its dependencies could not be resolved: Failed to collect dependencies for org.eclipse.tycho:tycho-maven-plugin:jar:0.14.1 ()
	at org.apache.maven.plugin.internal.DefaultPluginDependenciesResolver.resolve(DefaultPluginDependenciesResolver.java:211)
	at org.apache.maven.project.DefaultProjectBuildingHelper.resolveExtensionArtifacts(DefaultProjectBuildingHelper.java:377)
	at org.apache.maven.project.DefaultProjectBuildingHelper.createProjectRealm(DefaultProjectBuildingHelper.java:237)
	at org.apache.maven.project.DefaultModelBuildingListener.buildExtensionsAssembled(DefaultModelBuildingListener.java:106)
	at org.apache.maven.model.building.ModelBuildingEventCatapult$1.fire(ModelBuildingEventCatapult.java:43)
	at org.apache.maven.model.building.DefaultModelBuilder.fireEvent(DefaultModelBuilder.java:1041)
	at org.apache.maven.model.building.DefaultModelBuilder.build(DefaultModelBuilder.java:391)
	at org.apache.maven.model.building.DefaultModelBuilder.build(DefaultModelBuilder.java:374)
	at org.apache.maven.project.DefaultProjectBuilder.build(DefaultProjectBuilder.java:536)
	at org.apache.maven.project.DefaultProjectBuilder.build(DefaultProjectBuilder.java:328)
	at org.apache.maven.DefaultMaven.collectProjects(DefaultMaven.java:632)
	at org.apache.maven.DefaultMaven.getProjectsForMavenReactor(DefaultMaven.java:581)
	at org.apache.maven.DefaultMaven.doExecute(DefaultMaven.java:233)
	at org.apache.maven.DefaultMaven.execute(DefaultMaven.java:156)
	at org.apache.maven.cli.MavenCli.execute(MavenCli.java:537)
	at org.apache.maven.cli.MavenCli.doMain(MavenCli.java:196)
	at org.apache.maven.cli.MavenCli.main(MavenCli.java:141)
	at sun.reflect.NativeMethodAccessorImpl.invoke0(Native Method)
	at sun.reflect.NativeMethodAccessorImpl.invoke(NativeMethodAccessorImpl.java:39)
	at sun.reflect.DelegatingMethodAccessorImpl.invoke(DelegatingMethodAccessorImpl.java:25)
	at java.lang.reflect.Method.invoke(Method.java:597)
	at org.codehaus.plexus.classworlds.launcher.Launcher.launchEnhanced(Launcher.java:290)
	at org.codehaus.plexus.classworlds.launcher.Launcher.launch(Launcher.java:230)
	at org.codehaus.plexus.classworlds.launcher.Launcher.mainWithExitCode(Launcher.java:409)
	at org.codehaus.plexus.classworlds.launcher.Launcher.main(Launcher.java:352)
Caused by: org.sonatype.aether.collection.DependencyCollectionException: Failed to collect dependencies for org.eclipse.tycho:tycho-maven-plugin:jar:0.14.1 ()
	at org.sonatype.aether.impl.internal.DefaultDependencyCollector.collectDependencies(DefaultDependencyCollector.java:202)
	at org.sonatype.aether.impl.internal.DefaultRepositorySystem.collectDependencies(DefaultRepositorySystem.java:345)
	at org.apache.maven.plugin.internal.DefaultPluginDependenciesResolver.resolve(DefaultPluginDependenciesResolver.java:199)
	... 24 more
Caused by: org.sonatype.aether.resolution.ArtifactDescriptorException: Failed to read artifact descriptor for org.eclipse.tycho:tycho-maven-plugin:jar:0.14.1
	at org.apache.maven.repository.internal.DefaultArtifactDescriptorReader.loadPom(DefaultArtifactDescriptorReader.java:282)
	at org.apache.maven.repository.internal.DefaultArtifactDescriptorReader.readArtifactDescriptor(DefaultArtifactDescriptorReader.java:172)
	at org.sonatype.aether.impl.internal.DefaultDependencyCollector.collectDependencies(DefaultDependencyCollector.java:196)
	... 26 more
Caused by: org.sonatype.aether.resolution.ArtifactResolutionException: Could not transfer artifact org.eclipse.tycho:tycho-maven-plugin:pom:0.14.1 from/to central (http://repo1.maven.org/maven2): Error transferring file: Connection timed out
	at org.sonatype.aether.impl.internal.DefaultArtifactResolver.resolve(DefaultArtifactResolver.java:541)
	at org.sonatype.aether.impl.internal.DefaultArtifactResolver.resolveArtifacts(DefaultArtifactResolver.java:220)
	at org.sonatype.aether.impl.internal.DefaultArtifactResolver.resolveArtifact(DefaultArtifactResolver.java:197)
	at org.apache.maven.repository.internal.DefaultArtifactDescriptorReader.loadPom(DefaultArtifactDescriptorReader.java:267)
	... 28 more
Caused by: org.sonatype.aether.transfer.ArtifactTransferException: Could not transfer artifact org.eclipse.tycho:tycho-maven-plugin:pom:0.14.1 from/to central (http://repo1.maven.org/maven2): Error transferring file: Connection timed out
	at org.sonatype.aether.connector.wagon.WagonRepositoryConnector$4.wrap(WagonRepositoryConnector.java:949)
	at org.sonatype.aether.connector.wagon.WagonRepositoryConnector$4.wrap(WagonRepositoryConnector.java:940)
	at org.sonatype.aether.connector.wagon.WagonRepositoryConnector$GetTask.flush(WagonRepositoryConnector.java:695)
	at org.sonatype.aether.connector.wagon.WagonRepositoryConnector$GetTask.flush(WagonRepositoryConnector.java:689)
	at org.sonatype.aether.connector.wagon.WagonRepositoryConnector.get(WagonRepositoryConnector.java:445)
	at org.sonatype.aether.impl.internal.DefaultArtifactResolver.resolve(DefaultArtifactResolver.java:460)
	... 31 more
Caused by: org.apache.maven.wagon.TransferFailedException: Error transferring file: Connection timed out
	at org.apache.maven.wagon.providers.http.LightweightHttpWagon.fillInputData(LightweightHttpWagon.java:143)
	at org.apache.maven.wagon.StreamWagon.getInputStream(StreamWagon.java:116)
	at org.apache.maven.wagon.StreamWagon.getIfNewer(StreamWagon.java:88)
	at org.apache.maven.wagon.StreamWagon.get(StreamWagon.java:61)
	at org.sonatype.aether.connector.wagon.WagonRepositoryConnector$GetTask.run(WagonRepositoryConnector.java:608)
	at org.sonatype.aether.util.concurrency.RunnableErrorForwarder$1.run(RunnableErrorForwarder.java:64)
	at java.util.concurrent.ThreadPoolExecutor$Worker.runTask(ThreadPoolExecutor.java:886)
	at java.util.concurrent.ThreadPoolExecutor$Worker.run(ThreadPoolExecutor.java:908)
	at java.lang.Thread.run(Thread.java:619)
Caused by: java.net.ConnectException: Connection timed out
	at java.net.PlainSocketImpl.socketConnect(Native Method)
	at java.net.PlainSocketImpl.doConnect(PlainSocketImpl.java:333)
	at java.net.PlainSocketImpl.connectToAddress(PlainSocketImpl.java:195)
	at java.net.PlainSocketImpl.connect(PlainSocketImpl.java:182)
	at java.net.SocksSocketImpl.connect(SocksSocketImpl.java:366)
	at java.net.Socket.connect(Socket.java:529)
	at java.net.Socket.connect(Socket.java:478)
	at sun.net.NetworkClient.doConnect(NetworkClient.java:163)
	at sun.net.www.http.HttpClient.openServer(HttpClient.java:394)
	at sun.net.www.http.HttpClient.openServer(HttpClient.java:529)
	at sun.net.www.http.HttpClient.<init>(HttpClient.java:233)
	at sun.net.www.http.HttpClient.New(HttpClient.java:306)
	at sun.net.www.protocol.http.HttpURLConnection.getNewHttpClient(HttpURLConnection.java:867)
	at sun.net.www.protocol.http.HttpURLConnection.plainConnect(HttpURLConnection.java:815)
	at sun.net.www.protocol.http.HttpURLConnection.connect(HttpURLConnection.java:726)
	at sun.net.www.protocol.http.HttpURLConnection.getInputStream(HttpURLConnection.java:1049)
	at java.net.HttpURLConnection.getResponseCode(HttpURLConnection.java:373)
	at org.apache.maven.wagon.providers.http.LightweightHttpWagon.fillInputData(LightweightHttpWagon.java:115)
	... 8 more
[ERROR] 
[ERROR] Re-run Maven using the -X switch to enable full debug logging.
[ERROR] 
[ERROR] For more information about the errors and possible solutions, please read the following articles:
[ERROR] [Help 1] http://cwiki.apache.org/confluence/display/MAVEN/ProjectBuildingException
[ERROR] [Help 2] http://cwiki.apache.org/confluence/display/MAVEN/PluginResolutionException
[INFO] Build failures were ignored.
[DEBUG] Waiting for process to finish
[DEBUG] Result: 0
Terminating xvnc.
[DRY] Collecting duplicate code analysis files...
[FINDBUGS] Collecting findbugs analysis files...
Recording test results
No test report files were found. Configuration error?
Publishing Javadoc
Archiving artifacts