[Date Prev][Date Next][Thread Prev][Thread Next][Date Index][Thread Index] [List Home]
[linuxtools-dev] Build failed in Hudson: linuxtools-Indigo #418

See <https://hudson.eclipse.org/hudson/job/linuxtools-Indigo/418/changes>

Changes:

[Bernd Hufmann] Fix setting of trace name in trace initialization (Bug 374714)

------------------------------------------
Started by user opontes
Building remotely on hudson-slave6
Checkout:linuxtools-Indigo / <https://hudson.eclipse.org/hudson/job/linuxtools-Indigo/ws/> - hudson.remoting.Channel@35bf50b4:hudson-slave6
Using strategy: Default
Last Built Revision: Revision ca364393fb0a39adb6b5a135829b920838bf84bf (origin/stable-0.10)
Checkout:linuxtools-Indigo / <https://hudson.eclipse.org/hudson/job/linuxtools-Indigo/ws/> - hudson.remoting.LocalChannel@bd649c5
Cloning the remote Git repository
Cloning repository origin
Fetching upstream changes from git://git.eclipse.org/gitroot/linuxtools/org.eclipse.linuxtools.git
Commencing build of Revision 752d7c53d40fe3c4b9e769dd9acb8611bdc86a1f (origin/stable-0.10)
Checking out Revision 752d7c53d40fe3c4b9e769dd9acb8611bdc86a1f (origin/stable-0.10)
Deleting old artifacts from #416
Starting xvnc
[linuxtools-Indigo] $ Xvnc :13 -geometry 1024x768 -depth 24 -ac
[linuxtools-Indigo] $ /bin/sh -xe /tmp/hudson2452377019582103671.sh
+ rm -fr /opt/users/hudsonbuild/.m2/repository/org/eclipse/linuxtools/
[linuxtools-Indigo] $ /shared/common/apache-maven-3.0.3/bin/mvn -Dmaven.repo.local=<https://hudson.eclipse.org/hudson/job/linuxtools-Indigo/ws/.repository> -fn -Dmaven.test.failure.ignore=true -Dplatform-version-name=indigo -U -e clean install -P build-server
20/03/2012 09:02:37 Xvnc version X.org/xf4vnc custom version
20/03/2012 09:02:37 Copyright (C) 2001-2004 Alan Hourihane.
20/03/2012 09:02:37 Copyright (C) 2000-2004 Constantin Kaplinsky
20/03/2012 09:02:37 Copyright (C) 1999 AT&T Laboratories Cambridge
20/03/2012 09:02:37 All Rights Reserved.
20/03/2012 09:02:37 See http://www.tightvnc.com/ for information on TightVNC
20/03/2012 09:02:37 See http://xf4vnc.sf.net for xf4vnc-specific information
20/03/2012 09:02:37 Desktop name 'x11' (hudson-slave6:13)
20/03/2012 09:02:37 Protocol versions supported: 3.7, 3.3
20/03/2012 09:02:37 RGB format 8 8 8
20/03/2012 09:02:37 Listening for VNC connections on TCP port 5913
(EE) AIGLX error: dlopen of /usr/lib64/dri/swrast_dri.so failed (/usr/lib64/dri/swrast_dri.so: cannot open shared object file: No such file or directory)
(EE) GLX: could not load software renderer
[dix] Could not init font path element /usr/share/fonts/truetype/, removing from list!
[dix] Could not init font path element /usr/share/fonts/TTF/, removing from list!
[dix] Could not init font path element /usr/share/fonts/OTF, removing from list!
[dix] Could not init font path element /usr/share/fonts/Type1/, removing from list!
[dix] Could not init font path element /usr/share/fonts/100dpi:unscaled, removing from list!
(EE) XKB: Couldn't open rules file /usr/share/X11/xkb/rules/base
(EE) XKB: No components provided for device Virtual core keyboard
(EE) config/hal: NewInputDeviceRequest failed (2)
(EE) config/hal: NewInputDeviceRequest failed (2)
[INFO] Error stacktraces are turned on.
[INFO] Scanning for projects...
Downloading: http://maven.eclipse.org/nexus/content/groups/public/org/eclipse/eclipse-parent/3/eclipse-parent-3.pom
4 KB   
8 KB   
12 KB   
        
Downloaded: http://maven.eclipse.org/nexus/content/groups/public/org/eclipse/eclipse-parent/3/eclipse-parent-3.pom (12 KB at 51.1 KB/sec)
Downloading: http://maven.eclipse.org/nexus/content/groups/public/org/eclipse/tycho/tycho-maven-plugin/0.14.1/tycho-maven-plugin-0.14.1.pom
        
Downloading: http://repo1.maven.org/maven2/org/eclipse/tycho/tycho-maven-plugin/0.14.1/tycho-maven-plugin-0.14.1.pom
        
[ERROR] The build could not read 1 project -> [Help 1]
org.apache.maven.project.ProjectBuildingException: Some problems were encountered while processing the POMs:
[ERROR] Unresolveable build extension: Plugin org.eclipse.tycho:tycho-maven-plugin:0.14.1 or one of its dependencies could not be resolved: Failed to collect dependencies for org.eclipse.tycho:tycho-maven-plugin:jar:0.14.1 () @ 

	at org.apache.maven.project.DefaultProjectBuilder.build(DefaultProjectBuilder.java:339)
	at org.apache.maven.DefaultMaven.collectProjects(DefaultMaven.java:632)
	at org.apache.maven.DefaultMaven.getProjectsForMavenReactor(DefaultMaven.java:581)
	at org.apache.maven.DefaultMaven.doExecute(DefaultMaven.java:233)
	at org.apache.maven.DefaultMaven.execute(DefaultMaven.java:156)
	at org.apache.maven.cli.MavenCli.execute(MavenCli.java:537)
	at org.apache.maven.cli.MavenCli.doMain(MavenCli.java:196)
	at org.apache.maven.cli.MavenCli.main(MavenCli.java:141)
	at sun.reflect.NativeMethodAccessorImpl.invoke0(Native Method)
	at sun.reflect.NativeMethodAccessorImpl.invoke(NativeMethodAccessorImpl.java:39)
	at sun.reflect.DelegatingMethodAccessorImpl.invoke(DelegatingMethodAccessorImpl.java:25)
	at java.lang.reflect.Method.invoke(Method.java:597)
	at org.codehaus.plexus.classworlds.launcher.Launcher.launchEnhanced(Launcher.java:290)
	at org.codehaus.plexus.classworlds.launcher.Launcher.launch(Launcher.java:230)
	at org.codehaus.plexus.classworlds.launcher.Launcher.mainWithExitCode(Launcher.java:409)
	at org.codehaus.plexus.classworlds.launcher.Launcher.main(Launcher.java:352)
[ERROR]   
[ERROR]   The project org.eclipse.linuxtools:linuxtools-parent:0.10.0-SNAPSHOT (<https://hudson.eclipse.org/hudson/job/linuxtools-Indigo/ws/pom.xml)> has 1 error
[ERROR]     Unresolveable build extension: Plugin org.eclipse.tycho:tycho-maven-plugin:0.14.1 or one of its dependencies could not be resolved: Failed to collect dependencies for org.eclipse.tycho:tycho-maven-plugin:jar:0.14.1 (): Failed to read artifact descriptor for org.eclipse.tycho:tycho-maven-plugin:jar:0.14.1: Could not transfer artifact org.eclipse.tycho:tycho-maven-plugin:pom:0.14.1 from/to central (http://repo1.maven.org/maven2): Error transferring file: Connection timed out -> [Help 2]
org.apache.maven.plugin.PluginResolutionException: Plugin org.eclipse.tycho:tycho-maven-plugin:0.14.1 or one of its dependencies could not be resolved: Failed to collect dependencies for org.eclipse.tycho:tycho-maven-plugin:jar:0.14.1 ()
	at org.apache.maven.plugin.internal.DefaultPluginDependenciesResolver.resolve(DefaultPluginDependenciesResolver.java:211)
	at org.apache.maven.project.DefaultProjectBuildingHelper.resolveExtensionArtifacts(DefaultProjectBuildingHelper.java:377)
	at org.apache.maven.project.DefaultProjectBuildingHelper.createProjectRealm(DefaultProjectBuildingHelper.java:237)
	at org.apache.maven.project.DefaultModelBuildingListener.buildExtensionsAssembled(DefaultModelBuildingListener.java:106)
	at org.apache.maven.model.building.ModelBuildingEventCatapult$1.fire(ModelBuildingEventCatapult.java:43)
	at org.apache.maven.model.building.DefaultModelBuilder.fireEvent(DefaultModelBuilder.java:1041)
	at org.apache.maven.model.building.DefaultModelBuilder.build(DefaultModelBuilder.java:391)
	at org.apache.maven.model.building.DefaultModelBuilder.build(DefaultModelBuilder.java:374)
	at org.apache.maven.project.DefaultProjectBuilder.build(DefaultProjectBuilder.java:536)
	at org.apache.maven.project.DefaultProjectBuilder.build(DefaultProjectBuilder.java:328)
	at org.apache.maven.DefaultMaven.collectProjects(DefaultMaven.java:632)
	at org.apache.maven.DefaultMaven.getProjectsForMavenReactor(DefaultMaven.java:581)
	at org.apache.maven.DefaultMaven.doExecute(DefaultMaven.java:233)
	at org.apache.maven.DefaultMaven.execute(DefaultMaven.java:156)
	at org.apache.maven.cli.MavenCli.execute(MavenCli.java:537)
	at org.apache.maven.cli.MavenCli.doMain(MavenCli.java:196)
	at org.apache.maven.cli.MavenCli.main(MavenCli.java:141)
	at sun.reflect.NativeMethodAccessorImpl.invoke0(Native Method)
	at sun.reflect.NativeMethodAccessorImpl.invoke(NativeMethodAccessorImpl.java:39)
	at sun.reflect.DelegatingMethodAccessorImpl.invoke(DelegatingMethodAccessorImpl.java:25)
	at java.lang.reflect.Method.invoke(Method.java:597)
	at org.codehaus.plexus.classworlds.launcher.Launcher.launchEnhanced(Launcher.java:290)
	at org.codehaus.plexus.classworlds.launcher.Launcher.launch(Launcher.java:230)
	at org.codehaus.plexus.classworlds.launcher.Launcher.mainWithExitCode(Launcher.java:409)
	at org.codehaus.plexus.classworlds.launcher.Launcher.main(Launcher.java:352)
Caused by: org.sonatype.aether.collection.DependencyCollectionException: Failed to collect dependencies for org.eclipse.tycho:tycho-maven-plugin:jar:0.14.1 ()
	at org.sonatype.aether.impl.internal.DefaultDependencyCollector.collectDependencies(DefaultDependencyCollector.java:202)
	at org.sonatype.aether.impl.internal.DefaultRepositorySystem.collectDependencies(DefaultRepositorySystem.java:345)
	at org.apache.maven.plugin.internal.DefaultPluginDependenciesResolver.resolve(DefaultPluginDependenciesResolver.java:199)
	... 24 more
Caused by: org.sonatype.aether.resolution.ArtifactDescriptorException: Failed to read artifact descriptor for org.eclipse.tycho:tycho-maven-plugin:jar:0.14.1
	at org.apache.maven.repository.internal.DefaultArtifactDescriptorReader.loadPom(DefaultArtifactDescriptorReader.java:282)
	at org.apache.maven.repository.internal.DefaultArtifactDescriptorReader.readArtifactDescriptor(DefaultArtifactDescriptorReader.java:172)
	at org.sonatype.aether.impl.internal.DefaultDependencyCollector.collectDependencies(DefaultDependencyCollector.java:196)
	... 26 more
Caused by: org.sonatype.aether.resolution.ArtifactResolutionException: Could not transfer artifact org.eclipse.tycho:tycho-maven-plugin:pom:0.14.1 from/to central (http://repo1.maven.org/maven2): Error transferring file: Connection timed out
	at org.sonatype.aether.impl.internal.DefaultArtifactResolver.resolve(DefaultArtifactResolver.java:541)
	at org.sonatype.aether.impl.internal.DefaultArtifactResolver.resolveArtifacts(DefaultArtifactResolver.java:220)
	at org.sonatype.aether.impl.internal.DefaultArtifactResolver.resolveArtifact(DefaultArtifactResolver.java:197)
	at org.apache.maven.repository.internal.DefaultArtifactDescriptorReader.loadPom(DefaultArtifactDescriptorReader.java:267)
	... 28 more
Caused by: org.sonatype.aether.transfer.ArtifactTransferException: Could not transfer artifact org.eclipse.tycho:tycho-maven-plugin:pom:0.14.1 from/to central (http://repo1.maven.org/maven2): Error transferring file: Connection timed out
	at org.sonatype.aether.connector.wagon.WagonRepositoryConnector$4.wrap(WagonRepositoryConnector.java:949)
	at org.sonatype.aether.connector.wagon.WagonRepositoryConnector$4.wrap(WagonRepositoryConnector.java:940)
	at org.sonatype.aether.connector.wagon.WagonRepositoryConnector$GetTask.flush(WagonRepositoryConnector.java:695)
	at org.sonatype.aether.connector.wagon.WagonRepositoryConnector$GetTask.flush(WagonRepositoryConnector.java:689)
	at org.sonatype.aether.connector.wagon.WagonRepositoryConnector.get(WagonRepositoryConnector.java:445)
	at org.sonatype.aether.impl.internal.DefaultArtifactResolver.resolve(DefaultArtifactResolver.java:460)
	... 31 more
Caused by: org.apache.maven.wagon.TransferFailedException: Error transferring file: Connection timed out
	at org.apache.maven.wagon.providers.http.LightweightHttpWagon.fillInputData(LightweightHttpWagon.java:143)
	at org.apache.maven.wagon.StreamWagon.getInputStream(StreamWagon.java:116)
	at org.apache.maven.wagon.StreamWagon.getIfNewer(StreamWagon.java:88)
	at org.apache.maven.wagon.StreamWagon.get(StreamWagon.java:61)
	at org.sonatype.aether.connector.wagon.WagonRepositoryConnector$GetTask.run(WagonRepositoryConnector.java:608)
	at org.sonatype.aether.util.concurrency.RunnableErrorForwarder$1.run(RunnableErrorForwarder.java:64)
	at java.util.concurrent.ThreadPoolExecutor$Worker.runTask(ThreadPoolExecutor.java:886)
	at java.util.concurrent.ThreadPoolExecutor$Worker.run(ThreadPoolExecutor.java:908)
	at java.lang.Thread.run(Thread.java:619)
Caused by: java.net.ConnectException: Connection timed out
	at java.net.PlainSocketImpl.socketConnect(Native Method)
	at java.net.PlainSocketImpl.doConnect(PlainSocketImpl.java:333)
	at java.net.PlainSocketImpl.connectToAddress(PlainSocketImpl.java:195)
	at java.net.PlainSocketImpl.connect(PlainSocketImpl.java:182)
	at java.net.SocksSocketImpl.connect(SocksSocketImpl.java:366)
	at java.net.Socket.connect(Socket.java:529)
	at java.net.Socket.connect(Socket.java:478)
	at sun.net.NetworkClient.doConnect(NetworkClient.java:163)
	at sun.net.www.http.HttpClient.openServer(HttpClient.java:394)
	at sun.net.www.http.HttpClient.openServer(HttpClient.java:529)
	at sun.net.www.http.HttpClient.<init>(HttpClient.java:233)
	at sun.net.www.http.HttpClient.New(HttpClient.java:306)
	at sun.net.www.protocol.http.HttpURLConnection.getNewHttpClient(HttpURLConnection.java:867)
	at sun.net.www.protocol.http.HttpURLConnection.plainConnect(HttpURLConnection.java:815)
	at sun.net.www.protocol.http.HttpURLConnection.connect(HttpURLConnection.java:726)
	at sun.net.www.protocol.http.HttpURLConnection.getInputStream(HttpURLConnection.java:1049)
	at java.net.HttpURLConnection.getResponseCode(HttpURLConnection.java:373)
	at org.apache.maven.wagon.providers.http.LightweightHttpWagon.fillInputData(LightweightHttpWagon.java:115)
	... 8 more
[ERROR] 
[ERROR] Re-run Maven using the -X switch to enable full debug logging.
[ERROR] 
[ERROR] For more information about the errors and possible solutions, please read the following articles:
[ERROR] [Help 1] http://cwiki.apache.org/confluence/display/MAVEN/ProjectBuildingException
[ERROR] [Help 2] http://cwiki.apache.org/confluence/display/MAVEN/PluginResolutionException
[INFO] Build failures were ignored.
Terminating xvnc.
[DRY] Collecting duplicate code analysis files...
[FINDBUGS] Collecting findbugs analysis files...
Recording test results
No test report files were found. Configuration error?
Archiving artifacts