[Date Prev][Date Next][Thread Prev][Thread Next][Date Index][Thread Index] [List Home]
[wtp-releng] Build failed in Jenkins: webtools-common_master #330

See <https://ci.eclipse.org/webtools/job/webtools-common_master/330/display/redirect>

------------------------------------------
[...truncated 321.56 KB...]
Downloading from tycho: https://oss.sonatype.org/content/repositories/public/org/apache/geronimo/genesis/genesis-java5-flava/2.0/genesis-java5-flava-2.0.pom
Downloading from cbi-repo: https://repo.eclipse.org/content/repositories/cbi/org/apache/geronimo/genesis/genesis-java5-flava/2.0/genesis-java5-flava-2.0.pom
Downloading from tycho-snapshot: https://repo.eclipse.org/content/repositories/tycho-snapshots/org/apache/geronimo/genesis/genesis-java5-flava/2.0/genesis-java5-flava-2.0.pom
Downloading from sonatype-public-grid: https://repository.sonatype.org/content/groups/sonatype-public-grid/org/apache/geronimo/genesis/genesis-java5-flava/2.0/genesis-java5-flava-2.0.pom
Progress (1): 4.1/5.5 kBProgress (1): 5.5 kB                        Downloaded from sonatype-public-grid: https://repository.sonatype.org/content/groups/sonatype-public-grid/org/apache/geronimo/genesis/genesis-java5-flava/2.0/genesis-java5-flava-2.0.pom (5.5 kB at 67 kB/s)
Downloading from tycho: https://oss.sonatype.org/content/repositories/public/org/apache/geronimo/genesis/genesis-default-flava/2.0/genesis-default-flava-2.0.pom
Downloading from cbi-repo: https://repo.eclipse.org/content/repositories/cbi/org/apache/geronimo/genesis/genesis-default-flava/2.0/genesis-default-flava-2.0.pom
Downloading from tycho-snapshot: https://repo.eclipse.org/content/repositories/tycho-snapshots/org/apache/geronimo/genesis/genesis-default-flava/2.0/genesis-default-flava-2.0.pom
Downloading from sonatype-public-grid: https://repository.sonatype.org/content/groups/sonatype-public-grid/org/apache/geronimo/genesis/genesis-default-flava/2.0/genesis-default-flava-2.0.pom
Progress (1): 4.1/18 kBProgress (1): 7.9/18 kBProgress (1): 12/18 kB Progress (1): 16/18 kBProgress (1): 18 kB                      Downloaded from sonatype-public-grid: https://repository.sonatype.org/content/groups/sonatype-public-grid/org/apache/geronimo/genesis/genesis-default-flava/2.0/genesis-default-flava-2.0.pom (18 kB at 231 kB/s)
Downloading from tycho: https://oss.sonatype.org/content/repositories/public/org/apache/geronimo/genesis/genesis/2.0/genesis-2.0.pom
Downloading from cbi-repo: https://repo.eclipse.org/content/repositories/cbi/org/apache/geronimo/genesis/genesis/2.0/genesis-2.0.pom
Downloading from tycho-snapshot: https://repo.eclipse.org/content/repositories/tycho-snapshots/org/apache/geronimo/genesis/genesis/2.0/genesis-2.0.pom
Downloading from sonatype-public-grid: https://repository.sonatype.org/content/groups/sonatype-public-grid/org/apache/geronimo/genesis/genesis/2.0/genesis-2.0.pom
Progress (1): 4.1/18 kBProgress (1): 7.9/18 kBProgress (1): 12/18 kB Progress (1): 16/18 kBProgress (1): 18 kB                      Downloaded from sonatype-public-grid: https://repository.sonatype.org/content/groups/sonatype-public-grid/org/apache/geronimo/genesis/genesis/2.0/genesis-2.0.pom (18 kB at 236 kB/s)
Downloading from tycho: https://oss.sonatype.org/content/repositories/public/com/google/collections/google-collections/1.0/google-collections-1.0.pom
Downloading from cbi-repo: https://repo.eclipse.org/content/repositories/cbi/com/google/collections/google-collections/1.0/google-collections-1.0.pom
Downloading from tycho-snapshot: https://repo.eclipse.org/content/repositories/tycho-snapshots/com/google/collections/google-collections/1.0/google-collections-1.0.pom
Downloading from sonatype-public-grid: https://repository.sonatype.org/content/groups/sonatype-public-grid/com/google/collections/google-collections/1.0/google-collections-1.0.pom
Progress (1): 2.5 kB                    Downloaded from sonatype-public-grid: https://repository.sonatype.org/content/groups/sonatype-public-grid/com/google/collections/google-collections/1.0/google-collections-1.0.pom (2.5 kB at 32 kB/s)
Downloading from tycho: https://oss.sonatype.org/content/repositories/public/com/google/google/1/google-1.pom
Downloading from cbi-repo: https://repo.eclipse.org/content/repositories/cbi/com/google/google/1/google-1.pom
Downloading from tycho-snapshot: https://repo.eclipse.org/content/repositories/tycho-snapshots/com/google/google/1/google-1.pom
Downloading from sonatype-public-grid: https://repository.sonatype.org/content/groups/sonatype-public-grid/com/google/google/1/google-1.pom
Progress (1): 1.6 kB                    Downloaded from sonatype-public-grid: https://repository.sonatype.org/content/groups/sonatype-public-grid/com/google/google/1/google-1.pom (1.6 kB at 18 kB/s)
Downloading from tycho: https://oss.sonatype.org/content/repositories/public/org/apache/maven/maven-project/2.2.1/maven-project-2.2.1.pom
Downloading from cbi-repo: https://repo.eclipse.org/content/repositories/cbi/org/apache/maven/maven-project/2.2.1/maven-project-2.2.1.pom
Downloading from tycho-snapshot: https://repo.eclipse.org/content/repositories/tycho-snapshots/org/apache/maven/maven-project/2.2.1/maven-project-2.2.1.pom
Downloading from sonatype-public-grid: https://repository.sonatype.org/content/groups/sonatype-public-grid/org/apache/maven/maven-project/2.2.1/maven-project-2.2.1.pom
Progress (1): 2.8 kB                    Downloaded from sonatype-public-grid: https://repository.sonatype.org/content/groups/sonatype-public-grid/org/apache/maven/maven-project/2.2.1/maven-project-2.2.1.pom (2.8 kB at 37 kB/s)
Downloading from tycho: https://oss.sonatype.org/content/repositories/public/org/apache/maven/maven-profile/2.2.1/maven-profile-2.2.1.pom
Downloading from cbi-repo: https://repo.eclipse.org/content/repositories/cbi/org/apache/maven/maven-profile/2.2.1/maven-profile-2.2.1.pom
Downloading from tycho-snapshot: https://repo.eclipse.org/content/repositories/tycho-snapshots/org/apache/maven/maven-profile/2.2.1/maven-profile-2.2.1.pom
Downloading from sonatype-public-grid: https://repository.sonatype.org/content/groups/sonatype-public-grid/org/apache/maven/maven-profile/2.2.1/maven-profile-2.2.1.pom
Progress (1): 2.2 kB                    Downloaded from sonatype-public-grid: https://repository.sonatype.org/content/groups/sonatype-public-grid/org/apache/maven/maven-profile/2.2.1/maven-profile-2.2.1.pom (2.2 kB at 29 kB/s)
Downloading from tycho: https://oss.sonatype.org/content/repositories/public/org/codehaus/plexus/plexus-interpolation/1.11/plexus-interpolation-1.11.pom
Downloading from cbi-repo: https://repo.eclipse.org/content/repositories/cbi/org/codehaus/plexus/plexus-interpolation/1.11/plexus-interpolation-1.11.pom
Downloading from tycho-snapshot: https://repo.eclipse.org/content/repositories/tycho-snapshots/org/codehaus/plexus/plexus-interpolation/1.11/plexus-interpolation-1.11.pom
Downloading from sonatype-public-grid: https://repository.sonatype.org/content/groups/sonatype-public-grid/org/codehaus/plexus/plexus-interpolation/1.11/plexus-interpolation-1.11.pom
Progress (1): 889 B                   Downloaded from sonatype-public-grid: https://repository.sonatype.org/content/groups/sonatype-public-grid/org/codehaus/plexus/plexus-interpolation/1.11/plexus-interpolation-1.11.pom (889 B at 11 kB/s)
Downloading from tycho: https://oss.sonatype.org/content/repositories/public/org/codehaus/plexus/plexus-components/1.1.14/plexus-components-1.1.14.pom
Downloading from cbi-repo: https://repo.eclipse.org/content/repositories/cbi/org/codehaus/plexus/plexus-components/1.1.14/plexus-components-1.1.14.pom
Downloading from tycho-snapshot: https://repo.eclipse.org/content/repositories/tycho-snapshots/org/codehaus/plexus/plexus-components/1.1.14/plexus-components-1.1.14.pom
Downloading from sonatype-public-grid: https://repository.sonatype.org/content/groups/sonatype-public-grid/org/codehaus/plexus/plexus-components/1.1.14/plexus-components-1.1.14.pom
Progress (1): 4.1/5.8 kBProgress (1): 5.8 kB                        Downloaded from sonatype-public-grid: https://repository.sonatype.org/content/groups/sonatype-public-grid/org/codehaus/plexus/plexus-components/1.1.14/plexus-components-1.1.14.pom (5.8 kB at 78 kB/s)
Downloading from tycho: https://oss.sonatype.org/content/repositories/public/org/codehaus/plexus/plexus/2.0.2/plexus-2.0.2.pom
Downloading from cbi-repo: https://repo.eclipse.org/content/repositories/cbi/org/codehaus/plexus/plexus/2.0.2/plexus-2.0.2.pom
Downloading from tycho-snapshot: https://repo.eclipse.org/content/repositories/tycho-snapshots/org/codehaus/plexus/plexus/2.0.2/plexus-2.0.2.pom
Downloading from sonatype-public-grid: https://repository.sonatype.org/content/groups/sonatype-public-grid/org/codehaus/plexus/plexus/2.0.2/plexus-2.0.2.pom
Progress (1): 4.1/12 kBProgress (1): 7.9/12 kBProgress (1): 12 kB                       Downloaded from sonatype-public-grid: https://repository.sonatype.org/content/groups/sonatype-public-grid/org/codehaus/plexus/plexus/2.0.2/plexus-2.0.2.pom (12 kB at 45 kB/s)
Downloading from tycho: https://oss.sonatype.org/content/repositories/public/org/apache/maven/maven-artifact-manager/2.2.1/maven-artifact-manager-2.2.1.pom
Downloading from cbi-repo: https://repo.eclipse.org/content/repositories/cbi/org/apache/maven/maven-artifact-manager/2.2.1/maven-artifact-manager-2.2.1.pom
Downloading from tycho-snapshot: https://repo.eclipse.org/content/repositories/tycho-snapshots/org/apache/maven/maven-artifact-manager/2.2.1/maven-artifact-manager-2.2.1.pom
Downloading from sonatype-public-grid: https://repository.sonatype.org/content/groups/sonatype-public-grid/org/apache/maven/maven-artifact-manager/2.2.1/maven-artifact-manager-2.2.1.pom
Progress (1): 3.1 kB                    Downloaded from sonatype-public-grid: https://repository.sonatype.org/content/groups/sonatype-public-grid/org/apache/maven/maven-artifact-manager/2.2.1/maven-artifact-manager-2.2.1.pom (3.1 kB at 39 kB/s)
Downloading from tycho: https://oss.sonatype.org/content/repositories/public/org/apache/maven/maven-repository-metadata/2.2.1/maven-repository-metadata-2.2.1.pom
Downloading from cbi-repo: https://repo.eclipse.org/content/repositories/cbi/org/apache/maven/maven-repository-metadata/2.2.1/maven-repository-metadata-2.2.1.pom
Downloading from tycho-snapshot: https://repo.eclipse.org/content/repositories/tycho-snapshots/org/apache/maven/maven-repository-metadata/2.2.1/maven-repository-metadata-2.2.1.pom
Downloading from sonatype-public-grid: https://repository.sonatype.org/content/groups/sonatype-public-grid/org/apache/maven/maven-repository-metadata/2.2.1/maven-repository-metadata-2.2.1.pom
Progress (1): 1.9 kB                    Downloaded from sonatype-public-grid: https://repository.sonatype.org/content/groups/sonatype-public-grid/org/apache/maven/maven-repository-metadata/2.2.1/maven-repository-metadata-2.2.1.pom (1.9 kB at 24 kB/s)
Downloading from tycho: https://oss.sonatype.org/content/repositories/public/backport-util-concurrent/backport-util-concurrent/3.1/backport-util-concurrent-3.1.pom
Downloading from cbi-repo: https://repo.eclipse.org/content/repositories/cbi/backport-util-concurrent/backport-util-concurrent/3.1/backport-util-concurrent-3.1.pom
Downloading from tycho-snapshot: https://repo.eclipse.org/content/repositories/tycho-snapshots/backport-util-concurrent/backport-util-concurrent/3.1/backport-util-concurrent-3.1.pom
Downloading from sonatype-public-grid: https://repository.sonatype.org/content/groups/sonatype-public-grid/backport-util-concurrent/backport-util-concurrent/3.1/backport-util-concurrent-3.1.pom
Progress (1): 880 B                   Downloaded from sonatype-public-grid: https://repository.sonatype.org/content/groups/sonatype-public-grid/backport-util-concurrent/backport-util-concurrent/3.1/backport-util-concurrent-3.1.pom (880 B at 3.5 kB/s)
Downloading from tycho: https://oss.sonatype.org/content/repositories/public/org/apache/maven/maven-plugin-registry/2.2.1/maven-plugin-registry-2.2.1.pom
Downloading from cbi-repo: https://repo.eclipse.org/content/repositories/cbi/org/apache/maven/maven-plugin-registry/2.2.1/maven-plugin-registry-2.2.1.pom
Downloading from tycho-snapshot: https://repo.eclipse.org/content/repositories/tycho-snapshots/org/apache/maven/maven-plugin-registry/2.2.1/maven-plugin-registry-2.2.1.pom
Downloading from sonatype-public-grid: https://repository.sonatype.org/content/groups/sonatype-public-grid/org/apache/maven/maven-plugin-registry/2.2.1/maven-plugin-registry-2.2.1.pom
Progress (1): 1.9 kB                    Downloaded from sonatype-public-grid: https://repository.sonatype.org/content/groups/sonatype-public-grid/org/apache/maven/maven-plugin-registry/2.2.1/maven-plugin-registry-2.2.1.pom (1.9 kB at 26 kB/s)
Downloading from tycho: https://oss.sonatype.org/content/repositories/public/org/apache/maven/maven-toolchain/2.2.1/maven-toolchain-2.2.1.pom
Downloading from cbi-repo: https://repo.eclipse.org/content/repositories/cbi/org/apache/maven/maven-toolchain/2.2.1/maven-toolchain-2.2.1.pom
Downloading from tycho-snapshot: https://repo.eclipse.org/content/repositories/tycho-snapshots/org/apache/maven/maven-toolchain/2.2.1/maven-toolchain-2.2.1.pom
Downloading from sonatype-public-grid: https://repository.sonatype.org/content/groups/sonatype-public-grid/org/apache/maven/maven-toolchain/2.2.1/maven-toolchain-2.2.1.pom
Progress (1): 3.3 kB                    Downloaded from sonatype-public-grid: https://repository.sonatype.org/content/groups/sonatype-public-grid/org/apache/maven/maven-toolchain/2.2.1/maven-toolchain-2.2.1.pom (3.3 kB at 45 kB/s)
Downloading from tycho: https://oss.sonatype.org/content/repositories/public/org/apache/commons/commons-lang3/3.1/commons-lang3-3.1.pom
Downloading from cbi-repo: https://repo.eclipse.org/content/repositories/cbi/org/apache/commons/commons-lang3/3.1/commons-lang3-3.1.pom
Downloading from tycho-snapshot: https://repo.eclipse.org/content/repositories/tycho-snapshots/org/apache/commons/commons-lang3/3.1/commons-lang3-3.1.pom
Downloading from sonatype-public-grid: https://repository.sonatype.org/content/groups/sonatype-public-grid/org/apache/commons/commons-lang3/3.1/commons-lang3-3.1.pom
Progress (1): 4.1/17 kBProgress (1): 7.9/17 kBProgress (1): 12/17 kB Progress (1): 16/17 kBProgress (1): 17 kB                      Downloaded from sonatype-public-grid: https://repository.sonatype.org/content/groups/sonatype-public-grid/org/apache/commons/commons-lang3/3.1/commons-lang3-3.1.pom (17 kB at 59 kB/s)
Downloading from tycho: https://oss.sonatype.org/content/repositories/public/org/apache/commons/commons-parent/22/commons-parent-22.pom
Downloading from cbi-repo: https://repo.eclipse.org/content/repositories/cbi/org/apache/commons/commons-parent/22/commons-parent-22.pom
Downloading from tycho-snapshot: https://repo.eclipse.org/content/repositories/tycho-snapshots/org/apache/commons/commons-parent/22/commons-parent-22.pom
Downloading from sonatype-public-grid: https://repository.sonatype.org/content/groups/sonatype-public-grid/org/apache/commons/commons-parent/22/commons-parent-22.pom
Progress (1): 4.1/42 kBProgress (1): 7.9/42 kBProgress (1): 12/42 kB Progress (1): 16/42 kBProgress (1): 20/42 kBProgress (1): 20/42 kBProgress (1): 24/42 kBProgress (1): 28/42 kBProgress (1): 32/42 kBProgress (1): 37/42 kBProgress (1): 41/42 kBProgress (1): 42 kB                      Downloaded from sonatype-public-grid: https://repository.sonatype.org/content/groups/sonatype-public-grid/org/apache/commons/commons-parent/22/commons-parent-22.pom (42 kB at 392 kB/s)
Downloading from tycho: https://oss.sonatype.org/content/repositories/public/org/eclipse/tycho/org.eclipse.tycho.surefire.osgibooter/1.2.0/org.eclipse.tycho.surefire.osgibooter-1.2.0.jar
Downloading from tycho: https://oss.sonatype.org/content/repositories/public/org/eclipse/tycho/org.eclipse.tycho.surefire.junit/1.2.0/org.eclipse.tycho.surefire.junit-1.2.0.jar
Downloading from tycho: https://oss.sonatype.org/content/repositories/public/org/eclipse/tycho/org.eclipse.tycho.surefire.junit5/1.2.0/org.eclipse.tycho.surefire.junit5-1.2.0.jar
Downloading from tycho: https://oss.sonatype.org/content/repositories/public/org/eclipse/tycho/org.eclipse.tycho.surefire.junit47/1.2.0/org.eclipse.tycho.surefire.junit47-1.2.0.jar
Downloading from tycho: https://oss.sonatype.org/content/repositories/public/org/eclipse/tycho/org.eclipse.tycho.surefire.junit4/1.2.0/org.eclipse.tycho.surefire.junit4-1.2.0.jar
Progress (1): 4.1/25 kBProgress (1): 7.8/25 kBProgress (1): 12/25 kB Progress (1): 12/25 kBProgress (2): 12/25 kB | 4.1/181 kBProgress (2): 12/25 kB | 7.8/181 kBProgress (2): 12/25 kB | 12/181 kB Progress (2): 12/25 kB | 12/181 kBProgress (3): 12/25 kB | 12/181 kB | 4.1/496 kBProgress (3): 12/25 kB | 12/181 kB | 7.8/496 kBProgress (3): 12/25 kB | 12/181 kB | 12/496 kB Progress (3): 12/25 kB | 12/181 kB | 12/496 kBProgress (3): 16/25 kB | 12/181 kB | 12/496 kBProgress (3): 20/25 kB | 12/181 kB | 12/496 kBProgress (3): 24/25 kB | 12/181 kB | 12/496 kBProgress (3): 25 kB | 12/181 kB | 12/496 kB   Progress (4): 25 kB | 12/181 kB | 12/496 kB | 4.1/411 kBProgress (4): 25 kB | 12/181 kB | 12/496 kB | 7.8/411 kBProgress (4): 25 kB | 12/181 kB | 12/496 kB | 12/411 kB Progress (4): 25 kB | 12/181 kB | 12/496 kB | 16/411 kBProgress (4): 25 kB | 12/181 kB | 12/496 kB | 20/411 kBProgress (4): 25 kB | 12/181 kB | 12/496 kB | 24/411 kBProgress (4): 25 kB | 12/181 kB | 12/496 kB | 28/411 kBProgress (4): 25 kB | 12/181 kB | 12/496 kB | 32/411 kBProgress (4): 25 kB | 16/181 kB | 12/496 kB | 32/411 kBProgress (4): 25 kB | 20/181 kB | 12/496 kB | 32/411 kBProgress (4): 25 kB | 21/181 kB | 12/496 kB | 32/411 kBProgress (5): 25 kB | 21/181 kB | 12/496 kB | 32/411 kB | 4.1/58 kBProgress (5): 25 kB | 25/181 kB | 12/496 kB | 32/411 kB | 4.1/58 kBProgress (5): 25 kB | 29/181 kB | 12/496 kB | 32/411 kB | 4.1/58 kBProgress (5): 25 kB | 33/181 kB | 12/496 kB | 32/411 kB | 4.1/58 kBProgress (5): 25 kB | 37/181 kB | 12/496 kB | 32/411 kB | 4.1/58 kBProgress (5): 25 kB | 37/181 kB | 16/496 kB | 32/411 kB | 4.1/58 kBProgress (5): 25 kB | 37/181 kB | 20/496 kB | 32/411 kB | 4.1/58 kBProgress (5): 25 kB | 37/181 kB | 24/496 kB | 32/411 kB | 4.1/58 kBProgress (5): 25 kB | 37/181 kB | 28/496 kB | 32/411 kB | 4.1/58 kBProgress (5): 25 kB | 37/181 kB | 32/496 kB | 32/411 kB | 4.1/58 kBProgress (5): 25 kB | 37/181 kB | 33/496 kB | 32/411 kB | 4.1/58 kBProgress (5): 25 kB | 37/181 kB | 33/496 kB | 37/411 kB | 4.1/58 kBProgress (5): 25 kB | 37/181 kB | 33/496 kB | 41/411 kB | 4.1/58 kBProgress (5): 25 kB | 37/181 kB | 33/496 kB | 45/411 kB | 4.1/58 kBProgress (5): 25 kB | 37/181 kB | 33/496 kB | 45/411 kB | 4.1/58 kBProgress (5): 25 kB | 37/181 kB | 33/496 kB | 49/411 kB | 4.1/58 kBProgress (5): 25 kB | 37/181 kB | 33/496 kB | 53/411 kB | 4.1/58 kBProgress (5): 25 kB | 37/181 kB | 33/496 kB | 57/411 kB | 4.1/58 kBProgress (5): 25 kB | 37/181 kB | 33/496 kB | 61/411 kB | 4.1/58 kBProgress (5): 25 kB | 37/181 kB | 33/496 kB | 61/411 kB | 7.8/58 kBProgress (5): 25 kB | 37/181 kB | 33/496 kB | 61/411 kB | 12/58 kB Progress (5): 25 kB | 37/181 kB | 33/496 kB | 61/411 kB | 16/58 kBProgress (5): 25 kB | 37/181 kB | 33/496 kB | 61/411 kB | 20/58 kBProgress (5): 25 kB | 37/181 kB | 33/496 kB | 61/411 kB | 21/58 kBProgress (5): 25 kB | 41/181 kB | 33/496 kB | 61/411 kB | 21/58 kBProgress (5): 25 kB | 45/181 kB | 33/496 kB | 61/411 kB | 21/58 kBProgress (5): 25 kB | 50/181 kB | 33/496 kB | 61/411 kB | 21/58 kBProgress (5): 25 kB | 50/181 kB | 33/496 kB | 61/411 kB | 25/58 kBProgress (5): 25 kB | 54/181 kB | 33/496 kB | 61/411 kB | 25/58 kBProgress (5): 25 kB | 54/181 kB | 33/496 kB | 61/411 kB | 29/58 kBProgress (5): 25 kB | 54/181 kB | 33/496 kB | 61/411 kB | 33/58 kBProgress (5): 25 kB | 54/181 kB | 33/496 kB | 61/411 kB | 37/58 kBProgress (5): 25 kB | 54/181 kB | 33/496 kB | 61/411 kB | 39/58 kBProgress (5): 25 kB | 54/181 kB | 33/496 kB | 61/411 kB | 43/58 kBProgress (5): 25 kB | 54/181 kB | 33/496 kB | 61/411 kB | 47/58 kBProgress (5): 25 kB | 54/181 kB | 33/496 kB | 61/411 kB | 51/58 kBProgress (5): 25 kB | 54/181 kB | 33/496 kB | 61/411 kB | 55/58 kBProgress (5): 25 kB | 54/181 kB | 33/496 kB | 61/411 kB | 58 kB   Progress (5): 25 kB | 54/181 kB | 37/496 kB | 61/411 kB | 58 kBProgress (5): 25 kB | 54/181 kB | 41/496 kB | 61/411 kB | 58 kBProgress (5): 25 kB | 54/181 kB | 45/496 kB | 61/411 kB | 58 kBProgress (5): 25 kB | 54/181 kB | 49/496 kB | 61/411 kB | 58 kBProgress (5): 25 kB | 54/181 kB | 53/496 kB | 61/411 kB | 58 kBProgress (5): 25 kB | 54/181 kB | 57/496 kB | 61/411 kB | 58 kBProgress (5): 25 kB | 54/181 kB | 57/496 kB | 66/411 kB | 58 kBProgress (5): 25 kB | 54/181 kB | 57/496 kB | 70/411 kB | 58 kBProgress (5): 25 kB | 54/181 kB | 57/496 kB | 74/411 kB | 58 kBProgress (5): 25 kB | 54/181 kB | 57/496 kB | 78/411 kB | 58 kBProgress (5): 25 kB | 54/181 kB | 57/496 kB | 82/411 kB | 58 kBProgress (5): 25 kB | 54/181 kB | 57/496 kB | 86/411 kB | 58 kBProgress (5): 25 kB | 54/181 kB | 57/496 kB | 90/411 kB | 58 kBProgress (5): 25 kB | 54/181 kB | 57/496 kB | 94/411 kB | 58 kBProgress (5): 25 kB | 54/181 kB | 57/496 kB | 98/411 kB | 58 kBProgress (5): 25 kB | 54/181 kB | 57/496 kB | 102/411 kB | 58 kBProgress (5): 25 kB | 54/181 kB | 57/496 kB | 106/411 kB | 58 kBProgress (5): 25 kB | 54/181 kB | 57/496 kB | 111/411 kB | 58 kBProgress (5): 25 kB | 58/181 kB | 57/496 kB | 111/411 kB | 58 kBProgress (5): 25 kB | 62/181 kB | 57/496 kB | 111/411 kB | 58 kBProgress (5): 25 kB | 66/181 kB | 57/496 kB | 111/411 kB | 58 kBProgress (5): 25 kB | 70/181 kB | 57/496 kB | 111/411 kB | 58 kBProgress (5): 25 kB | 74/181 kB | 57/496 kB | 111/411 kB | 58 kBProgress (5): 25 kB | 78/181 kB | 57/496 kB | 111/411 kB | 58 kBProgress (5): 25 kB | 82/181 kB | 57/496 kB | 111/411 kB | 58 kBProgress (5): 25 kB | 86/181 kB | 57/496 kB | 111/411 kB | 58 kBProgress (5): 25 kB | 91/181 kB | 57/496 kB | 111/411 kB | 58 kBProgress (5): 25 kB | 95/181 kB | 57/496 kB | 111/411 kB | 58 kBProgress (5): 25 kB | 99/181 kB | 57/496 kB | 111/411 kB | 58 kBProgress (5): 25 kB | 103/181 kB | 57/496 kB | 111/411 kB | 58 kBProgress (5): 25 kB | 107/181 kB | 57/496 kB | 111/411 kB | 58 kBProgress (5): 25 kB | 111/181 kB | 57/496 kB | 111/411 kB | 58 kBProgress (5): 25 kB | 115/181 kB | 57/496 kB | 111/411 kB | 58 kBProgress (5): 25 kB | 119/181 kB | 57/496 kB | 111/411 kB | 58 kBProgress (5): 25 kB | 119/181 kB | 61/496 kB | 111/411 kB | 58 kBProgress (5): 25 kB | 119/181 kB | 66/496 kB | 111/411 kB | 58 kBProgress (5): 25 kB | 119/181 kB | 70/496 kB | 111/411 kB | 58 kBProgress (5): 25 kB | 119/181 kB | 74/496 kB | 111/411 kB | 58 kBProgress (5): 25 kB | 119/181 kB | 78/496 kB | 111/411 kB | 58 kBProgress (5): 25 kB | 119/181 kB | 82/496 kB | 111/411 kB | 58 kBProgress (5): 25 kB | 119/181 kB | 86/496 kB | 111/411 kB | 58 kBProgress (5): 25 kB | 119/181 kB | 90/496 kB | 111/411 kB | 58 kBProgress (5): 25 kB | 119/181 kB | 90/496 kB | 115/411 kB | 58 kBProgress (5): 25 kB | 119/181 kB | 90/496 kB | 119/411 kB | 58 kBProgress (5): 25 kB | 119/181 kB | 90/496 kB | 123/411 kB | 58 kBProgress (5): 25 kB | 119/181 kB | 94/496 kB | 123/411 kB | 58 kBProgress (5): 25 kB | 119/181 kB | 94/496 kB | 127/411 kB | 58 kBProgress (5): 25 kB | 119/181 kB | 98/496 kB | 127/411 kB | 58 kBProgress (5): 25 kB | 119/181 kB | 102/496 kB | 127/411 kB | 58 kBProgress (5): 25 kB | 119/181 kB | 106/496 kB | 127/411 kB | 58 kBProgress (5): 25 kB | 119/181 kB | 106/496 kB | 131/411 kB | 58 kBProgress (5): 25 kB | 119/181 kB | 106/496 kB | 135/411 kB | 58 kBProgress (5): 25 kB | 119/181 kB | 106/496 kB | 139/411 kB | 58 kBProgress (5): 25 kB | 119/181 kB | 111/496 kB | 139/411 kB | 58 kBProgress (5): 25 kB | 119/181 kB | 111/496 kB | 143/411 kB | 58 kBProgress (5): 25 kB | 119/181 kB | 115/496 kB | 143/411 kB | 58 kBProgress (5): 25 kB | 119/181 kB | 119/496 kB | 143/411 kB | 58 kBProgress (5): 25 kB | 119/181 kB | 123/496 kB | 143/411 kB | 58 kBProgress (5): 25 kB | 119/181 kB | 123/496 kB | 147/411 kB | 58 kBProgress (5): 25 kB | 119/181 kB | 123/496 kB | 152/411 kB | 58 kBProgress (5): 25 kB | 119/181 kB | 123/496 kB | 156/411 kB | 58 kBProgress (5): 25 kB | 119/181 kB | 123/496 kB | 160/411 kB | 58 kBProgress (5): 25 kB | 119/181 kB | 127/496 kB | 160/411 kB | 58 kBProgress (5): 25 kB | 119/181 kB | 131/496 kB | 160/411 kB | 58 kBProgress (5): 25 kB | 119/181 kB | 135/496 kB | 160/411 kB | 58 kBProgress (5): 25 kB | 119/181 kB | 139/496 kB | 160/411 kB | 58 kBProgress (5): 25 kB | 123/181 kB | 139/496 kB | 160/411 kB | 58 kBProgress (5): 25 kB | 127/181 kB | 139/496 kB | 160/411 kB | 58 kBProgress (5): 25 kB | 131/181 kB | 139/496 kB | 160/411 kB | 58 kBProgress (5): 25 kB | 136/181 kB | 139/496 kB | 160/411 kB | 58 kBProgress (5): 25 kB | 140/181 kB | 139/496 kB | 160/411 kB | 58 kBProgress (5): 25 kB | 144/181 kB | 139/496 kB | 160/411 kB | 58 kBProgress (5): 25 kB | 148/181 kB | 139/496 kB | 160/411 kB | 58 kBProgress (5): 25 kB | 152/181 kB | 139/496 kB | 160/411 kB | 58 kBProgress (5): 25 kB | 156/181 kB | 139/496 kB | 160/411 kB | 58 kBProgress (5): 25 kB | 160/181 kB | 139/496 kB | 160/411 kB | 58 kBProgress (5): 25 kB | 164/181 kB | 139/496 kB | 160/411 kB | 58 kBProgress (5): 25 kB | 168/181 kB | 139/496 kB | 160/411 kB | 58 kBProgress (5): 25 kB | 172/181 kB | 139/496 kB | 160/411 kB | 58 kBProgress (5): 25 kB | 177/181 kB | 139/496 kB | 160/411 kB | 58 kBProgress (5): 25 kB | 181/181 kB | 139/496 kB | 160/411 kB | 58 kBProgress (5): 25 kB | 181 kB | 139/496 kB | 160/411 kB | 58 kB    Progress (5): 25 kB | 181 kB | 143/496 kB | 160/411 kB | 58 kBProgress (5): 25 kB | 181 kB | 143/496 kB | 164/411 kB | 58 kBProgress (5): 25 kB | 181 kB | 147/496 kB | 164/411 kB | 58 kBProgress (5): 25 kB | 181 kB | 147/496 kB | 168/411 kB | 58 kBProgress (5): 25 kB | 181 kB | 152/496 kB | 168/411 kB | 58 kBProgress (5): 25 kB | 181 kB | 152/496 kB | 172/411 kB | 58 kBProgress (5): 25 kB | 181 kB | 156/496 kB | 172/411 kB | 58 kBProgress (5): 25 kB | 181 kB | 156/496 kB | 176/411 kB | 58 kBProgress (5): 25 kB | 181 kB | 160/496 kB | 176/411 kB | 58 kBProgress (5): 25 kB | 181 kB | 164/496 kB | 176/411 kB | 58 kBProgress (5): 25 kB | 181 kB | 168/496 kB | 176/411 kB | 58 kBProgress (5): 25 kB | 181 kB | 168/496 kB | 180/411 kB | 58 kBProgress (5): 25 kB | 181 kB | 172/496 kB | 180/411 kB | 58 kBProgress (5): 25 kB | 181 kB | 172/496 kB | 184/411 kB | 58 kBProgress (5): 25 kB | 181 kB | 172/496 kB | 188/411 kB | 58 kBProgress (5): 25 kB | 181 kB | 172/496 kB | 193/411 kB | 58 kBProgress (5): 25 kB | 181 kB | 176/496 kB | 193/411 kB | 58 kBProgress (5): 25 kB | 181 kB | 180/496 kB | 193/411 kB | 58 kBProgress (5): 25 kB | 181 kB | 184/496 kB | 193/411 kB | 58 kBProgress (5): 25 kB | 181 kB | 188/496 kB | 193/411 kB | 58 kBProgress (5): 25 kB | 181 kB | 188/496 kB | 197/411 kB | 58 kBProgress (5): 25 kB | 181 kB | 188/496 kB | 201/411 kB | 58 kBProgress (5): 25 kB | 181 kB | 188/496 kB | 205/411 kB | 58 kBProgress (5): 25 kB | 181 kB | 188/496 kB | 209/411 kB | 58 kBProgress (5): 25 kB | 181 kB | 188/496 kB | 213/411 kB | 58 kBProgress (5): 25 kB | 181 kB | 188/496 kB | 217/411 kB | 58 kBProgress (5): 25 kB | 181 kB | 188/496 kB | 221/411 kB | 58 kBProgress (5): 25 kB | 181 kB | 188/496 kB | 225/411 kB | 58 kBProgress (5): 25 kB | 181 kB | 188/496 kB | 229/411 kB | 58 kBProgress (5): 25 kB | 181 kB | 188/496 kB | 233/411 kB | 58 kBProgress (5): 25 kB | 181 kB | 188/496 kB | 238/411 kB | 58 kBProgress (5): 25 kB | 181 kB | 188/496 kB | 242/411 kB | 58 kBProgress (5): 25 kB | 181 kB | 188/496 kB | 246/411 kB | 58 kBProgress (5): 25 kB | 181 kB | 188/496 kB | 250/411 kB | 58 kBProgress (5): 25 kB | 181 kB | 188/496 kB | 254/411 kB | 58 kBProgress (5): 25 kB | 181 kB | 188/496 kB | 258/411 kB | 58 kBProgress (5): 25 kB | 181 kB | 193/496 kB | 258/411 kB | 58 kBProgress (5): 25 kB | 181 kB | 197/496 kB | 258/411 kB | 58 kBProgress (5): 25 kB | 181 kB | 201/496 kB | 258/411 kB | 58 kBProgress (5): 25 kB | 181 kB | 205/496 kB | 258/411 kB | 58 kBProgress (5): 25 kB | 181 kB | 205/496 kB | 262/411 kB | 58 kBProgress (5): 25 kB | 181 kB | 205/496 kB | 266/411 kB | 58 kBProgress (5): 25 kB | 181 kB | 209/496 kB | 266/411 kB | 58 kBProgress (5): 25 kB | 181 kB | 209/496 kB | 270/411 kB | 58 kBProgress (5): 25 kB | 181 kB | 213/496 kB | 270/411 kB | 58 kBProgress (5): 25 kB | 181 kB | 213/496 kB | 274/411 kB | 58 kBProgress (5): 25 kB | 181 kB | 217/496 kB | 274/411 kB | 58 kBProgress (5): 25 kB | 181 kB | 221/496 kB | 274/411 kB | 58 kBProgress (5): 25 kB | 181 kB | 221/496 kB | 279/411 kB | 58 kBProgress (5): 25 kB | 181 kB | 221/496 kB | 283/411 kB | 58 kBProgress (5): 25 kB | 181 kB | 225/496 kB | 283/411 kB | 58 kBProgress (5): 25 kB | 181 kB | 225/496 kB | 287/411 kB | 58 kBProgress (5): 25 kB | 181 kB | 229/496 kB | 287/411 kB | 58 kBProgress (5): 25 kB | 181 kB | 229/496 kB | 291/411 kB | 58 kBProgress (5): 25 kB | 181 kB | 233/496 kB | 291/411 kB | 58 kBProgress (5): 25 kB | 181 kB | 238/496 kB | 291/411 kB | 58 kBProgress (5): 25 kB | 181 kB | 242/496 kB | 291/411 kB | 58 kBProgress (5): 25 kB | 181 kB | 246/496 kB | 291/411 kB | 58 kBProgress (5): 25 kB | 181 kB | 250/496 kB | 291/411 kB | 58 kBProgress (5): 25 kB | 181 kB | 254/496 kB | 291/411 kB | 58 kB                                                              Downloaded from tycho: https://oss.sonatype.org/content/repositories/public/org/eclipse/tycho/org.eclipse.tycho.surefire.junit4/1.2.0/org.eclipse.tycho.surefire.junit4-1.2.0.jar (58 kB at 155 kB/s)
Progress (4): 25 kB | 181 kB | 258/496 kB | 291/411 kB                                                      Downloaded from tycho: https://oss.sonatype.org/content/repositories/public/org/eclipse/tycho/org.eclipse.tycho.surefire.junit/1.2.0/org.eclipse.tycho.surefire.junit-1.2.0.jar (25 kB at 66 kB/s)
Progress (3): 181 kB | 262/496 kB | 291/411 kB                                              Downloading from tycho: https://oss.sonatype.org/content/repositories/public/org/eclipse/tycho/org.eclipse.tycho.surefire.testng/1.2.0/org.eclipse.tycho.surefire.testng-1.2.0.jar
Progress (3): 181 kB | 266/496 kB | 291/411 kB                                              Downloading from tycho: https://oss.sonatype.org/content/repositories/public/org/apache/maven/surefire/surefire-api/2.19.1/surefire-api-2.19.1.jar
Progress (3): 181 kB | 270/496 kB | 291/411 kBProgress (3): 181 kB | 274/496 kB | 291/411 kBProgress (3): 181 kB | 279/496 kB | 291/411 kBProgress (3): 181 kB | 283/496 kB | 291/411 kBProgress (3): 181 kB | 287/496 kB | 291/411 kBProgress (3): 181 kB | 291/496 kB | 291/411 kBProgress (3): 181 kB | 295/496 kB | 291/411 kBProgress (3): 181 kB | 299/496 kB | 291/411 kBProgress (3): 181 kB | 303/496 kB | 291/411 kB                                              Downloaded from tycho: https://oss.sonatype.org/content/repositories/public/org/eclipse/tycho/org.eclipse.tycho.surefire.junit47/1.2.0/org.eclipse.tycho.surefire.junit47-1.2.0.jar (181 kB at 466 kB/s)
Downloading from tycho: https://oss.sonatype.org/content/repositories/public/org/apache/maven/surefire/maven-surefire-common/2.19.1/maven-surefire-common-2.19.1.jar
Progress (2): 303/496 kB | 295/411 kBProgress (2): 303/496 kB | 299/411 kBProgress (2): 303/496 kB | 303/411 kBProgress (2): 303/496 kB | 307/411 kBProgress (2): 303/496 kB | 311/411 kBProgress (2): 303/496 kB | 315/411 kBProgress (2): 303/496 kB | 319/411 kBProgress (2): 303/496 kB | 324/411 kBProgress (2): 303/496 kB | 328/411 kBProgress (2): 303/496 kB | 332/411 kBProgress (2): 303/496 kB | 336/411 kBProgress (2): 303/496 kB | 340/411 kBProgress (2): 303/496 kB | 344/411 kBProgress (2): 303/496 kB | 348/411 kBProgress (2): 303/496 kB | 352/411 kBProgress (2): 303/496 kB | 356/411 kBProgress (2): 303/496 kB | 360/411 kBProgress (2): 303/496 kB | 365/411 kBProgress (2): 303/496 kB | 369/411 kBProgress (2): 303/496 kB | 373/411 kBProgress (2): 307/496 kB | 373/411 kBProgress (2): 311/496 kB | 373/411 kBProgress (2): 311/496 kB | 377/411 kBProgress (2): 315/496 kB | 377/411 kBProgress (2): 315/496 kB | 381/411 kBProgress (2): 319/496 kB | 381/411 kBProgress (2): 319/496 kB | 385/411 kBProgress (2): 319/496 kB | 389/411 kBProgress (2): 324/496 kB | 389/411 kBProgress (2): 328/496 kB | 389/411 kBProgress (2): 332/496 kB | 389/411 kBProgress (2): 336/496 kB | 389/411 kBProgress (2): 340/496 kB | 389/411 kBProgress (2): 344/496 kB | 389/411 kBProgress (2): 348/496 kB | 389/411 kBProgress (2): 352/496 kB | 389/411 kBProgress (2): 356/496 kB | 389/411 kBProgress (2): 360/496 kB | 389/411 kBProgress (2): 365/496 kB | 389/411 kBProgress (2): 369/496 kB | 389/411 kBProgress (2): 373/496 kB | 389/411 kBProgress (2): 377/496 kB | 389/411 kBProgress (2): 381/496 kB | 389/411 kBProgress (2): 385/496 kB | 389/411 kBProgress (2): 389/496 kB | 389/411 kBProgress (2): 393/496 kB | 389/411 kBProgress (2): 397/496 kB | 389/411 kBProgress (2): 401/496 kB | 389/411 kBProgress (2): 406/496 kB | 389/411 kBProgress (2): 410/496 kB | 389/411 kBProgress (2): 414/496 kB | 389/411 kBProgress (2): 418/496 kB | 389/411 kBProgress (2): 422/496 kB | 389/411 kBProgress (2): 426/496 kB | 389/411 kBProgress (2): 430/496 kB | 389/411 kBProgress (2): 434/496 kB | 389/411 kBProgress (2): 434/496 kB | 393/411 kBProgress (2): 434/496 kB | 397/411 kBProgress (2): 434/496 kB | 401/411 kBProgress (2): 434/496 kB | 406/411 kBProgress (2): 434/496 kB | 410/411 kBProgress (2): 434/496 kB | 411 kB                                     Downloading from tycho: https://oss.sonatype.org/content/repositories/public/org/apache/maven/surefire/surefire-booter/2.19.1/surefire-booter-2.19.1.jar
Progress (3): 434/496 kB | 411 kB | 4.1/103 kBProgress (3): 434/496 kB | 411 kB | 7.8/103 kBProgress (3): 434/496 kB | 411 kB | 12/103 kB Progress (3): 434/496 kB | 411 kB | 16/103 kBProgress (3): 434/496 kB | 411 kB | 20/103 kBProgress (3): 434/496 kB | 411 kB | 24/103 kBProgress (3): 434/496 kB | 411 kB | 24/103 kBProgress (3): 438/496 kB | 411 kB | 24/103 kBProgress (3): 442/496 kB | 411 kB | 24/103 kBProgress (3): 446/496 kB | 411 kB | 24/103 kBProgress (3): 451/496 kB | 411 kB | 24/103 kBProgress (3): 455/496 kB | 411 kB | 24/103 kBProgress (3): 459/496 kB | 411 kB | 24/103 kBProgress (3): 463/496 kB | 411 kB | 24/103 kBProgress (3): 467/496 kB | 411 kB | 24/103 kBProgress (3): 471/496 kB | 411 kB | 24/103 kBProgress (3): 475/496 kB | 411 kB | 24/103 kBProgress (3): 479/496 kB | 411 kB | 24/103 kBProgress (3): 483/496 kB | 411 kB | 24/103 kBProgress (3): 487/496 kB | 411 kB | 24/103 kBProgress (3): 492/496 kB | 411 kB | 24/103 kBProgress (3): 496/496 kB | 411 kB | 24/103 kBProgress (3): 496 kB | 411 kB | 24/103 kB    Progress (3): 496 kB | 411 kB | 28/103 kBProgress (3): 496 kB | 411 kB | 32/103 kBProgress (3): 496 kB | 411 kB | 37/103 kBProgress (3): 496 kB | 411 kB | 41/103 kBProgress (3): 496 kB | 411 kB | 45/103 kBProgress (3): 496 kB | 411 kB | 49/103 kBProgress (3): 496 kB | 411 kB | 53/103 kBProgress (3): 496 kB | 411 kB | 57/103 kB                                         Downloading from tycho: https://oss.sonatype.org/content/repositories/public/org/apache/maven/maven-plugin-descriptor/2.2.1/maven-plugin-descriptor-2.2.1.jar
Progress (3): 496 kB | 411 kB | 61/103 kBProgress (3): 496 kB | 411 kB | 65/103 kBProgress (3): 496 kB | 411 kB | 69/103 kBProgress (3): 496 kB | 411 kB | 73/103 kBProgress (3): 496 kB | 411 kB | 77/103 kBProgress (3): 496 kB | 411 kB | 82/103 kBProgress (3): 496 kB | 411 kB | 86/103 kBProgress (3): 496 kB | 411 kB | 90/103 kBProgress (3): 496 kB | 411 kB | 94/103 kBProgress (3): 496 kB | 411 kB | 98/103 kBProgress (3): 496 kB | 411 kB | 102/103 kBProgress (3): 496 kB | 411 kB | 103 kB                                          Downloading from tycho: https://oss.sonatype.org/content/repositories/public/org/apache/maven/maven-project/2.2.1/maven-project-2.2.1.jar
Downloading from tycho: https://oss.sonatype.org/content/repositories/public/org/apache/maven/maven-profile/2.2.1/maven-profile-2.2.1.jar
Downloading from tycho: https://oss.sonatype.org/content/repositories/public/org/apache/maven/maven-artifact-manager/2.2.1/maven-artifact-manager-2.2.1.jar
Downloaded from tycho: https://oss.sonatype.org/content/repositories/public/org/eclipse/tycho/org.eclipse.tycho.surefire.osgibooter/1.2.0/org.eclipse.tycho.surefire.osgibooter-1.2.0.jar (496 kB at 625 kB/s)
Downloading from tycho: https://oss.sonatype.org/content/repositories/public/backport-util-concurrent/backport-util-concurrent/3.1/backport-util-concurrent-3.1.jar
Downloaded from tycho: https://oss.sonatype.org/content/repositories/public/org/eclipse/tycho/org.eclipse.tycho.surefire.testng/1.2.0/org.eclipse.tycho.surefire.testng-1.2.0.jar (103 kB at 130 kB/s)
Downloading from tycho: https://oss.sonatype.org/content/repositories/public/org/apache/maven/maven-toolchain/2.2.1/maven-toolchain-2.2.1.jar
Downloading from tycho: https://oss.sonatype.org/content/repositories/public/org/apache/maven/maven-plugin-registry/2.2.1/maven-plugin-registry-2.2.1.jar
Downloading from tycho: https://oss.sonatype.org/content/repositories/public/org/apache/commons/commons-lang3/3.1/commons-lang3-3.1.jar
Downloaded from tycho: https://oss.sonatype.org/content/repositories/public/org/eclipse/tycho/org.eclipse.tycho.surefire.junit5/1.2.0/org.eclipse.tycho.surefire.junit5-1.2.0.jar (411 kB at 420 kB/s)
Downloading from cbi-repo: https://repo.eclipse.org/content/repositories/cbi/org/apache/maven/surefire/surefire-api/2.19.1/surefire-api-2.19.1.jar
Downloading from cbi-repo: https://repo.eclipse.org/content/repositories/cbi/org/apache/maven/surefire/maven-surefire-common/2.19.1/maven-surefire-common-2.19.1.jar
Downloading from cbi-repo: https://repo.eclipse.org/content/repositories/cbi/org/apache/maven/maven-project/2.2.1/maven-project-2.2.1.jar
Downloading from cbi-repo: https://repo.eclipse.org/content/repositories/cbi/org/apache/maven/maven-plugin-descriptor/2.2.1/maven-plugin-descriptor-2.2.1.jar
Downloading from cbi-repo: https://repo.eclipse.org/content/repositories/cbi/org/apache/maven/surefire/surefire-booter/2.19.1/surefire-booter-2.19.1.jar
Downloading from cbi-repo: https://repo.eclipse.org/content/repositories/cbi/org/apache/maven/maven-profile/2.2.1/maven-profile-2.2.1.jar
Downloading from cbi-repo: https://repo.eclipse.org/content/repositories/cbi/org/apache/maven/maven-artifact-manager/2.2.1/maven-artifact-manager-2.2.1.jar
Downloading from cbi-repo: https://repo.eclipse.org/content/repositories/cbi/backport-util-concurrent/backport-util-concurrent/3.1/backport-util-concurrent-3.1.jar
Downloading from cbi-repo: https://repo.eclipse.org/content/repositories/cbi/org/apache/maven/maven-plugin-registry/2.2.1/maven-plugin-registry-2.2.1.jar
Downloading from cbi-repo: https://repo.eclipse.org/content/repositories/cbi/org/apache/maven/maven-toolchain/2.2.1/maven-toolchain-2.2.1.jar
Downloading from cbi-repo: https://repo.eclipse.org/content/repositories/cbi/org/apache/commons/commons-lang3/3.1/commons-lang3-3.1.jar
Downloading from tycho-snapshot: https://repo.eclipse.org/content/repositories/tycho-snapshots/org/apache/maven/surefire/surefire-api/2.19.1/surefire-api-2.19.1.jar
Downloading from tycho-snapshot: https://repo.eclipse.org/content/repositories/tycho-snapshots/org/apache/maven/surefire/maven-surefire-common/2.19.1/maven-surefire-common-2.19.1.jar
Downloading from tycho-snapshot: https://repo.eclipse.org/content/repositories/tycho-snapshots/org/apache/maven/maven-plugin-descriptor/2.2.1/maven-plugin-descriptor-2.2.1.jar
Downloading from tycho-snapshot: https://repo.eclipse.org/content/repositories/tycho-snapshots/org/apache/maven/surefire/surefire-booter/2.19.1/surefire-booter-2.19.1.jar
Downloading from tycho-snapshot: https://repo.eclipse.org/content/repositories/tycho-snapshots/org/apache/maven/maven-project/2.2.1/maven-project-2.2.1.jar
Downloading from tycho-snapshot: https://repo.eclipse.org/content/repositories/tycho-snapshots/org/apache/maven/maven-profile/2.2.1/maven-profile-2.2.1.jar
Downloading from tycho-snapshot: https://repo.eclipse.org/content/repositories/tycho-snapshots/org/apache/maven/maven-artifact-manager/2.2.1/maven-artifact-manager-2.2.1.jar
Downloading from tycho-snapshot: https://repo.eclipse.org/content/repositories/tycho-snapshots/backport-util-concurrent/backport-util-concurrent/3.1/backport-util-concurrent-3.1.jar
Downloading from tycho-snapshot: https://repo.eclipse.org/content/repositories/tycho-snapshots/org/apache/maven/maven-plugin-registry/2.2.1/maven-plugin-registry-2.2.1.jar
Downloading from tycho-snapshot: https://repo.eclipse.org/content/repositories/tycho-snapshots/org/apache/maven/maven-toolchain/2.2.1/maven-toolchain-2.2.1.jar
Downloading from tycho-snapshot: https://repo.eclipse.org/content/repositories/tycho-snapshots/org/apache/commons/commons-lang3/3.1/commons-lang3-3.1.jar
Downloading from sonatype-public-grid: https://repository.sonatype.org/content/groups/sonatype-public-grid/org/apache/maven/surefire/surefire-api/2.19.1/surefire-api-2.19.1.jar
Downloading from sonatype-public-grid: https://repository.sonatype.org/content/groups/sonatype-public-grid/org/apache/maven/surefire/maven-surefire-common/2.19.1/maven-surefire-common-2.19.1.jar
Downloading from sonatype-public-grid: https://repository.sonatype.org/content/groups/sonatype-public-grid/org/apache/maven/surefire/surefire-booter/2.19.1/surefire-booter-2.19.1.jar
Downloading from sonatype-public-grid: https://repository.sonatype.org/content/groups/sonatype-public-grid/org/apache/maven/maven-plugin-descriptor/2.2.1/maven-plugin-descriptor-2.2.1.jar
Downloading from sonatype-public-grid: https://repository.sonatype.org/content/groups/sonatype-public-grid/org/apache/maven/maven-project/2.2.1/maven-project-2.2.1.jar
Progress (1): 4.1/196 kBProgress (1): 7.8/196 kBProgress (1): 12/196 kB Progress (1): 16/196 kBProgress (1): 20/196 kBProgress (1): 24/196 kBProgress (1): 28/196 kBProgress (1): 32/196 kBProgress (1): 37/196 kBProgress (1): 41/196 kBProgress (1): 45/196 kBProgress (1): 49/196 kBProgress (1): 53/196 kBProgress (1): 57/196 kBProgress (1): 61/196 kBProgress (1): 65/196 kBProgress (1): 69/196 kBProgress (1): 73/196 kBProgress (1): 77/196 kBProgress (1): 82/196 kBProgress (1): 86/196 kBProgress (1): 90/196 kBProgress (1): 94/196 kBProgress (1): 98/196 kBProgress (1): 102/196 kBProgress (1): 106/196 kBProgress (1): 110/196 kBProgress (1): 114/196 kBProgress (1): 118/196 kBProgress (1): 123/196 kBProgress (1): 127/196 kBProgress (1): 131/196 kBProgress (1): 135/196 kBProgress (1): 139/196 kBProgress (1): 143/196 kBProgress (1): 147/196 kBProgress (1): 151/196 kBProgress (1): 155/196 kBProgress (1): 159/196 kBProgress (1): 163/196 kBProgress (1): 168/196 kBProgress (1): 172/196 kBProgress (1): 176/196 kBProgress (1): 180/196 kBProgress (1): 184/196 kBProgress (1): 188/196 kBProgress (1): 192/196 kBProgress (1): 196 kB    Progress (2): 196 kB | 4.1/156 kBProgress (2): 196 kB | 7.8/156 kBProgress (2): 196 kB | 7.9/156 kBProgress (3): 196 kB | 7.9/156 kB | 4.1/39 kBProgress (3): 196 kB | 7.9/156 kB | 7.8/39 kBProgress (3): 196 kB | 7.9/156 kB | 12/39 kB Progress (3): 196 kB | 7.9/156 kB | 16/39 kBProgress (4): 196 kB | 7.9/156 kB | 16/39 kB | 4.1/293 kBProgress (4): 196 kB | 7.9/156 kB | 16/39 kB | 7.8/293 kBProgress (5): 196 kB | 7.9/156 kB | 16/39 kB | 7.8/293 kB | 4.1/46 kBProgress (5): 196 kB | 7.9/156 kB | 16/39 kB | 12/293 kB | 4.1/46 kB Progress (5): 196 kB | 7.9/156 kB | 20/39 kB | 12/293 kB | 4.1/46 kBProgress (5): 196 kB | 7.9/156 kB | 20/39 kB | 12/293 kB | 7.8/46 kBProgress (5): 196 kB | 7.9/156 kB | 24/39 kB | 12/293 kB | 7.8/46 kBProgress (5): 196 kB | 7.9/156 kB | 24/39 kB | 16/293 kB | 7.8/46 kBProgress (5): 196 kB | 7.9/156 kB | 28/39 kB | 16/293 kB | 7.8/46 kBProgress (5): 196 kB | 7.9/156 kB | 28/39 kB | 16/293 kB | 12/46 kB Progress (5): 196 kB | 7.9/156 kB | 28/39 kB | 20/293 kB | 12/46 kBProgress (5): 196 kB | 7.9/156 kB | 28/39 kB | 20/293 kB | 12/46 kBProgress (5): 196 kB | 7.9/156 kB | 32/39 kB | 20/293 kB | 12/46 kBProgress (5): 196 kB | 7.9/156 kB | 32/39 kB | 20/293 kB | 16/46 kBProgress (5): 196 kB | 12/156 kB | 32/39 kB | 20/293 kB | 16/46 kB Progress (5): 196 kB | 12/156 kB | 37/39 kB | 20/293 kB | 16/46 kBProgress (5): 196 kB | 16/156 kB | 37/39 kB | 20/293 kB | 16/46 kBProgress (5): 196 kB | 16/156 kB | 37/39 kB | 24/293 kB | 16/46 kBProgress (5): 196 kB | 16/156 kB | 39 kB | 24/293 kB | 16/46 kB   Progress (5): 196 kB | 16/156 kB | 39 kB | 28/293 kB | 16/46 kBProgress (5): 196 kB | 20/156 kB | 39 kB | 28/293 kB | 16/46 kBProgress (5): 196 kB | 20/156 kB | 39 kB | 28/293 kB | 20/46 kBProgress (5): 196 kB | 20/156 kB | 39 kB | 32/293 kB | 20/46 kBProgress (5): 196 kB | 20/156 kB | 39 kB | 32/293 kB | 24/46 kB                                                               Downloaded from sonatype-public-grid: https://repository.sonatype.org/content/groups/sonatype-public-grid/org/apache/maven/surefire/surefire-api/2.19.1/surefire-api-2.19.1.jar (196 kB at 1.0 MB/s)
Progress (4): 24/156 kB | 39 kB | 32/293 kB | 24/46 kB                                                      Downloading from sonatype-public-grid: https://repository.sonatype.org/content/groups/sonatype-public-grid/org/apache/maven/maven-profile/2.2.1/maven-profile-2.2.1.jar
Progress (4): 24/156 kB | 39 kB | 32/293 kB | 28/46 kBProgress (4): 24/156 kB | 39 kB | 37/293 kB | 28/46 kBProgress (4): 24/156 kB | 39 kB | 37/293 kB | 32/46 kBProgress (4): 28/156 kB | 39 kB | 37/293 kB | 32/46 kBProgress (4): 32/156 kB | 39 kB | 37/293 kB | 32/46 kBProgress (4): 37/156 kB | 39 kB | 37/293 kB | 32/46 kBProgress (4): 41/156 kB | 39 kB | 37/293 kB | 32/46 kBProgress (4): 41/156 kB | 39 kB | 37/293 kB | 37/46 kBProgress (4): 41/156 kB | 39 kB | 37/293 kB | 41/46 kBProgress (4): 41/156 kB | 39 kB | 37/293 kB | 45/46 kBProgress (4): 41/156 kB | 39 kB | 37/293 kB | 46 kB   Progress (4): 45/156 kB | 39 kB | 37/293 kB | 46 kBProgress (4): 49/156 kB | 39 kB | 37/293 kB | 46 kBProgress (4): 49/156 kB | 39 kB | 41/293 kB | 46 kBProgress (4): 53/156 kB | 39 kB | 41/293 kB | 46 kBProgress (4): 53/156 kB | 39 kB | 45/293 kB | 46 kBProgress (4): 57/156 kB | 39 kB | 45/293 kB | 46 kBProgress (4): 57/156 kB | 39 kB | 49/293 kB | 46 kBProgress (4): 57/156 kB | 39 kB | 53/293 kB | 46 kBProgress (4): 61/156 kB | 39 kB | 53/293 kB | 46 kBProgress (4): 61/156 kB | 39 kB | 54/293 kB | 46 kBProgress (4): 61/156 kB | 39 kB | 54/293 kB | 46 kBProgress (4): 66/156 kB | 39 kB | 54/293 kB | 46 kBProgress (4): 70/156 kB | 39 kB | 54/293 kB | 46 kBProgress (4): 74/156 kB | 39 kB | 54/293 kB | 46 kBProgress (4): 78/156 kB | 39 kB | 54/293 kB | 46 kB                                                   Downloaded from sonatype-public-grid: https://repository.sonatype.org/content/groups/sonatype-public-grid/org/apache/maven/maven-plugin-descriptor/2.2.1/maven-plugin-descriptor-2.2.1.jar (39 kB at 171 kB/s)
Downloading from sonatype-public-grid: https://repository.sonatype.org/content/groups/sonatype-public-grid/org/apache/maven/maven-artifact-manager/2.2.1/maven-artifact-manager-2.2.1.jar
Progress (3): 78/156 kB | 58/293 kB | 46 kBProgress (3): 78/156 kB | 62/293 kB | 46 kBProgress (4): 78/156 kB | 62/293 kB | 46 kB | 4.1/35 kBProgress (4): 78/156 kB | 66/293 kB | 46 kB | 4.1/35 kBProgress (4): 78/156 kB | 66/293 kB | 46 kB | 7.8/35 kBProgress (4): 78/156 kB | 70/293 kB | 46 kB | 7.8/35 kBProgress (4): 78/156 kB | 70/293 kB | 46 kB | 12/35 kB Progress (4): 78/156 kB | 70/293 kB | 46 kB | 16/35 kBProgress (4): 78/156 kB | 74/293 kB | 46 kB | 16/35 kBProgress (4): 78/156 kB | 74/293 kB | 46 kB | 20/35 kBProgress (4): 78/156 kB | 79/293 kB | 46 kB | 20/35 kBProgress (4): 78/156 kB | 79/293 kB | 46 kB | 24/35 kBProgress (4): 82/156 kB | 79/293 kB | 46 kB | 24/35 kBProgress (4): 82/156 kB | 83/293 kB | 46 kB | 24/35 kBProgress (4): 86/156 kB | 83/293 kB | 46 kB | 24/35 kBProgress (4): 86/156 kB | 83/293 kB | 46 kB | 24/35 kBProgress (4): 90/156 kB | 83/293 kB | 46 kB | 24/35 kBProgress (4): 90/156 kB | 87/293 kB | 46 kB | 24/35 kBProgress (4): 94/156 kB | 87/293 kB | 46 kB | 24/35 kBProgress (4): 94/156 kB | 87/293 kB | 46 kB | 28/35 kBProgress (4): 94/156 kB | 87/293 kB | 46 kB | 32/35 kBProgress (4): 94/156 kB | 91/293 kB | 46 kB | 32/35 kBProgress (4): 94/156 kB | 91/293 kB | 46 kB | 35 kB   Progress (4): 94/156 kB | 95/293 kB | 46 kB | 35 kBProgress (4): 94/156 kB | 99/293 kB | 46 kB | 35 kBProgress (4): 94/156 kB | 103/293 kB | 46 kB | 35 kBProgress (4): 94/156 kB | 107/293 kB | 46 kB | 35 kBProgress (4): 94/156 kB | 111/293 kB | 46 kB | 35 kBProgress (4): 94/156 kB | 115/293 kB | 46 kB | 35 kBProgress (4): 94/156 kB | 120/293 kB | 46 kB | 35 kBProgress (4): 98/156 kB | 120/293 kB | 46 kB | 35 kBProgress (4): 102/156 kB | 120/293 kB | 46 kB | 35 kBProgress (4): 106/156 kB | 120/293 kB | 46 kB | 35 kBProgress (4): 111/156 kB | 120/293 kB | 46 kB | 35 kBProgress (4): 115/156 kB | 120/293 kB | 46 kB | 35 kBProgress (4): 119/156 kB | 120/293 kB | 46 kB | 35 kBProgress (4): 123/156 kB | 120/293 kB | 46 kB | 35 kBProgress (4): 127/156 kB | 120/293 kB | 46 kB | 35 kBProgress (5): 127/156 kB | 120/293 kB | 46 kB | 35 kB | 4.1/68 kBProgress (5): 127/156 kB | 120/293 kB | 46 kB | 35 kB | 7.8/68 kBProgress (5): 127/156 kB | 120/293 kB | 46 kB | 35 kB | 7.9/68 kBProgress (5): 127/156 kB | 120/293 kB | 46 kB | 35 kB | 12/68 kB Progress (5): 127/156 kB | 120/293 kB | 46 kB | 35 kB | 16/68 kBProgress (5): 127/156 kB | 120/293 kB | 46 kB | 35 kB | 20/68 kBProgress (5): 127/156 kB | 120/293 kB | 46 kB | 35 kB | 24/68 kBProgress (5): 127/156 kB | 120/293 kB | 46 kB | 35 kB | 28/68 kBProgress (5): 127/156 kB | 120/293 kB | 46 kB | 35 kB | 32/68 kBProgress (5): 127/156 kB | 120/293 kB | 46 kB | 35 kB | 37/68 kBProgress (5): 127/156 kB | 120/293 kB | 46 kB | 35 kB | 41/68 kBProgress (5): 127/156 kB | 124/293 kB | 46 kB | 35 kB | 41/68 kBProgress (5): 127/156 kB | 128/293 kB | 46 kB | 35 kB | 41/68 kBProgress (5): 127/156 kB | 132/293 kB | 46 kB | 35 kB | 41/68 kBProgress (5): 127/156 kB | 136/293 kB | 46 kB | 35 kB | 41/68 kBProgress (5): 131/156 kB | 136/293 kB | 46 kB | 35 kB | 41/68 kBProgress (5): 135/156 kB | 136/293 kB | 46 kB | 35 kB | 41/68 kBProgress (5): 139/156 kB | 136/293 kB | 46 kB | 35 kB | 41/68 kBProgress (5): 143/156 kB | 136/293 kB | 46 kB | 35 kB | 41/68 kBProgress (5): 147/156 kB | 136/293 kB | 46 kB | 35 kB | 41/68 kBProgress (5): 152/156 kB | 136/293 kB | 46 kB | 35 kB | 41/68 kBProgress (5): 156/156 kB | 136/293 kB | 46 kB | 35 kB | 41/68 kBProgress (5): 156 kB | 136/293 kB | 46 kB | 35 kB | 41/68 kB    Progress (5): 156 kB | 140/293 kB | 46 kB | 35 kB | 41/68 kBProgress (5): 156 kB | 144/293 kB | 46 kB | 35 kB | 41/68 kBProgress (5): 156 kB | 148/293 kB | 46 kB | 35 kB | 41/68 kBProgress (5): 156 kB | 152/293 kB | 46 kB | 35 kB | 41/68 kBProgress (5): 156 kB | 156/293 kB | 46 kB | 35 kB | 41/68 kBProgress (5): 156 kB | 161/293 kB | 46 kB | 35 kB | 41/68 kBProgress (5): 156 kB | 165/293 kB | 46 kB | 35 kB | 41/68 kBProgress (5): 156 kB | 169/293 kB | 46 kB | 35 kB | 41/68 kBProgress (5): 156 kB | 173/293 kB | 46 kB | 35 kB | 41/68 kBProgress (5): 156 kB | 177/293 kB | 46 kB | 35 kB | 41/68 kBProgress (5): 156 kB | 181/293 kB | 46 kB | 35 kB | 41/68 kBProgress (5): 156 kB | 185/293 kB | 46 kB | 35 kB | 41/68 kBProgress (5): 156 kB | 185/293 kB | 46 kB | 35 kB | 45/68 kBProgress (5): 156 kB | 185/293 kB | 46 kB | 35 kB | 49/68 kBProgress (5): 156 kB | 185/293 kB | 46 kB | 35 kB | 53/68 kBProgress (5): 156 kB | 185/293 kB | 46 kB | 35 kB | 57/68 kBProgress (5): 156 kB | 185/293 kB | 46 kB | 35 kB | 61/68 kBProgress (5): 156 kB | 185/293 kB | 46 kB | 35 kB | 65/68 kBProgress (5): 156 kB | 185/293 kB | 46 kB | 35 kB | 68 kB   Progress (5): 156 kB | 189/293 kB | 46 kB | 35 kB | 68 kBProgress (5): 156 kB | 193/293 kB | 46 kB | 35 kB | 68 kBProgress (5): 156 kB | 197/293 kB | 46 kB | 35 kB | 68 kBProgress (5): 156 kB | 201/293 kB | 46 kB | 35 kB | 68 kBProgress (5): 156 kB | 206/293 kB | 46 kB | 35 kB | 68 kBProgress (5): 156 kB | 210/293 kB | 46 kB | 35 kB | 68 kBProgress (5): 156 kB | 214/293 kB | 46 kB | 35 kB | 68 kBProgress (5): 156 kB | 218/293 kB | 46 kB | 35 kB | 68 kBProgress (5): 156 kB | 222/293 kB | 46 kB | 35 kB | 68 kBProgress (5): 156 kB | 226/293 kB | 46 kB | 35 kB | 68 kBProgress (5): 156 kB | 230/293 kB | 46 kB | 35 kB | 68 kBProgress (5): 156 kB | 234/293 kB | 46 kB | 35 kB | 68 kBProgress (5): 156 kB | 238/293 kB | 46 kB | 35 kB | 68 kBProgress (5): 156 kB | 242/293 kB | 46 kB | 35 kB | 68 kBProgress (5): 156 kB | 247/293 kB | 46 kB | 35 kB | 68 kBProgress (5): 156 kB | 251/293 kB | 46 kB | 35 kB | 68 kBProgress (5): 156 kB | 255/293 kB | 46 kB | 35 kB | 68 kBProgress (5): 156 kB | 259/293 kB | 46 kB | 35 kB | 68 kBProgress (5): 156 kB | 263/293 kB | 46 kB | 35 kB | 68 kBProgress (5): 156 kB | 267/293 kB | 46 kB | 35 kB | 68 kB                                                         Downloaded from sonatype-public-grid: https://repository.sonatype.org/content/groups/sonatype-public-grid/org/apache/maven/maven-artifact-manager/2.2.1/maven-artifact-manager-2.2.1.jar (68 kB at 199 kB/s)
Downloading from sonatype-public-grid: https://repository.sonatype.org/content/groups/sonatype-public-grid/backport-util-concurrent/backport-util-concurrent/3.1/backport-util-concurrent-3.1.jar
Progress (4): 156 kB | 271/293 kB | 46 kB | 35 kBProgress (4): 156 kB | 275/293 kB | 46 kB | 35 kBProgress (4): 156 kB | 279/293 kB | 46 kB | 35 kBProgress (4): 156 kB | 283/293 kB | 46 kB | 35 kBProgress (4): 156 kB | 287/293 kB | 46 kB | 35 kBProgress (4): 156 kB | 292/293 kB | 46 kB | 35 kBProgress (4): 156 kB | 293 kB | 46 kB | 35 kB    Progress (5): 156 kB | 293 kB | 46 kB | 35 kB | 4.1/332 kBProgress (5): 156 kB | 293 kB | 46 kB | 35 kB | 7.8/332 kBProgress (5): 156 kB | 293 kB | 46 kB | 35 kB | 7.9/332 kBProgress (5): 156 kB | 293 kB | 46 kB | 35 kB | 12/332 kB Progress (5): 156 kB | 293 kB | 46 kB | 35 kB | 16/332 kBProgress (5): 156 kB | 293 kB | 46 kB | 35 kB | 20/332 kBProgress (5): 156 kB | 293 kB | 46 kB | 35 kB | 24/332 kBProgress (5): 156 kB | 293 kB | 46 kB | 35 kB | 28/332 kBProgress (5): 156 kB | 293 kB | 46 kB | 35 kB | 32/332 kBProgress (5): 156 kB | 293 kB | 46 kB | 35 kB | 37/332 kBProgress (5): 156 kB | 293 kB | 46 kB | 35 kB | 41/332 kBProgress (5): 156 kB | 293 kB | 46 kB | 35 kB | 45/332 kBProgress (5): 156 kB | 293 kB | 46 kB | 35 kB | 49/332 kBProgress (5): 156 kB | 293 kB | 46 kB | 35 kB | 53/332 kBProgress (5): 156 kB | 293 kB | 46 kB | 35 kB | 57/332 kBProgress (5): 156 kB | 293 kB | 46 kB | 35 kB | 61/332 kBProgress (5): 156 kB | 293 kB | 46 kB | 35 kB | 65/332 kBProgress (5): 156 kB | 293 kB | 46 kB | 35 kB | 69/332 kBProgress (5): 156 kB | 293 kB | 46 kB | 35 kB | 73/332 kB                                                         Downloaded from sonatype-public-grid: https://repository.sonatype.org/content/groups/sonatype-public-grid/org/apache/maven/maven-profile/2.2.1/maven-profile-2.2.1.jar (35 kB at 89 kB/s)
Downloading from sonatype-public-grid: https://repository.sonatype.org/content/groups/sonatype-public-grid/org/apache/maven/maven-plugin-registry/2.2.1/maven-plugin-registry-2.2.1.jar
Progress (4): 156 kB | 293 kB | 46 kB | 77/332 kBProgress (4): 156 kB | 293 kB | 46 kB | 82/332 kBProgress (4): 156 kB | 293 kB | 46 kB | 86/332 kBProgress (4): 156 kB | 293 kB | 46 kB | 90/332 kBProgress (4): 156 kB | 293 kB | 46 kB | 94/332 kBProgress (4): 156 kB | 293 kB | 46 kB | 98/332 kBProgress (4): 156 kB | 293 kB | 46 kB | 102/332 kBProgress (4): 156 kB | 293 kB | 46 kB | 106/332 kBProgress (4): 156 kB | 293 kB | 46 kB | 110/332 kBProgress (4): 156 kB | 293 kB | 46 kB | 114/332 kBProgress (4): 156 kB | 293 kB | 46 kB | 118/332 kBProgress (4): 156 kB | 293 kB | 46 kB | 123/332 kBProgress (4): 156 kB | 293 kB | 46 kB | 127/332 kBProgress (4): 156 kB | 293 kB | 46 kB | 131/332 kBProgress (4): 156 kB | 293 kB | 46 kB | 135/332 kBProgress (4): 156 kB | 293 kB | 46 kB | 139/332 kBProgress (4): 156 kB | 293 kB | 46 kB | 143/332 kBProgress (4): 156 kB | 293 kB | 46 kB | 147/332 kBProgress (4): 156 kB | 293 kB | 46 kB | 151/332 kBProgress (4): 156 kB | 293 kB | 46 kB | 155/332 kBProgress (5): 156 kB | 293 kB | 46 kB | 155/332 kB | 4.1/30 kBProgress (5): 156 kB | 293 kB | 46 kB | 159/332 kB | 4.1/30 kBProgress (5): 156 kB | 293 kB | 46 kB | 164/332 kB | 4.1/30 kBProgress (5): 156 kB | 293 kB | 46 kB | 168/332 kB | 4.1/30 kBProgress (5): 156 kB | 293 kB | 46 kB | 172/332 kB | 4.1/30 kBProgress (5): 156 kB | 293 kB | 46 kB | 176/332 kB | 4.1/30 kBProgress (5): 156 kB | 293 kB | 46 kB | 180/332 kB | 4.1/30 kBProgress (5): 156 kB | 293 kB | 46 kB | 184/332 kB | 4.1/30 kBProgress (5): 156 kB | 293 kB | 46 kB | 188/332 kB | 4.1/30 kBProgress (5): 156 kB | 293 kB | 46 kB | 192/332 kB | 4.1/30 kBProgress (5): 156 kB | 293 kB | 46 kB | 196/332 kB | 4.1/30 kBProgress (5): 156 kB | 293 kB | 46 kB | 200/332 kB | 4.1/30 kBProgress (5): 156 kB | 293 kB | 46 kB | 204/332 kB | 4.1/30 kBProgress (5): 156 kB | 293 kB | 46 kB | 209/332 kB | 4.1/30 kBProgress (5): 156 kB | 293 kB | 46 kB | 213/332 kB | 4.1/30 kBProgress (5): 156 kB | 293 kB | 46 kB | 217/332 kB | 4.1/30 kBProgress (5): 156 kB | 293 kB | 46 kB | 221/332 kB | 4.1/30 kBProgress (5): 156 kB | 293 kB | 46 kB | 225/332 kB | 4.1/30 kBProgress (5): 156 kB | 293 kB | 46 kB | 229/332 kB | 4.1/30 kBProgress (5): 156 kB | 293 kB | 46 kB | 233/332 kB | 4.1/30 kBProgress (5): 156 kB | 293 kB | 46 kB | 237/332 kB | 4.1/30 kBProgress (5): 156 kB | 293 kB | 46 kB | 241/332 kB | 4.1/30 kBProgress (5): 156 kB | 293 kB | 46 kB | 245/332 kB | 4.1/30 kBProgress (5): 156 kB | 293 kB | 46 kB | 250/332 kB | 4.1/30 kBProgress (5): 156 kB | 293 kB | 46 kB | 254/332 kB | 4.1/30 kBProgress (5): 156 kB | 293 kB | 46 kB | 258/332 kB | 4.1/30 kBProgress (5): 156 kB | 293 kB | 46 kB | 262/332 kB | 4.1/30 kBProgress (5): 156 kB | 293 kB | 46 kB | 266/332 kB | 4.1/30 kBProgress (5): 156 kB | 293 kB | 46 kB | 270/332 kB | 4.1/30 kBProgress (5): 156 kB | 293 kB | 46 kB | 274/332 kB | 4.1/30 kBProgress (5): 156 kB | 293 kB | 46 kB | 278/332 kB | 4.1/30 kBProgress (5): 156 kB | 293 kB | 46 kB | 282/332 kB | 4.1/30 kBProgress (5): 156 kB | 293 kB | 46 kB | 286/332 kB | 4.1/30 kBProgress (5): 156 kB | 293 kB | 46 kB | 290/332 kB | 4.1/30 kBProgress (5): 156 kB | 293 kB | 46 kB | 295/332 kB | 4.1/30 kBProgress (5): 156 kB | 293 kB | 46 kB | 299/332 kB | 4.1/30 kBProgress (5): 156 kB | 293 kB | 46 kB | 303/332 kB | 4.1/30 kBProgress (5): 156 kB | 293 kB | 46 kB | 307/332 kB | 4.1/30 kBProgress (5): 156 kB | 293 kB | 46 kB | 311/332 kB | 4.1/30 kBProgress (5): 156 kB | 293 kB | 46 kB | 315/332 kB | 4.1/30 kBProgress (5): 156 kB | 293 kB | 46 kB | 319/332 kB | 4.1/30 kBProgress (5): 156 kB | 293 kB | 46 kB | 323/332 kB | 4.1/30 kBProgress (5): 156 kB | 293 kB | 46 kB | 327/332 kB | 4.1/30 kBProgress (5): 156 kB | 293 kB | 46 kB | 331/332 kB | 4.1/30 kBProgress (5): 156 kB | 293 kB | 46 kB | 332 kB | 4.1/30 kB                                                              Downloaded from sonatype-public-grid: https://repository.sonatype.org/content/groups/sonatype-public-grid/org/apache/maven/surefire/surefire-booter/2.19.1/surefire-booter-2.19.1.jar (46 kB at 76 kB/s)
Downloading from sonatype-public-grid: https://repository.sonatype.org/content/groups/sonatype-public-grid/org/apache/maven/maven-toolchain/2.2.1/maven-toolchain-2.2.1.jar
Progress (5): 156 kB | 293 kB | 332 kB | 4.1/30 kB | 4.1/38 kBProgress (5): 156 kB | 293 kB | 332 kB | 4.1/30 kB | 7.8/38 kBProgress (5): 156 kB | 293 kB | 332 kB | 4.1/30 kB | 12/38 kB Progress (5): 156 kB | 293 kB | 332 kB | 4.1/30 kB | 16/38 kBProgress (5): 156 kB | 293 kB | 332 kB | 4.1/30 kB | 20/38 kBProgress (5): 156 kB | 293 kB | 332 kB | 4.1/30 kB | 24/38 kBProgress (5): 156 kB | 293 kB | 332 kB | 4.1/30 kB | 28/38 kBProgress (5): 156 kB | 293 kB | 332 kB | 4.1/30 kB | 32/38 kBProgress (5): 156 kB | 293 kB | 332 kB | 4.1/30 kB | 37/38 kBProgress (5): 156 kB | 293 kB | 332 kB | 4.1/30 kB | 38 kB                                                             Downloaded from sonatype-public-grid: https://repository.sonatype.org/content/groups/sonatype-public-grid/org/apache/maven/surefire/maven-surefire-common/2.19.1/maven-surefire-common-2.19.1.jar (293 kB at 441 kB/s)
Downloading from sonatype-public-grid: https://repository.sonatype.org/content/groups/sonatype-public-grid/org/apache/commons/commons-lang3/3.1/commons-lang3-3.1.jar
Downloaded from sonatype-public-grid: https://repository.sonatype.org/content/groups/sonatype-public-grid/org/apache/maven/maven-project/2.2.1/maven-project-2.2.1.jar (156 kB at 234 kB/s)
Progress (3): 332 kB | 7.8/30 kB | 38 kBProgress (3): 332 kB | 7.9/30 kB | 38 kB                                        Downloaded from sonatype-public-grid: https://repository.sonatype.org/content/groups/sonatype-public-grid/org/apache/maven/maven-toolchain/2.2.1/maven-toolchain-2.2.1.jar (38 kB at 56 kB/s)
Progress (2): 332 kB | 12/30 kBProgress (2): 332 kB | 16/30 kBProgress (2): 332 kB | 20/30 kBProgress (2): 332 kB | 24/30 kBProgress (2): 332 kB | 28/30 kBProgress (2): 332 kB | 30 kB                               Downloaded from sonatype-public-grid: https://repository.sonatype.org/content/groups/sonatype-public-grid/backport-util-concurrent/backport-util-concurrent/3.1/backport-util-concurrent-3.1.jar (332 kB at 481 kB/s)
Progress (2): 30 kB | 4.1/316 kBProgress (2): 30 kB | 7.8/316 kBProgress (2): 30 kB | 7.9/316 kBProgress (2): 30 kB | 12/316 kB Progress (2): 30 kB | 16/316 kBProgress (2): 30 kB | 20/316 kBProgress (2): 30 kB | 24/316 kBProgress (2): 30 kB | 28/316 kBProgress (2): 30 kB | 32/316 kBProgress (2): 30 kB | 37/316 kBProgress (2): 30 kB | 37/316 kBProgress (2): 30 kB | 41/316 kBProgress (2): 30 kB | 45/316 kBProgress (2): 30 kB | 49/316 kBProgress (2): 30 kB | 53/316 kBProgress (2): 30 kB | 54/316 kBProgress (2): 30 kB | 58/316 kBProgress (2): 30 kB | 62/316 kBProgress (2): 30 kB | 66/316 kBProgress (2): 30 kB | 70/316 kBProgress (2): 30 kB | 74/316 kBProgress (2): 30 kB | 79/316 kBProgress (2): 30 kB | 83/316 kBProgress (2): 30 kB | 87/316 kBProgress (2): 30 kB | 91/316 kBProgress (2): 30 kB | 95/316 kBProgress (2): 30 kB | 99/316 kBProgress (2): 30 kB | 103/316 kBProgress (2): 30 kB | 107/316 kBProgress (2): 30 kB | 111/316 kBProgress (2): 30 kB | 115/316 kBProgress (2): 30 kB | 120/316 kBProgress (2): 30 kB | 124/316 kBProgress (2): 30 kB | 128/316 kBProgress (2): 30 kB | 132/316 kBProgress (2): 30 kB | 136/316 kBProgress (2): 30 kB | 140/316 kBProgress (2): 30 kB | 144/316 kBProgress (2): 30 kB | 148/316 kBProgress (2): 30 kB | 152/316 kBProgress (2): 30 kB | 156/316 kBProgress (2): 30 kB | 161/316 kBProgress (2): 30 kB | 165/316 kBProgress (2): 30 kB | 169/316 kBProgress (2): 30 kB | 173/316 kBProgress (2): 30 kB | 177/316 kBProgress (2): 30 kB | 181/316 kBProgress (2): 30 kB | 185/316 kBProgress (2): 30 kB | 189/316 kBProgress (2): 30 kB | 193/316 kBProgress (2): 30 kB | 197/316 kBProgress (2): 30 kB | 201/316 kBProgress (2): 30 kB | 206/316 kBProgress (2): 30 kB | 210/316 kBProgress (2): 30 kB | 214/316 kBProgress (2): 30 kB | 218/316 kBProgress (2): 30 kB | 222/316 kBProgress (2): 30 kB | 226/316 kBProgress (2): 30 kB | 230/316 kBProgress (2): 30 kB | 234/316 kBProgress (2): 30 kB | 238/316 kBProgress (2): 30 kB | 242/316 kBProgress (2): 30 kB | 247/316 kBProgress (2): 30 kB | 251/316 kB                                Downloaded from sonatype-public-grid: https://repository.sonatype.org/content/groups/sonatype-public-grid/org/apache/maven/maven-plugin-registry/2.2.1/maven-plugin-registry-2.2.1.jar (30 kB at 38 kB/s)
Progress (1): 255/316 kBProgress (1): 259/316 kBProgress (1): 263/316 kBProgress (1): 267/316 kBProgress (1): 271/316 kBProgress (1): 275/316 kBProgress (1): 279/316 kBProgress (1): 283/316 kBProgress (1): 287/316 kBProgress (1): 292/316 kBProgress (1): 296/316 kBProgress (1): 300/316 kBProgress (1): 304/316 kBProgress (1): 308/316 kBProgress (1): 312/316 kBProgress (1): 316 kB                        Downloaded from sonatype-public-grid: https://repository.sonatype.org/content/groups/sonatype-public-grid/org/apache/commons/commons-lang3/3.1/commons-lang3-3.1.jar (316 kB at 320 kB/s)
Downloading from tycho: https://oss.sonatype.org/content/repositories/public/org/eclipse/tycho/tycho-p2-publisher-plugin/1.2.0/tycho-p2-publisher-plugin-1.2.0.pom
Progress (1): 2.1 kB                    Downloaded from tycho: https://oss.sonatype.org/content/repositories/public/org/eclipse/tycho/tycho-p2-publisher-plugin/1.2.0/tycho-p2-publisher-plugin-1.2.0.pom (2.1 kB at 9.3 kB/s)
Downloading from tycho: https://oss.sonatype.org/content/repositories/public/org/eclipse/tycho/tycho-p2-publisher-plugin/1.2.0/tycho-p2-publisher-plugin-1.2.0.jar
Progress (1): 4.1/22 kBProgress (1): 7.8/22 kBProgress (1): 12/22 kB Progress (1): 16/22 kBProgress (1): 20/22 kBProgress (1): 22 kB                      Downloaded from tycho: https://oss.sonatype.org/content/repositories/public/org/eclipse/tycho/tycho-p2-publisher-plugin/1.2.0/tycho-p2-publisher-plugin-1.2.0.jar (22 kB at 136 kB/s)
Downloading from tycho: https://oss.sonatype.org/content/repositories/public/org/eclipse/tycho/tycho-p2-repository-plugin/1.2.0/tycho-p2-repository-plugin-1.2.0.pom
Progress (1): 1.4 kB                    Downloaded from tycho: https://oss.sonatype.org/content/repositories/public/org/eclipse/tycho/tycho-p2-repository-plugin/1.2.0/tycho-p2-repository-plugin-1.2.0.pom (1.4 kB at 13 kB/s)
Downloading from tycho: https://oss.sonatype.org/content/repositories/public/org/eclipse/tycho/tycho-p2-repository-plugin/1.2.0/tycho-p2-repository-plugin-1.2.0.jar
Progress (1): 4.1/14 kBProgress (1): 7.8/14 kBProgress (1): 12/14 kB Progress (1): 14 kB                      Downloaded from tycho: https://oss.sonatype.org/content/repositories/public/org/eclipse/tycho/tycho-p2-repository-plugin/1.2.0/tycho-p2-repository-plugin-1.2.0.jar (14 kB at 82 kB/s)
[INFO] Computing target platform for MavenProject: org.eclipse.webtools.common:org.eclipse.wst.common.api.doc:1.0.2-SNAPSHOT @ /jobs/genie.webtools/webtools-common_master/workspace/docs/org.eclipse.wst.common.api.doc/pom.xml
[INFO] Adding repository http://download.eclipse.org/cbi/updates/license/1.0.1.v20140414-1359
[ERROR] Internal error: java.lang.RuntimeException: Failed to load p2 repository with ID 'license-feature' from location http://download.eclipse.org/cbi/updates/license/1.0.1.v20140414-1359/: No repository found at http://download.eclipse.org/cbi/updates/license/1.0.1.v20140414-1359. -> [Help 1]
org.apache.maven.InternalErrorException: Internal error: java.lang.RuntimeException: Failed to load p2 repository with ID 'license-feature' from location http://download.eclipse.org/cbi/updates/license/1.0.1.v20140414-1359/
    at org.apache.maven.DefaultMaven.execute (DefaultMaven.java:120)
    at org.apache.maven.cli.MavenCli.execute (MavenCli.java:954)
    at org.apache.maven.cli.MavenCli.doMain (MavenCli.java:288)
    at org.apache.maven.cli.MavenCli.main (MavenCli.java:192)
    at sun.reflect.NativeMethodAccessorImpl.invoke0 (Native Method)
    at sun.reflect.NativeMethodAccessorImpl.invoke (NativeMethodAccessorImpl.java:62)
    at sun.reflect.DelegatingMethodAccessorImpl.invoke (DelegatingMethodAccessorImpl.java:43)
    at java.lang.reflect.Method.invoke (Method.java:498)
    at org.codehaus.plexus.classworlds.launcher.Launcher.launchEnhanced (Launcher.java:289)
    at org.codehaus.plexus.classworlds.launcher.Launcher.launch (Launcher.java:229)
    at org.codehaus.plexus.classworlds.launcher.Launcher.mainWithExitCode (Launcher.java:415)
    at org.codehaus.plexus.classworlds.launcher.Launcher.main (Launcher.java:356)
Caused by: java.lang.RuntimeException: Failed to load p2 repository with ID 'license-feature' from location http://download.eclipse.org/cbi/updates/license/1.0.1.v20140414-1359/
    at org.eclipse.tycho.p2.target.TargetPlatformFactoryImpl.loadMetadataRepository (TargetPlatformFactoryImpl.java:302)
    at org.eclipse.tycho.p2.target.TargetPlatformFactoryImpl.gatherExternalInstallableUnits (TargetPlatformFactoryImpl.java:270)
    at org.eclipse.tycho.p2.target.TargetPlatformFactoryImpl.createTargetPlatform (TargetPlatformFactoryImpl.java:176)
    at org.eclipse.tycho.p2.target.TargetPlatformFactoryImpl.createTargetPlatform (TargetPlatformFactoryImpl.java:128)
    at org.eclipse.tycho.p2.target.TargetPlatformFactoryImpl.createTargetPlatform (TargetPlatformFactoryImpl.java:1)
    at org.eclipse.tycho.p2.manager.ReactorRepositoryManagerImpl.computePreliminaryTargetPlatform (ReactorRepositoryManagerImpl.java:84)
    at org.eclipse.tycho.p2.resolver.P2DependencyResolver.computePreliminaryTargetPlatform (P2DependencyResolver.java:223)
    at org.eclipse.tycho.core.resolver.DefaultTychoResolver.resolveProject (DefaultTychoResolver.java:109)
    at org.eclipse.tycho.core.maven.TychoMavenLifecycleParticipant.afterProjectsRead (TychoMavenLifecycleParticipant.java:95)
    at org.apache.maven.DefaultMaven.doExecute (DefaultMaven.java:264)
    at org.apache.maven.DefaultMaven.doExecute (DefaultMaven.java:192)
    at org.apache.maven.DefaultMaven.execute (DefaultMaven.java:105)
    at org.apache.maven.cli.MavenCli.execute (MavenCli.java:954)
    at org.apache.maven.cli.MavenCli.doMain (MavenCli.java:288)
    at org.apache.maven.cli.MavenCli.main (MavenCli.java:192)
    at sun.reflect.NativeMethodAccessorImpl.invoke0 (Native Method)
    at sun.reflect.NativeMethodAccessorImpl.invoke (NativeMethodAccessorImpl.java:62)
    at sun.reflect.DelegatingMethodAccessorImpl.invoke (DelegatingMethodAccessorImpl.java:43)
    at java.lang.reflect.Method.invoke (Method.java:498)
    at org.codehaus.plexus.classworlds.launcher.Launcher.launchEnhanced (Launcher.java:289)
    at org.codehaus.plexus.classworlds.launcher.Launcher.launch (Launcher.java:229)
    at org.codehaus.plexus.classworlds.launcher.Launcher.mainWithExitCode (Launcher.java:415)
    at org.codehaus.plexus.classworlds.launcher.Launcher.main (Launcher.java:356)
Caused by: org.eclipse.equinox.p2.core.ProvisionException: No repository found at http://download.eclipse.org/cbi/updates/license/1.0.1.v20140414-1359.
    at org.eclipse.equinox.internal.p2.repository.helpers.AbstractRepositoryManager.fail (AbstractRepositoryManager.java:395)
    at org.eclipse.equinox.internal.p2.repository.helpers.AbstractRepositoryManager.loadRepository (AbstractRepositoryManager.java:692)
    at org.eclipse.equinox.internal.p2.metadata.repository.MetadataRepositoryManager.loadRepository (MetadataRepositoryManager.java:107)
    at org.eclipse.tycho.p2.remote.RemoteMetadataRepositoryManager.loadRepository (RemoteMetadataRepositoryManager.java:61)
    at org.eclipse.tycho.p2.remote.RemoteMetadataRepositoryManager.loadRepository (RemoteMetadataRepositoryManager.java:53)
    at org.eclipse.tycho.p2.target.TargetPlatformFactoryImpl.loadMetadataRepository (TargetPlatformFactoryImpl.java:298)
    at org.eclipse.tycho.p2.target.TargetPlatformFactoryImpl.gatherExternalInstallableUnits (TargetPlatformFactoryImpl.java:270)
    at org.eclipse.tycho.p2.target.TargetPlatformFactoryImpl.createTargetPlatform (TargetPlatformFactoryImpl.java:176)
    at org.eclipse.tycho.p2.target.TargetPlatformFactoryImpl.createTargetPlatform (TargetPlatformFactoryImpl.java:128)
    at org.eclipse.tycho.p2.target.TargetPlatformFactoryImpl.createTargetPlatform (TargetPlatformFactoryImpl.java:1)
    at org.eclipse.tycho.p2.manager.ReactorRepositoryManagerImpl.computePreliminaryTargetPlatform (ReactorRepositoryManagerImpl.java:84)
    at org.eclipse.tycho.p2.resolver.P2DependencyResolver.computePreliminaryTargetPlatform (P2DependencyResolver.java:223)
    at org.eclipse.tycho.core.resolver.DefaultTychoResolver.resolveProject (DefaultTychoResolver.java:109)
    at org.eclipse.tycho.core.maven.TychoMavenLifecycleParticipant.afterProjectsRead (TychoMavenLifecycleParticipant.java:95)
    at org.apache.maven.DefaultMaven.doExecute (DefaultMaven.java:264)
    at org.apache.maven.DefaultMaven.doExecute (DefaultMaven.java:192)
    at org.apache.maven.DefaultMaven.execute (DefaultMaven.java:105)
    at org.apache.maven.cli.MavenCli.execute (MavenCli.java:954)
    at org.apache.maven.cli.MavenCli.doMain (MavenCli.java:288)
    at org.apache.maven.cli.MavenCli.main (MavenCli.java:192)
    at sun.reflect.NativeMethodAccessorImpl.invoke0 (Native Method)
    at sun.reflect.NativeMethodAccessorImpl.invoke (NativeMethodAccessorImpl.java:62)
    at sun.reflect.DelegatingMethodAccessorImpl.invoke (DelegatingMethodAccessorImpl.java:43)
    at java.lang.reflect.Method.invoke (Method.java:498)
    at org.codehaus.plexus.classworlds.launcher.Launcher.launchEnhanced (Launcher.java:289)
    at org.codehaus.plexus.classworlds.launcher.Launcher.launch (Launcher.java:229)
    at org.codehaus.plexus.classworlds.launcher.Launcher.mainWithExitCode (Launcher.java:415)
    at org.codehaus.plexus.classworlds.launcher.Launcher.main (Launcher.java:356)
[ERROR] 
[ERROR] To see the full stack trace of the errors, re-run Maven with the -e switch.
[ERROR] Re-run Maven using the -X switch to enable full debug logging.
[ERROR] 
[ERROR] For more information about the errors and possible solutions, please read the following articles:
[ERROR] [Help 1] http://cwiki.apache.org/confluence/display/MAVEN/InternalErrorException
Build step 'Invoke top-level Maven targets' marked build as failure
Taking screenshot.
[workspace] $ echo $XAUTHORITY
<https://ci.eclipse.org/webtools/job/webtools-common_master/ws/.Xauthority-5872254995861251546>
[workspace] $ ls -l $XAUTHORITY
-rw-rw-r-- 1 genie.webtools webtools 0 Sep 16 00:23 <https://ci.eclipse.org/webtools/job/webtools-common_master/ws/.Xauthority-5872254995861251546>
[workspace] $ import -window root -display :451 screenshot.jpg
Terminating xvnc.
[WARNINGS] Skipping publisher since build result is FAILURE
append disk usage
Started calculate disk usage of build
Finished Calculation of disk usage of build in 0 seconds
Started calculate disk usage of workspace
Finished Calculation of disk usage of workspace in 0 seconds