[Date Prev][Date Next][Thread Prev][Thread Next][Date Index][Thread Index] [List Home]
[wtp-releng] Build failed in Jenkins: webtools-common_master #245

See <https://ci.eclipse.org/webtools/job/webtools-common_master/245/display/redirect>

------------------------------------------
[...truncated 3.03 MB...]
[WARNING] Using platform encoding (UTF-8 actually) to copy filtered resources, i.e. build is platform dependent!
[INFO] skip non existing resourceDirectory /jobs/genie.webtools/webtools-common_master/workspace/tests/org.eclipse.wst.common.tests.validation.guard/src/main/resources
[INFO] 
[INFO] --- tycho-compiler-plugin:1.2.0:compile (default-compile) @ org.eclipse.wst.common.tests.validation.guard ---
[INFO] Compiling 3 source files to /jobs/genie.webtools/webtools-common_master/workspace/tests/org.eclipse.wst.common.tests.validation.guard/target/classes
[INFO] 
[INFO] --- maven-resources-plugin:2.4.3:testResources (default-testResources) @ org.eclipse.wst.common.tests.validation.guard ---
[WARNING] Using platform encoding (UTF-8 actually) to copy filtered resources, i.e. build is platform dependent!
[INFO] skip non existing resourceDirectory /jobs/genie.webtools/webtools-common_master/workspace/tests/org.eclipse.wst.common.tests.validation.guard/src/test/resources
[INFO] 
[INFO] --- tycho-source-plugin:1.2.0:plugin-source (plugin-source) @ org.eclipse.wst.common.tests.validation.guard ---
[INFO] Building jar: /jobs/genie.webtools/webtools-common_master/workspace/tests/org.eclipse.wst.common.tests.validation.guard/target/org.eclipse.wst.common.tests.validation.guard-1.0.200-SNAPSHOT-sources.jar
[INFO] 
[INFO] --- target-platform-configuration:1.2.0:target-platform (default-target-platform) @ org.eclipse.wst.common.tests.validation.guard ---
[INFO] 
[INFO] --- tycho-packaging-plugin:1.2.0:package-plugin (default-package-plugin) @ org.eclipse.wst.common.tests.validation.guard ---
[INFO] Building jar: /jobs/genie.webtools/webtools-common_master/workspace/tests/org.eclipse.wst.common.tests.validation.guard/target/org.eclipse.wst.common.tests.validation.guard-1.0.200-SNAPSHOT.jar
[INFO] 
[INFO] --- tycho-p2-plugin:1.2.0:p2-metadata-default (default-p2-metadata-default) @ org.eclipse.wst.common.tests.validation.guard ---
[INFO] 
[INFO] --- tycho-pack200a-plugin:1.2.0:normalize (pack200-normalize) @ org.eclipse.wst.common.tests.validation.guard ---
[INFO] Pack200 normalizing jar /jobs/genie.webtools/webtools-common_master/workspace/tests/org.eclipse.wst.common.tests.validation.guard/target/org.eclipse.wst.common.tests.validation.guard-1.0.200-SNAPSHOT.jar
Picked up JAVA_TOOL_OPTIONS: -Xmx2G -Djava.io.tmpdir=/tmp/genie.webtools
Picked up JAVA_TOOL_OPTIONS: -Xmx2G -Djava.io.tmpdir=/tmp/genie.webtools
[INFO] 
[INFO] --- eclipse-jarsigner-plugin:1.1.4:sign (sign) @ org.eclipse.wst.common.tests.validation.guard ---
[INFO] Signing jar: /jobs/genie.webtools/webtools-common_master/workspace/tests/org.eclipse.wst.common.tests.validation.guard/target/org.eclipse.wst.common.tests.validation.guard-1.0.200-SNAPSHOT.jar
[INFO] Signing jar: /jobs/genie.webtools/webtools-common_master/workspace/tests/org.eclipse.wst.common.tests.validation.guard/target/org.eclipse.wst.common.tests.validation.guard-1.0.200-SNAPSHOT-sources.jar
[INFO] 
[INFO] --- tycho-pack200b-plugin:1.2.0:pack (pack200-pack) @ org.eclipse.wst.common.tests.validation.guard ---
[INFO] Pack200 packing jar /jobs/genie.webtools/webtools-common_master/workspace/tests/org.eclipse.wst.common.tests.validation.guard/target/org.eclipse.wst.common.tests.validation.guard-1.0.200-SNAPSHOT.jar
Picked up JAVA_TOOL_OPTIONS: -Xmx2G -Djava.io.tmpdir=/tmp/genie.webtools
[INFO] 
[INFO] --- tycho-p2-plugin:1.2.0:p2-metadata (p2-metadata) @ org.eclipse.wst.common.tests.validation.guard ---
[INFO] No baseline version MavenProject: org.eclipse.webtools.common:org.eclipse.wst.common.tests.validation.guard:1.0.200-SNAPSHOT @ /jobs/genie.webtools/webtools-common_master/workspace/tests/org.eclipse.wst.common.tests.validation.guard/pom.xml
[INFO] 
[INFO] --- maven-install-plugin:2.3.1:install (default-install) @ org.eclipse.wst.common.tests.validation.guard ---
[INFO] Installing /jobs/genie.webtools/webtools-common_master/workspace/tests/org.eclipse.wst.common.tests.validation.guard/target/org.eclipse.wst.common.tests.validation.guard-1.0.200-SNAPSHOT.jar to <https://ci.eclipse.org/webtools/job/webtools-common_master/ws/.repository/org/eclipse/webtools/common/org.eclipse.wst.common.tests.validation.guard/1.0.200-SNAPSHOT/org.eclipse.wst.common.tests.validation.guard-1.0.200-SNAPSHOT.jar>
[INFO] Installing /jobs/genie.webtools/webtools-common_master/workspace/tests/org.eclipse.wst.common.tests.validation.guard/pom.xml to <https://ci.eclipse.org/webtools/job/webtools-common_master/ws/.repository/org/eclipse/webtools/common/org.eclipse.wst.common.tests.validation.guard/1.0.200-SNAPSHOT/org.eclipse.wst.common.tests.validation.guard-1.0.200-SNAPSHOT.pom>
[INFO] Installing /jobs/genie.webtools/webtools-common_master/workspace/tests/org.eclipse.wst.common.tests.validation.guard/target/org.eclipse.wst.common.tests.validation.guard-1.0.200-SNAPSHOT-sources.jar to <https://ci.eclipse.org/webtools/job/webtools-common_master/ws/.repository/org/eclipse/webtools/common/org.eclipse.wst.common.tests.validation.guard/1.0.200-SNAPSHOT/org.eclipse.wst.common.tests.validation.guard-1.0.200-SNAPSHOT-sources.jar>
[INFO] Installing /jobs/genie.webtools/webtools-common_master/workspace/tests/org.eclipse.wst.common.tests.validation.guard/target/org.eclipse.wst.common.tests.validation.guard-1.0.200-SNAPSHOT.jar.pack.gz to <https://ci.eclipse.org/webtools/job/webtools-common_master/ws/.repository/org/eclipse/webtools/common/org.eclipse.wst.common.tests.validation.guard/1.0.200-SNAPSHOT/org.eclipse.wst.common.tests.validation.guard-1.0.200-SNAPSHOT-pack200.jar.pack.gz>
[INFO] Installing /jobs/genie.webtools/webtools-common_master/workspace/tests/org.eclipse.wst.common.tests.validation.guard/target/p2content.xml to <https://ci.eclipse.org/webtools/job/webtools-common_master/ws/.repository/org/eclipse/webtools/common/org.eclipse.wst.common.tests.validation.guard/1.0.200-SNAPSHOT/org.eclipse.wst.common.tests.validation.guard-1.0.200-SNAPSHOT-p2metadata.xml>
[INFO] Installing /jobs/genie.webtools/webtools-common_master/workspace/tests/org.eclipse.wst.common.tests.validation.guard/target/p2artifacts.xml to <https://ci.eclipse.org/webtools/job/webtools-common_master/ws/.repository/org/eclipse/webtools/common/org.eclipse.wst.common.tests.validation.guard/1.0.200-SNAPSHOT/org.eclipse.wst.common.tests.validation.guard-1.0.200-SNAPSHOT-p2artifacts.xml>
[INFO] 
[INFO] --- tycho-p2-plugin:1.2.0:update-local-index (default-update-local-index) @ org.eclipse.wst.common.tests.validation.guard ---
[INFO] 
[INFO] --< org.eclipse.webtools.common:org.eclipse.wst.internet.cache.tests >--
[INFO] Building org.eclipse.wst.internet.cache.tests 1.0.100-SNAPSHOT   [48/50]
[INFO] ------------------------[ eclipse-test-plugin ]-------------------------
[INFO] 
[INFO] --- maven-clean-plugin:2.5:clean (default-clean) @ org.eclipse.wst.internet.cache.tests ---
[INFO] 
[INFO] --- tycho-packaging-plugin:1.2.0:build-qualifier (default-build-qualifier) @ org.eclipse.wst.internet.cache.tests ---
[INFO] The project's OSGi version is 1.0.100.v201004201859
[INFO] 
[INFO] --- tycho-packaging-plugin:1.2.0:validate-id (default-validate-id) @ org.eclipse.wst.internet.cache.tests ---
[INFO] 
[INFO] --- tycho-packaging-plugin:1.2.0:validate-version (default-validate-version) @ org.eclipse.wst.internet.cache.tests ---
[INFO] 
[INFO] --- build-helper-maven-plugin:3.0.0:regex-property (regex-property) @ org.eclipse.wst.internet.cache.tests ---
[INFO] 
[INFO] --- maven-resources-plugin:2.4.3:resources (default-resources) @ org.eclipse.wst.internet.cache.tests ---
[WARNING] Using platform encoding (UTF-8 actually) to copy filtered resources, i.e. build is platform dependent!
[INFO] skip non existing resourceDirectory /jobs/genie.webtools/webtools-common_master/workspace/tests/org.eclipse.wst.internet.cache.tests/src/main/resources
[INFO] 
[INFO] --- tycho-compiler-plugin:1.2.0:compile (default-compile) @ org.eclipse.wst.internet.cache.tests ---
[INFO] Compiling 7 source files to /jobs/genie.webtools/webtools-common_master/workspace/tests/org.eclipse.wst.internet.cache.tests/target/classes
[INFO] 
[INFO] --- maven-resources-plugin:2.4.3:testResources (default-testResources) @ org.eclipse.wst.internet.cache.tests ---
[WARNING] Using platform encoding (UTF-8 actually) to copy filtered resources, i.e. build is platform dependent!
[INFO] skip non existing resourceDirectory /jobs/genie.webtools/webtools-common_master/workspace/tests/org.eclipse.wst.internet.cache.tests/src/test/resources
[INFO] 
[INFO] --- tycho-source-plugin:1.2.0:plugin-source (plugin-source) @ org.eclipse.wst.internet.cache.tests ---
[INFO] Building jar: /jobs/genie.webtools/webtools-common_master/workspace/tests/org.eclipse.wst.internet.cache.tests/target/org.eclipse.wst.internet.cache.tests-1.0.100-SNAPSHOT-sources.jar
[INFO] 
[INFO] --- target-platform-configuration:1.2.0:target-platform (default-target-platform) @ org.eclipse.wst.internet.cache.tests ---
[INFO] 
[INFO] --- tycho-packaging-plugin:1.2.0:package-plugin (default-package-plugin) @ org.eclipse.wst.internet.cache.tests ---
[INFO] Building jar: /jobs/genie.webtools/webtools-common_master/workspace/tests/org.eclipse.wst.internet.cache.tests/tests.jar
[INFO] Building jar: /jobs/genie.webtools/webtools-common_master/workspace/tests/org.eclipse.wst.internet.cache.tests/target/org.eclipse.wst.internet.cache.tests-1.0.100-SNAPSHOT.jar
[INFO] 
[INFO] --- tycho-p2-plugin:1.2.0:p2-metadata-default (default-p2-metadata-default) @ org.eclipse.wst.internet.cache.tests ---
[INFO] 
[INFO] --- tycho-surefire-plugin:1.2.0:test (default-test) @ org.eclipse.wst.internet.cache.tests ---
[INFO] Expected eclipse log file: /jobs/genie.webtools/webtools-common_master/workspace/tests/org.eclipse.wst.internet.cache.tests/target/work/data/.metadata/.log
[INFO] Command line:
	[/opt/public/common/java/oracle/jdk1.8.0_162_x64/jre/bin/java, -Dosgi.noShutdown=false, -Dosgi.os=linux, -Dosgi.ws=gtk, -Dosgi.arch=x86_64, -Dosgi.clean=true, -jar, /jobs/genie.webtools/webtools-common_master/workspace/.repository/p2/osgi/bundle/org.eclipse.equinox.launcher/1.5.100.v20180611-1436/org.eclipse.equinox.launcher-1.5.100.v20180611-1436.jar, -data, /jobs/genie.webtools/webtools-common_master/workspace/tests/org.eclipse.wst.internet.cache.tests/target/work/data, -install, /jobs/genie.webtools/webtools-common_master/workspace/tests/org.eclipse.wst.internet.cache.tests/target/work, -configuration, /jobs/genie.webtools/webtools-common_master/workspace/tests/org.eclipse.wst.internet.cache.tests/target/work/configuration, -application, org.eclipse.tycho.surefire.osgibooter.headlesstest, -testproperties, /jobs/genie.webtools/webtools-common_master/workspace/tests/org.eclipse.wst.internet.cache.tests/target/surefire.properties]
Picked up JAVA_TOOL_OPTIONS: -Xmx2G -Djava.io.tmpdir=/tmp/genie.webtools
Running org.eclipse.wst.internet.cache.internal.LicenseRegistryTest
Tests run: 6, Failures: 0, Errors: 0, Skipped: 0, Time elapsed: 0.059 sec - in org.eclipse.wst.internet.cache.internal.LicenseRegistryTest
testDisgreeToLicense(org.eclipse.wst.internet.cache.internal.LicenseRegistryTest)  Time elapsed: 0.038 sec
testAddLicenseToRegistryTwice(org.eclipse.wst.internet.cache.internal.LicenseRegistryTest)  Time elapsed: 0 sec
testAddLicenseToRegistry(org.eclipse.wst.internet.cache.internal.LicenseRegistryTest)  Time elapsed: 0 sec
testAgreeToLicense(org.eclipse.wst.internet.cache.internal.LicenseRegistryTest)  Time elapsed: 0.001 sec
testAgreeToLicenseNotInRegistry(org.eclipse.wst.internet.cache.internal.LicenseRegistryTest)  Time elapsed: 0 sec
testDisagreeToLicenseNotInRegistry(org.eclipse.wst.internet.cache.internal.LicenseRegistryTest)  Time elapsed: 0 sec
Running org.eclipse.wst.internet.cache.internal.CacheEntryTest
Tests run: 3, Failures: 0, Errors: 0, Skipped: 0, Time elapsed: 0.003 sec - in org.eclipse.wst.internet.cache.internal.CacheEntryTest
testExpiredWhenLessThanSystemTime(org.eclipse.wst.internet.cache.internal.CacheEntryTest)  Time elapsed: 0 sec
testNotExpiredWhenMinusOne(org.eclipse.wst.internet.cache.internal.CacheEntryTest)  Time elapsed: 0 sec
testNotExpiredWhenGreaterThanSystemTime(org.eclipse.wst.internet.cache.internal.CacheEntryTest)  Time elapsed: 0 sec
Running org.eclipse.wst.internet.cache.internal.CacheTest
Tests run: 10, Failures: 0, Errors: 0, Skipped: 0, Time elapsed: 1.747 sec - in org.eclipse.wst.internet.cache.internal.CacheTest
testResultStartsWithFile(org.eclipse.wst.internet.cache.internal.CacheTest)  Time elapsed: 0.104 sec
testClearCacheWithSingleEntry(org.eclipse.wst.internet.cache.internal.CacheTest)  Time elapsed: 0.074 sec
testDeleteNullCacheEntry(org.eclipse.wst.internet.cache.internal.CacheTest)  Time elapsed: 0.069 sec
testGetResourceThatExists(org.eclipse.wst.internet.cache.internal.CacheTest)  Time elapsed: 0.07 sec
testClearCacheWithMultipleEntries(org.eclipse.wst.internet.cache.internal.CacheTest)  Time elapsed: 0.148 sec
testGetNullResource(org.eclipse.wst.internet.cache.internal.CacheTest)  Time elapsed: 0 sec
testGetNonExistantResource(org.eclipse.wst.internet.cache.internal.CacheTest)  Time elapsed: 0.037 sec
testDeleteCacheEntry(org.eclipse.wst.internet.cache.internal.CacheTest)  Time elapsed: 0.085 sec
testGetCacheEntries(org.eclipse.wst.internet.cache.internal.CacheTest)  Time elapsed: 1.155 sec
testGetInstance(org.eclipse.wst.internet.cache.internal.CacheTest)  Time elapsed: 0 sec
Running org.eclipse.wst.internet.cache.internal.CacheURIResolverExtensionTest
Tests run: 7, Failures: 0, Errors: 0, Skipped: 0, Time elapsed: 4.757 sec - in org.eclipse.wst.internet.cache.internal.CacheURIResolverExtensionTest
testAbsoluteSystemIdNullBaselocation(org.eclipse.wst.internet.cache.internal.CacheURIResolverExtensionTest)  Time elapsed: 4.683 sec
testRelativeSystemIdWillNullBaselocation(org.eclipse.wst.internet.cache.internal.CacheURIResolverExtensionTest)  Time elapsed: 0 sec
testReturnsNullWhenDisabled(org.eclipse.wst.internet.cache.internal.CacheURIResolverExtensionTest)  Time elapsed: 0 sec
testResolveNullSystemIdAndBaselocation(org.eclipse.wst.internet.cache.internal.CacheURIResolverExtensionTest)  Time elapsed: 0 sec
testResolveNullSystemId(org.eclipse.wst.internet.cache.internal.CacheURIResolverExtensionTest)  Time elapsed: 0.001 sec
testRelativeSystemId(org.eclipse.wst.internet.cache.internal.CacheURIResolverExtensionTest)  Time elapsed: 0.067 sec
testAbsoluteSystemId(org.eclipse.wst.internet.cache.internal.CacheURIResolverExtensionTest)  Time elapsed: 0 sec

Results :

Tests run: 26, Failures: 0, Errors: 0, Skipped: 0

[INFO] All tests passed!
[INFO] 
[INFO] --- tycho-pack200a-plugin:1.2.0:normalize (pack200-normalize) @ org.eclipse.wst.internet.cache.tests ---
[INFO] Pack200 normalizing jar /jobs/genie.webtools/webtools-common_master/workspace/tests/org.eclipse.wst.internet.cache.tests/target/org.eclipse.wst.internet.cache.tests-1.0.100-SNAPSHOT.jar
Picked up JAVA_TOOL_OPTIONS: -Xmx2G -Djava.io.tmpdir=/tmp/genie.webtools
Picked up JAVA_TOOL_OPTIONS: -Xmx2G -Djava.io.tmpdir=/tmp/genie.webtools
[INFO] 
[INFO] --- eclipse-jarsigner-plugin:1.1.4:sign (sign) @ org.eclipse.wst.internet.cache.tests ---
[INFO] Signing of nested jars of '/jobs/genie.webtools/webtools-common_master/workspace/tests/org.eclipse.wst.internet.cache.tests/target/org.eclipse.wst.internet.cache.tests-1.0.100-SNAPSHOT.jar_unpacked_8132450609473916655/tests.jar' is disabled.
[INFO] Signing jar: /jobs/genie.webtools/webtools-common_master/workspace/tests/org.eclipse.wst.internet.cache.tests/target/org.eclipse.wst.internet.cache.tests-1.0.100-SNAPSHOT.jar_unpacked_8132450609473916655/tests.jar
[INFO] Signing jar: /jobs/genie.webtools/webtools-common_master/workspace/tests/org.eclipse.wst.internet.cache.tests/target/org.eclipse.wst.internet.cache.tests-1.0.100-SNAPSHOT.jar
[INFO] Signing jar: /jobs/genie.webtools/webtools-common_master/workspace/tests/org.eclipse.wst.internet.cache.tests/target/org.eclipse.wst.internet.cache.tests-1.0.100-SNAPSHOT-sources.jar
[INFO] 
[INFO] --- tycho-pack200b-plugin:1.2.0:pack (pack200-pack) @ org.eclipse.wst.internet.cache.tests ---
[INFO] Pack200 packing jar /jobs/genie.webtools/webtools-common_master/workspace/tests/org.eclipse.wst.internet.cache.tests/target/org.eclipse.wst.internet.cache.tests-1.0.100-SNAPSHOT.jar
Picked up JAVA_TOOL_OPTIONS: -Xmx2G -Djava.io.tmpdir=/tmp/genie.webtools
[INFO] 
[INFO] --- tycho-p2-plugin:1.2.0:p2-metadata (p2-metadata) @ org.eclipse.wst.internet.cache.tests ---
[INFO] No baseline version MavenProject: org.eclipse.webtools.common:org.eclipse.wst.internet.cache.tests:1.0.100-SNAPSHOT @ /jobs/genie.webtools/webtools-common_master/workspace/tests/org.eclipse.wst.internet.cache.tests/pom.xml
[INFO] 
[INFO] --- maven-install-plugin:2.3.1:install (default-install) @ org.eclipse.wst.internet.cache.tests ---
[INFO] Installing /jobs/genie.webtools/webtools-common_master/workspace/tests/org.eclipse.wst.internet.cache.tests/target/org.eclipse.wst.internet.cache.tests-1.0.100-SNAPSHOT.jar to <https://ci.eclipse.org/webtools/job/webtools-common_master/ws/.repository/org/eclipse/webtools/common/org.eclipse.wst.internet.cache.tests/1.0.100-SNAPSHOT/org.eclipse.wst.internet.cache.tests-1.0.100-SNAPSHOT.jar>
[INFO] Installing /jobs/genie.webtools/webtools-common_master/workspace/tests/org.eclipse.wst.internet.cache.tests/pom.xml to <https://ci.eclipse.org/webtools/job/webtools-common_master/ws/.repository/org/eclipse/webtools/common/org.eclipse.wst.internet.cache.tests/1.0.100-SNAPSHOT/org.eclipse.wst.internet.cache.tests-1.0.100-SNAPSHOT.pom>
[INFO] Installing /jobs/genie.webtools/webtools-common_master/workspace/tests/org.eclipse.wst.internet.cache.tests/target/org.eclipse.wst.internet.cache.tests-1.0.100-SNAPSHOT-sources.jar to <https://ci.eclipse.org/webtools/job/webtools-common_master/ws/.repository/org/eclipse/webtools/common/org.eclipse.wst.internet.cache.tests/1.0.100-SNAPSHOT/org.eclipse.wst.internet.cache.tests-1.0.100-SNAPSHOT-sources.jar>
[INFO] Installing /jobs/genie.webtools/webtools-common_master/workspace/tests/org.eclipse.wst.internet.cache.tests/target/org.eclipse.wst.internet.cache.tests-1.0.100-SNAPSHOT.jar.pack.gz to <https://ci.eclipse.org/webtools/job/webtools-common_master/ws/.repository/org/eclipse/webtools/common/org.eclipse.wst.internet.cache.tests/1.0.100-SNAPSHOT/org.eclipse.wst.internet.cache.tests-1.0.100-SNAPSHOT-pack200.jar.pack.gz>
[INFO] Installing /jobs/genie.webtools/webtools-common_master/workspace/tests/org.eclipse.wst.internet.cache.tests/target/p2content.xml to <https://ci.eclipse.org/webtools/job/webtools-common_master/ws/.repository/org/eclipse/webtools/common/org.eclipse.wst.internet.cache.tests/1.0.100-SNAPSHOT/org.eclipse.wst.internet.cache.tests-1.0.100-SNAPSHOT-p2metadata.xml>
[INFO] Installing /jobs/genie.webtools/webtools-common_master/workspace/tests/org.eclipse.wst.internet.cache.tests/target/p2artifacts.xml to <https://ci.eclipse.org/webtools/job/webtools-common_master/ws/.repository/org/eclipse/webtools/common/org.eclipse.wst.internet.cache.tests/1.0.100-SNAPSHOT/org.eclipse.wst.internet.cache.tests-1.0.100-SNAPSHOT-p2artifacts.xml>
[INFO] 
[INFO] --- tycho-p2-plugin:1.2.0:update-local-index (default-update-local-index) @ org.eclipse.wst.internet.cache.tests ---
[INFO] 
[INFO] ------------------------------------------------------------------------
[INFO] Skipping org.eclipse.wst.common_tests.feature
[INFO] This project has been banned from the build due to previous failures.
[INFO] ------------------------------------------------------------------------
[INFO] 
[INFO] ------------------------------------------------------------------------
[INFO] Skipping org.eclipse.webtools.common.site
[INFO] This project has been banned from the build due to previous failures.
[INFO] ------------------------------------------------------------------------
[INFO] ------------------------------------------------------------------------
[INFO] Reactor Summary:
[INFO] 
[INFO] org.eclipse.webtools.common 3.6.0-SNAPSHOT ......... SUCCESS [03:01 min]
[INFO] org.eclipse.webtools.common.docs ................... SUCCESS [  0.033 s]
[INFO] org.eclipse.wst.common.api.doc 1.0.2-SNAPSHOT ...... SUCCESS [02:04 min]
[INFO] org.eclipse.wst.validation.doc.isv 1.2.301-SNAPSHOT  SUCCESS [01:02 min]
[INFO] org.eclipse.wst.validation.infopop 1.0.300-SNAPSHOT  SUCCESS [ 23.597 s]
[INFO] org.eclipse.webtools.common.features ............... SUCCESS [  0.057 s]
[INFO] org.eclipse.webtools.common.plugins ................ SUCCESS [  0.035 s]
[INFO] org.eclipse.wst.common.project.facet.core 1.4.300-SNAPSHOT SUCCESS [ 58.307 s]
[INFO] org.eclipse.jst.common.project.facet.core 1.6.0-SNAPSHOT SUCCESS [ 37.996 s]
[INFO] org.eclipse.wst.common.project.facet.ui 1.4.601-SNAPSHOT SUCCESS [ 55.027 s]
[INFO] org.eclipse.jst.common.project.facet.ui 1.4.510-SNAPSHOT SUCCESS [ 28.770 s]
[INFO] org.eclipse.jst.common.fproj.enablement.jdt 3.10.0-SNAPSHOT SUCCESS [  3.746 s]
[INFO] org.eclipse.jst.common.fproj.enablement.jdt.sdk 1.4.201-SNAPSHOT SUCCESS [ 40.817 s]
[INFO] org.eclipse.jst.common.fproj.enablement.jdt.sdk 3.8.0-SNAPSHOT SUCCESS [  4.083 s]
[INFO] org.eclipse.wst.common.core 1.2.0-SNAPSHOT ......... SUCCESS [ 15.917 s]
[INFO] org.eclipse.jem.util 2.1.201-SNAPSHOT .............. SUCCESS [  8.547 s]
[INFO] org.eclipse.wst.common.environment 1.0.400-SNAPSHOT  SUCCESS [ 10.283 s]
[INFO] org.eclipse.wst.common.frameworks 1.2.201-SNAPSHOT . SUCCESS [ 40.118 s]
[INFO] org.eclipse.wst.common.emf 1.2.600-SNAPSHOT ........ SUCCESS [01:10 min]
[INFO] org.eclipse.wst.validation 1.2.701-SNAPSHOT ........ SUCCESS [01:00 min]
[INFO] org.eclipse.wst.common.emfworkbench.integration 1.2.101-SNAPSHOT SUCCESS [ 13.815 s]
[INFO] org.eclipse.wst.common.uriresolver 1.2.300-SNAPSHOT  SUCCESS [ 35.524 s]
[INFO] org.eclipse.wst.common.modulecore 1.3.0-SNAPSHOT ... SUCCESS [ 21.453 s]
[INFO] org.eclipse.wst.common_core.feature 3.9.1-SNAPSHOT . SUCCESS [  3.406 s]
[INFO] org.eclipse.wst.common.fproj 3.7.1-SNAPSHOT ........ SUCCESS [  6.204 s]
[INFO] org.eclipse.wst.common.fproj.sdk 1.4.501-SNAPSHOT .. SUCCESS [ 22.038 s]
[INFO] org.eclipse.wst.common.project.facet.doc.api 1.4.401-SNAPSHOT SUCCESS [  4.648 s]
[INFO] org.eclipse.wst.common.fproj.sdk 3.7.1-SNAPSHOT .... SUCCESS [  7.254 s]
[INFO] org.eclipse.wst.common.frameworks.ui 1.2.400-SNAPSHOT SUCCESS [  8.542 s]
[INFO] org.eclipse.wst.common.modulecore.ui 1.0.301-SNAPSHOT SUCCESS [ 13.791 s]
[INFO] org.eclipse.wst.common.snippets 1.2.400-SNAPSHOT ... SUCCESS [ 15.440 s]
[INFO] org.eclipse.wst.common.ui 1.1.500-SNAPSHOT ......... SUCCESS [ 15.881 s]
[INFO] org.eclipse.wst.common.infopop 1.0.300-SNAPSHOT .... SUCCESS [  7.292 s]
[INFO] org.eclipse.wst.internet.cache 1.0.800-SNAPSHOT .... SUCCESS [ 15.939 s]
[INFO] org.eclipse.wst.validation.ui 1.2.501-SNAPSHOT ..... SUCCESS [ 41.729 s]
[INFO] org.eclipse.wst.common_ui.feature 3.9.2-SNAPSHOT ... SUCCESS [ 11.076 s]
[INFO] org.eclipse.wst.common_sdk.feature 3.9.1-SNAPSHOT .. SUCCESS [  4.843 s]
[INFO] org.eclipse.webtools.common.tests .................. SUCCESS [  0.048 s]
[INFO] org.eclipse.wst.common.project.facet.core.tests 1.4.200-SNAPSHOT SUCCESS [ 48.149 s]
[INFO] org.eclipse.wst.common.project.facet.ui.tests 1.4.200-SNAPSHOT SUCCESS [  6.807 s]
[INFO] org.eclipse.wst.common.snippets.tests 1.0.400-SNAPSHOT FAILURE [02:43 min]
[INFO] org.eclipse.wst.common.tests.collector 1.1.100-SNAPSHOT SUCCESS [ 53.415 s]
[INFO] org.eclipse.wst.common.uriresolver.tests 1.0.100-SNAPSHOT SUCCESS [ 47.341 s]
[INFO] org.eclipse.wst.common.tests 1.2.400-SNAPSHOT ...... SUCCESS [01:12 min]
[INFO] org.eclipse.wst.common.tests.ui 1.1.300-SNAPSHOT ... SUCCESS [ 36.760 s]
[INFO] org.eclipse.wst.common.tests.validation 1.0.400-SNAPSHOT SUCCESS [02:49 min]
[INFO] org.eclipse.wst.common.tests.validation.guard 1.0.200-SNAPSHOT SUCCESS [ 50.417 s]
[INFO] org.eclipse.wst.internet.cache.tests 1.0.100-SNAPSHOT SUCCESS [ 54.664 s]
[INFO] org.eclipse.wst.common_tests.feature 3.6.1-SNAPSHOT  SKIPPED
[INFO] org.eclipse.webtools.common.site 3.6.0-SNAPSHOT .... SKIPPED
[INFO] ------------------------------------------------------------------------
[INFO] BUILD FAILURE
[INFO] ------------------------------------------------------------------------
[INFO] Total time: 38:10 min
[INFO] Finished at: 2018-07-14T00:59:42-04:00
[INFO] ------------------------------------------------------------------------
[ERROR] Failed to execute goal org.eclipse.tycho:tycho-surefire-plugin:1.2.0:test (default-test) on project org.eclipse.wst.common.snippets.tests: Execution default-test of goal org.eclipse.tycho:tycho-surefire-plugin:1.2.0:test failed: Could not mirror artifact osgi.bundle,org.eclipse.ecf.provider.filetransfer.httpclient4,1.1.300.v20180301-0132 into the local Maven repository.See log output for details.: Connection refused (Connection refused) -> [Help 1]
[ERROR] 
[ERROR] To see the full stack trace of the errors, re-run Maven with the -e switch.
[ERROR] Re-run Maven using the -X switch to enable full debug logging.
[ERROR] 
[ERROR] For more information about the errors and possible solutions, please read the following articles:
[ERROR] [Help 1] http://cwiki.apache.org/confluence/display/MAVEN/PluginExecutionException
[ERROR] 
[ERROR] After correcting the problems, you can resume the build with the command
[ERROR]   mvn <goals> -rf :org.eclipse.wst.common.snippets.tests
Build step 'Invoke top-level Maven targets' marked build as failure
Taking screenshot.
[workspace] $ echo $XAUTHORITY
<https://ci.eclipse.org/webtools/job/webtools-common_master/ws/.Xauthority-5285656542197878815>
[workspace] $ ls -l $XAUTHORITY
-rw-rw-r-- 1 genie.webtools webtools 0 Jul 14 00:21 <https://ci.eclipse.org/webtools/job/webtools-common_master/ws/.Xauthority-5285656542197878815>
[workspace] $ import -window root -display :453 screenshot.jpg
Terminating xvnc.
[WARNINGS] Skipping publisher since build result is FAILURE
append disk usage
Started calculate disk usage of build
Finished Calculation of disk usage of build in 0 seconds
Started calculate disk usage of workspace
Finished Calculation of disk usage of workspace in  1 second