[Date Prev][Date Next][Thread Prev][Thread Next][Date Index][Thread Index] [List Home]
[wtp-releng] Build failed in Jenkins: webtools-common_R3_10 #192

See <https://ci.eclipse.org/webtools/job/webtools-common_R3_10/192/display/redirect>

------------------------------------------
[...truncated 324.11 KB...]
Downloading from cbi-repo: https://repo.eclipse.org/content/repositories/cbi/org/codehaus/plexus/plexus-container-default/1.7.1/plexus-container-default-1.7.1.pom
Downloading from tycho-snapshot: https://repo.eclipse.org/content/repositories/tycho-snapshots/org/codehaus/plexus/plexus-container-default/1.7.1/plexus-container-default-1.7.1.pom
Downloading from sonatype-public-grid: https://repository.sonatype.org/content/groups/sonatype-public-grid/org/codehaus/plexus/plexus-container-default/1.7.1/plexus-container-default-1.7.1.pom
Progress (1): 2.8 kB                    Downloaded from sonatype-public-grid: https://repository.sonatype.org/content/groups/sonatype-public-grid/org/codehaus/plexus/plexus-container-default/1.7.1/plexus-container-default-1.7.1.pom (2.8 kB at 36 kB/s)
Downloading from tycho: https://oss.sonatype.org/content/repositories/public/org/codehaus/plexus/plexus-classworlds/2.5.1/plexus-classworlds-2.5.1.pom
Downloading from cbi-repo: https://repo.eclipse.org/content/repositories/cbi/org/codehaus/plexus/plexus-classworlds/2.5.1/plexus-classworlds-2.5.1.pom
Downloading from tycho-snapshot: https://repo.eclipse.org/content/repositories/tycho-snapshots/org/codehaus/plexus/plexus-classworlds/2.5.1/plexus-classworlds-2.5.1.pom
Downloading from sonatype-public-grid: https://repository.sonatype.org/content/groups/sonatype-public-grid/org/codehaus/plexus/plexus-classworlds/2.5.1/plexus-classworlds-2.5.1.pom
Progress (1): 4.1/5.0 kBProgress (1): 5.0 kB                        Downloaded from sonatype-public-grid: https://repository.sonatype.org/content/groups/sonatype-public-grid/org/codehaus/plexus/plexus-classworlds/2.5.1/plexus-classworlds-2.5.1.pom (5.0 kB at 64 kB/s)
Downloading from tycho: https://oss.sonatype.org/content/repositories/public/org/codehaus/plexus/plexus/3.3.1/plexus-3.3.1.pom
Downloading from cbi-repo: https://repo.eclipse.org/content/repositories/cbi/org/codehaus/plexus/plexus/3.3.1/plexus-3.3.1.pom
Downloading from tycho-snapshot: https://repo.eclipse.org/content/repositories/tycho-snapshots/org/codehaus/plexus/plexus/3.3.1/plexus-3.3.1.pom
Downloading from sonatype-public-grid: https://repository.sonatype.org/content/groups/sonatype-public-grid/org/codehaus/plexus/plexus/3.3.1/plexus-3.3.1.pom
Progress (1): 4.1/20 kBProgress (1): 7.9/20 kBProgress (1): 7.9/20 kBProgress (1): 12/20 kB Progress (1): 16/20 kBProgress (1): 20/20 kBProgress (1): 20 kB                      Downloaded from sonatype-public-grid: https://repository.sonatype.org/content/groups/sonatype-public-grid/org/codehaus/plexus/plexus/3.3.1/plexus-3.3.1.pom (20 kB at 269 kB/s)
Downloading from tycho: https://oss.sonatype.org/content/repositories/public/org/apache/xbean/xbean-reflect/3.7/xbean-reflect-3.7.pom
Downloading from cbi-repo: https://repo.eclipse.org/content/repositories/cbi/org/apache/xbean/xbean-reflect/3.7/xbean-reflect-3.7.pom
Downloading from tycho-snapshot: https://repo.eclipse.org/content/repositories/tycho-snapshots/org/apache/xbean/xbean-reflect/3.7/xbean-reflect-3.7.pom
Downloading from sonatype-public-grid: https://repository.sonatype.org/content/groups/sonatype-public-grid/org/apache/xbean/xbean-reflect/3.7/xbean-reflect-3.7.pom
Progress (1): 4.1/5.1 kBProgress (1): 5.1 kB                        Downloaded from sonatype-public-grid: https://repository.sonatype.org/content/groups/sonatype-public-grid/org/apache/xbean/xbean-reflect/3.7/xbean-reflect-3.7.pom (5.1 kB at 67 kB/s)
Downloading from tycho: https://oss.sonatype.org/content/repositories/public/org/apache/xbean/xbean/3.7/xbean-3.7.pom
Downloading from cbi-repo: https://repo.eclipse.org/content/repositories/cbi/org/apache/xbean/xbean/3.7/xbean-3.7.pom
Downloading from tycho-snapshot: https://repo.eclipse.org/content/repositories/tycho-snapshots/org/apache/xbean/xbean/3.7/xbean-3.7.pom
Downloading from sonatype-public-grid: https://repository.sonatype.org/content/groups/sonatype-public-grid/org/apache/xbean/xbean/3.7/xbean-3.7.pom
Progress (1): 4.1/15 kBProgress (1): 7.9/15 kBProgress (1): 7.9/15 kBProgress (1): 12/15 kB Progress (1): 15 kB                      Downloaded from sonatype-public-grid: https://repository.sonatype.org/content/groups/sonatype-public-grid/org/apache/xbean/xbean/3.7/xbean-3.7.pom (15 kB at 195 kB/s)
Downloading from tycho: https://oss.sonatype.org/content/repositories/public/org/apache/geronimo/genesis/genesis-java5-flava/2.0/genesis-java5-flava-2.0.pom
Downloading from cbi-repo: https://repo.eclipse.org/content/repositories/cbi/org/apache/geronimo/genesis/genesis-java5-flava/2.0/genesis-java5-flava-2.0.pom
Downloading from tycho-snapshot: https://repo.eclipse.org/content/repositories/tycho-snapshots/org/apache/geronimo/genesis/genesis-java5-flava/2.0/genesis-java5-flava-2.0.pom
Downloading from sonatype-public-grid: https://repository.sonatype.org/content/groups/sonatype-public-grid/org/apache/geronimo/genesis/genesis-java5-flava/2.0/genesis-java5-flava-2.0.pom
Progress (1): 4.1/5.5 kBProgress (1): 5.5 kB                        Downloaded from sonatype-public-grid: https://repository.sonatype.org/content/groups/sonatype-public-grid/org/apache/geronimo/genesis/genesis-java5-flava/2.0/genesis-java5-flava-2.0.pom (5.5 kB at 69 kB/s)
Downloading from tycho: https://oss.sonatype.org/content/repositories/public/org/apache/geronimo/genesis/genesis-default-flava/2.0/genesis-default-flava-2.0.pom
Downloading from cbi-repo: https://repo.eclipse.org/content/repositories/cbi/org/apache/geronimo/genesis/genesis-default-flava/2.0/genesis-default-flava-2.0.pom
Downloading from tycho-snapshot: https://repo.eclipse.org/content/repositories/tycho-snapshots/org/apache/geronimo/genesis/genesis-default-flava/2.0/genesis-default-flava-2.0.pom
Downloading from sonatype-public-grid: https://repository.sonatype.org/content/groups/sonatype-public-grid/org/apache/geronimo/genesis/genesis-default-flava/2.0/genesis-default-flava-2.0.pom
Progress (1): 4.1/18 kBProgress (1): 7.9/18 kBProgress (1): 7.9/18 kBProgress (1): 12/18 kB Progress (1): 16/18 kBProgress (1): 18 kB                      Downloaded from sonatype-public-grid: https://repository.sonatype.org/content/groups/sonatype-public-grid/org/apache/geronimo/genesis/genesis-default-flava/2.0/genesis-default-flava-2.0.pom (18 kB at 234 kB/s)
Downloading from tycho: https://oss.sonatype.org/content/repositories/public/org/apache/geronimo/genesis/genesis/2.0/genesis-2.0.pom
Downloading from cbi-repo: https://repo.eclipse.org/content/repositories/cbi/org/apache/geronimo/genesis/genesis/2.0/genesis-2.0.pom
Downloading from tycho-snapshot: https://repo.eclipse.org/content/repositories/tycho-snapshots/org/apache/geronimo/genesis/genesis/2.0/genesis-2.0.pom
Downloading from sonatype-public-grid: https://repository.sonatype.org/content/groups/sonatype-public-grid/org/apache/geronimo/genesis/genesis/2.0/genesis-2.0.pom
Progress (1): 4.1/18 kBProgress (1): 7.9/18 kBProgress (1): 12/18 kB Progress (1): 16/18 kBProgress (1): 18 kB                      Downloaded from sonatype-public-grid: https://repository.sonatype.org/content/groups/sonatype-public-grid/org/apache/geronimo/genesis/genesis/2.0/genesis-2.0.pom (18 kB at 236 kB/s)
Downloading from tycho: https://oss.sonatype.org/content/repositories/public/com/google/collections/google-collections/1.0/google-collections-1.0.pom
Downloading from cbi-repo: https://repo.eclipse.org/content/repositories/cbi/com/google/collections/google-collections/1.0/google-collections-1.0.pom
Downloading from tycho-snapshot: https://repo.eclipse.org/content/repositories/tycho-snapshots/com/google/collections/google-collections/1.0/google-collections-1.0.pom
Downloading from sonatype-public-grid: https://repository.sonatype.org/content/groups/sonatype-public-grid/com/google/collections/google-collections/1.0/google-collections-1.0.pom
Progress (1): 2.5 kB                    Downloaded from sonatype-public-grid: https://repository.sonatype.org/content/groups/sonatype-public-grid/com/google/collections/google-collections/1.0/google-collections-1.0.pom (2.5 kB at 33 kB/s)
Downloading from tycho: https://oss.sonatype.org/content/repositories/public/com/google/google/1/google-1.pom
Downloading from cbi-repo: https://repo.eclipse.org/content/repositories/cbi/com/google/google/1/google-1.pom
Downloading from tycho-snapshot: https://repo.eclipse.org/content/repositories/tycho-snapshots/com/google/google/1/google-1.pom
Downloading from sonatype-public-grid: https://repository.sonatype.org/content/groups/sonatype-public-grid/com/google/google/1/google-1.pom
Progress (1): 1.6 kB                    Downloaded from sonatype-public-grid: https://repository.sonatype.org/content/groups/sonatype-public-grid/com/google/google/1/google-1.pom (1.6 kB at 21 kB/s)
Downloading from tycho: https://oss.sonatype.org/content/repositories/public/org/apache/maven/maven-project/2.0.9/maven-project-2.0.9.pom
Downloading from cbi-repo: https://repo.eclipse.org/content/repositories/cbi/org/apache/maven/maven-project/2.0.9/maven-project-2.0.9.pom
Downloading from tycho-snapshot: https://repo.eclipse.org/content/repositories/tycho-snapshots/org/apache/maven/maven-project/2.0.9/maven-project-2.0.9.pom
Downloading from sonatype-public-grid: https://repository.sonatype.org/content/groups/sonatype-public-grid/org/apache/maven/maven-project/2.0.9/maven-project-2.0.9.pom
Progress (1): 2.7 kB                    Downloaded from sonatype-public-grid: https://repository.sonatype.org/content/groups/sonatype-public-grid/org/apache/maven/maven-project/2.0.9/maven-project-2.0.9.pom (2.7 kB at 38 kB/s)
Downloading from tycho: https://oss.sonatype.org/content/repositories/public/org/apache/maven/maven-profile/2.0.9/maven-profile-2.0.9.pom
Downloading from cbi-repo: https://repo.eclipse.org/content/repositories/cbi/org/apache/maven/maven-profile/2.0.9/maven-profile-2.0.9.pom
Downloading from tycho-snapshot: https://repo.eclipse.org/content/repositories/tycho-snapshots/org/apache/maven/maven-profile/2.0.9/maven-profile-2.0.9.pom
Downloading from sonatype-public-grid: https://repository.sonatype.org/content/groups/sonatype-public-grid/org/apache/maven/maven-profile/2.0.9/maven-profile-2.0.9.pom
Progress (1): 2.0 kB                    Downloaded from sonatype-public-grid: https://repository.sonatype.org/content/groups/sonatype-public-grid/org/apache/maven/maven-profile/2.0.9/maven-profile-2.0.9.pom (2.0 kB at 25 kB/s)
Downloading from tycho: https://oss.sonatype.org/content/repositories/public/org/apache/maven/maven-artifact-manager/2.0.9/maven-artifact-manager-2.0.9.pom
Downloading from cbi-repo: https://repo.eclipse.org/content/repositories/cbi/org/apache/maven/maven-artifact-manager/2.0.9/maven-artifact-manager-2.0.9.pom
Downloading from tycho-snapshot: https://repo.eclipse.org/content/repositories/tycho-snapshots/org/apache/maven/maven-artifact-manager/2.0.9/maven-artifact-manager-2.0.9.pom
Downloading from sonatype-public-grid: https://repository.sonatype.org/content/groups/sonatype-public-grid/org/apache/maven/maven-artifact-manager/2.0.9/maven-artifact-manager-2.0.9.pom
Progress (1): 2.7 kB                    Downloaded from sonatype-public-grid: https://repository.sonatype.org/content/groups/sonatype-public-grid/org/apache/maven/maven-artifact-manager/2.0.9/maven-artifact-manager-2.0.9.pom (2.7 kB at 34 kB/s)
Downloading from tycho: https://oss.sonatype.org/content/repositories/public/org/apache/maven/maven-repository-metadata/2.0.9/maven-repository-metadata-2.0.9.pom
Downloading from cbi-repo: https://repo.eclipse.org/content/repositories/cbi/org/apache/maven/maven-repository-metadata/2.0.9/maven-repository-metadata-2.0.9.pom
Downloading from tycho-snapshot: https://repo.eclipse.org/content/repositories/tycho-snapshots/org/apache/maven/maven-repository-metadata/2.0.9/maven-repository-metadata-2.0.9.pom
Downloading from sonatype-public-grid: https://repository.sonatype.org/content/groups/sonatype-public-grid/org/apache/maven/maven-repository-metadata/2.0.9/maven-repository-metadata-2.0.9.pom
Progress (1): 1.9 kB                    Downloaded from sonatype-public-grid: https://repository.sonatype.org/content/groups/sonatype-public-grid/org/apache/maven/maven-repository-metadata/2.0.9/maven-repository-metadata-2.0.9.pom (1.9 kB at 25 kB/s)
Downloading from tycho: https://oss.sonatype.org/content/repositories/public/org/apache/maven/maven-plugin-registry/2.0.9/maven-plugin-registry-2.0.9.pom
Downloading from cbi-repo: https://repo.eclipse.org/content/repositories/cbi/org/apache/maven/maven-plugin-registry/2.0.9/maven-plugin-registry-2.0.9.pom
Downloading from tycho-snapshot: https://repo.eclipse.org/content/repositories/tycho-snapshots/org/apache/maven/maven-plugin-registry/2.0.9/maven-plugin-registry-2.0.9.pom
Downloading from sonatype-public-grid: https://repository.sonatype.org/content/groups/sonatype-public-grid/org/apache/maven/maven-plugin-registry/2.0.9/maven-plugin-registry-2.0.9.pom
Progress (1): 2.0 kB                    Downloaded from sonatype-public-grid: https://repository.sonatype.org/content/groups/sonatype-public-grid/org/apache/maven/maven-plugin-registry/2.0.9/maven-plugin-registry-2.0.9.pom (2.0 kB at 27 kB/s)
Downloading from tycho: https://oss.sonatype.org/content/repositories/public/org/apache/maven/maven-toolchain/2.0.9/maven-toolchain-2.0.9.pom
Downloading from cbi-repo: https://repo.eclipse.org/content/repositories/cbi/org/apache/maven/maven-toolchain/2.0.9/maven-toolchain-2.0.9.pom
Downloading from tycho-snapshot: https://repo.eclipse.org/content/repositories/tycho-snapshots/org/apache/maven/maven-toolchain/2.0.9/maven-toolchain-2.0.9.pom
Downloading from sonatype-public-grid: https://repository.sonatype.org/content/groups/sonatype-public-grid/org/apache/maven/maven-toolchain/2.0.9/maven-toolchain-2.0.9.pom
Progress (1): 3.5 kB                    Downloaded from sonatype-public-grid: https://repository.sonatype.org/content/groups/sonatype-public-grid/org/apache/maven/maven-toolchain/2.0.9/maven-toolchain-2.0.9.pom (3.5 kB at 46 kB/s)
Downloading from tycho: https://oss.sonatype.org/content/repositories/public/org/apache/commons/commons-lang3/3.1/commons-lang3-3.1.pom
Downloading from cbi-repo: https://repo.eclipse.org/content/repositories/cbi/org/apache/commons/commons-lang3/3.1/commons-lang3-3.1.pom
Downloading from tycho-snapshot: https://repo.eclipse.org/content/repositories/tycho-snapshots/org/apache/commons/commons-lang3/3.1/commons-lang3-3.1.pom
Downloading from sonatype-public-grid: https://repository.sonatype.org/content/groups/sonatype-public-grid/org/apache/commons/commons-lang3/3.1/commons-lang3-3.1.pom
Progress (1): 4.1/17 kBProgress (1): 7.9/17 kBProgress (1): 7.9/17 kBProgress (1): 12/17 kB Progress (1): 16/17 kBProgress (1): 17 kB                      Downloaded from sonatype-public-grid: https://repository.sonatype.org/content/groups/sonatype-public-grid/org/apache/commons/commons-lang3/3.1/commons-lang3-3.1.pom (17 kB at 217 kB/s)
Downloading from tycho: https://oss.sonatype.org/content/repositories/public/org/apache/commons/commons-parent/22/commons-parent-22.pom
Downloading from cbi-repo: https://repo.eclipse.org/content/repositories/cbi/org/apache/commons/commons-parent/22/commons-parent-22.pom
Downloading from tycho-snapshot: https://repo.eclipse.org/content/repositories/tycho-snapshots/org/apache/commons/commons-parent/22/commons-parent-22.pom
Downloading from sonatype-public-grid: https://repository.sonatype.org/content/groups/sonatype-public-grid/org/apache/commons/commons-parent/22/commons-parent-22.pom
Progress (1): 4.1/42 kBProgress (1): 7.9/42 kBProgress (1): 7.9/42 kBProgress (1): 12/42 kB Progress (1): 16/42 kBProgress (1): 20/42 kBProgress (1): 24/42 kBProgress (1): 28/42 kBProgress (1): 32/42 kBProgress (1): 37/42 kBProgress (1): 41/42 kBProgress (1): 42 kB                      Downloaded from sonatype-public-grid: https://repository.sonatype.org/content/groups/sonatype-public-grid/org/apache/commons/commons-parent/22/commons-parent-22.pom (42 kB at 552 kB/s)
Downloading from tycho: https://oss.sonatype.org/content/repositories/public/org/eclipse/tycho/org.eclipse.tycho.surefire.osgibooter/1.1.0/org.eclipse.tycho.surefire.osgibooter-1.1.0.jar
Downloading from tycho: https://oss.sonatype.org/content/repositories/public/org/eclipse/tycho/org.eclipse.tycho.surefire.junit/1.1.0/org.eclipse.tycho.surefire.junit-1.1.0.jar
Downloading from tycho: https://oss.sonatype.org/content/repositories/public/org/eclipse/tycho/org.eclipse.tycho.surefire.junit4/1.1.0/org.eclipse.tycho.surefire.junit4-1.1.0.jar
Downloading from tycho: https://oss.sonatype.org/content/repositories/public/org/eclipse/tycho/org.eclipse.tycho.surefire.junit47/1.1.0/org.eclipse.tycho.surefire.junit47-1.1.0.jar
Downloading from tycho: https://oss.sonatype.org/content/repositories/public/org/eclipse/tycho/org.eclipse.tycho.surefire.testng/1.1.0/org.eclipse.tycho.surefire.testng-1.1.0.jar
Progress (1): 3.8/24 kBProgress (2): 3.8/24 kB | 3.8/126 kBProgress (3): 3.8/24 kB | 3.8/126 kB | 3.8/417 kBProgress (4): 3.8/24 kB | 3.8/126 kB | 3.8/417 kB | 3.8/58 kBProgress (4): 7.9/24 kB | 3.8/126 kB | 3.8/417 kB | 3.8/58 kBProgress (4): 12/24 kB | 3.8/126 kB | 3.8/417 kB | 3.8/58 kB Progress (4): 16/24 kB | 3.8/126 kB | 3.8/417 kB | 3.8/58 kBProgress (4): 20/24 kB | 3.8/126 kB | 3.8/417 kB | 3.8/58 kBProgress (4): 24/24 kB | 3.8/126 kB | 3.8/417 kB | 3.8/58 kBProgress (4): 24 kB | 3.8/126 kB | 3.8/417 kB | 3.8/58 kB   Progress (4): 24 kB | 7.9/126 kB | 3.8/417 kB | 3.8/58 kBProgress (4): 24 kB | 12/126 kB | 3.8/417 kB | 3.8/58 kB Progress (4): 24 kB | 16/126 kB | 3.8/417 kB | 3.8/58 kBProgress (4): 24 kB | 20/126 kB | 3.8/417 kB | 3.8/58 kBProgress (4): 24 kB | 24/126 kB | 3.8/417 kB | 3.8/58 kBProgress (4): 24 kB | 28/126 kB | 3.8/417 kB | 3.8/58 kBProgress (4): 24 kB | 32/126 kB | 3.8/417 kB | 3.8/58 kBProgress (4): 24 kB | 37/126 kB | 3.8/417 kB | 3.8/58 kBProgress (4): 24 kB | 41/126 kB | 3.8/417 kB | 3.8/58 kBProgress (4): 24 kB | 41/126 kB | 7.9/417 kB | 3.8/58 kBProgress (4): 24 kB | 41/126 kB | 12/417 kB | 3.8/58 kB Progress (4): 24 kB | 41/126 kB | 16/417 kB | 3.8/58 kBProgress (4): 24 kB | 41/126 kB | 20/417 kB | 3.8/58 kBProgress (4): 24 kB | 41/126 kB | 24/417 kB | 3.8/58 kBProgress (4): 24 kB | 41/126 kB | 28/417 kB | 3.8/58 kBProgress (4): 24 kB | 41/126 kB | 32/417 kB | 3.8/58 kBProgress (4): 24 kB | 41/126 kB | 33/417 kB | 3.8/58 kBProgress (4): 24 kB | 41/126 kB | 33/417 kB | 7.9/58 kBProgress (4): 24 kB | 41/126 kB | 33/417 kB | 12/58 kB Progress (4): 24 kB | 41/126 kB | 33/417 kB | 16/58 kBProgress (4): 24 kB | 41/126 kB | 33/417 kB | 20/58 kBProgress (5): 24 kB | 41/126 kB | 33/417 kB | 20/58 kB | 4.1/160 kBProgress (5): 24 kB | 41/126 kB | 33/417 kB | 21/58 kB | 4.1/160 kBProgress (5): 24 kB | 41/126 kB | 33/417 kB | 21/58 kB | 7.8/160 kBProgress (5): 24 kB | 41/126 kB | 33/417 kB | 21/58 kB | 12/160 kB Progress (5): 24 kB | 41/126 kB | 33/417 kB | 21/58 kB | 16/160 kBProgress (5): 24 kB | 41/126 kB | 33/417 kB | 21/58 kB | 20/160 kBProgress (5): 24 kB | 41/126 kB | 33/417 kB | 21/58 kB | 24/160 kBProgress (5): 24 kB | 41/126 kB | 33/417 kB | 25/58 kB | 24/160 kBProgress (5): 24 kB | 41/126 kB | 33/417 kB | 25/58 kB | 28/160 kBProgress (5): 24 kB | 41/126 kB | 33/417 kB | 29/58 kB | 28/160 kBProgress (5): 24 kB | 41/126 kB | 33/417 kB | 29/58 kB | 32/160 kBProgress (5): 24 kB | 41/126 kB | 33/417 kB | 33/58 kB | 32/160 kBProgress (5): 24 kB | 41/126 kB | 33/417 kB | 37/58 kB | 32/160 kBProgress (5): 24 kB | 41/126 kB | 33/417 kB | 37/58 kB | 37/160 kBProgress (5): 24 kB | 41/126 kB | 33/417 kB | 37/58 kB | 37/160 kBProgress (5): 24 kB | 45/126 kB | 33/417 kB | 37/58 kB | 37/160 kBProgress (5): 24 kB | 49/126 kB | 33/417 kB | 37/58 kB | 37/160 kBProgress (5): 24 kB | 53/126 kB | 33/417 kB | 37/58 kB | 37/160 kBProgress (5): 24 kB | 57/126 kB | 33/417 kB | 37/58 kB | 37/160 kBProgress (5): 24 kB | 57/126 kB | 37/417 kB | 37/58 kB | 37/160 kBProgress (5): 24 kB | 57/126 kB | 41/417 kB | 37/58 kB | 37/160 kBProgress (5): 24 kB | 57/126 kB | 45/417 kB | 37/58 kB | 37/160 kBProgress (5): 24 kB | 57/126 kB | 49/417 kB | 37/58 kB | 37/160 kBProgress (5): 24 kB | 57/126 kB | 53/417 kB | 37/58 kB | 37/160 kBProgress (5): 24 kB | 57/126 kB | 57/417 kB | 37/58 kB | 37/160 kBProgress (5): 24 kB | 57/126 kB | 61/417 kB | 37/58 kB | 37/160 kBProgress (5): 24 kB | 57/126 kB | 66/417 kB | 37/58 kB | 37/160 kBProgress (5): 24 kB | 57/126 kB | 66/417 kB | 41/58 kB | 37/160 kBProgress (5): 24 kB | 57/126 kB | 66/417 kB | 45/58 kB | 37/160 kBProgress (5): 24 kB | 57/126 kB | 66/417 kB | 50/58 kB | 37/160 kBProgress (5): 24 kB | 57/126 kB | 66/417 kB | 54/58 kB | 37/160 kBProgress (5): 24 kB | 57/126 kB | 66/417 kB | 54/58 kB | 41/160 kBProgress (5): 24 kB | 57/126 kB | 66/417 kB | 54/58 kB | 45/160 kBProgress (5): 24 kB | 57/126 kB | 66/417 kB | 54/58 kB | 50/160 kBProgress (5): 24 kB | 57/126 kB | 66/417 kB | 58 kB | 50/160 kB   Progress (5): 24 kB | 57/126 kB | 66/417 kB | 58 kB | 54/160 kBProgress (5): 24 kB | 61/126 kB | 66/417 kB | 58 kB | 54/160 kBProgress (5): 24 kB | 65/126 kB | 66/417 kB | 58 kB | 54/160 kBProgress (5): 24 kB | 69/126 kB | 66/417 kB | 58 kB | 54/160 kBProgress (5): 24 kB | 73/126 kB | 66/417 kB | 58 kB | 54/160 kBProgress (5): 24 kB | 77/126 kB | 66/417 kB | 58 kB | 54/160 kBProgress (5): 24 kB | 82/126 kB | 66/417 kB | 58 kB | 54/160 kBProgress (5): 24 kB | 86/126 kB | 66/417 kB | 58 kB | 54/160 kBProgress (5): 24 kB | 90/126 kB | 66/417 kB | 58 kB | 54/160 kBProgress (5): 24 kB | 94/126 kB | 66/417 kB | 58 kB | 54/160 kBProgress (5): 24 kB | 98/126 kB | 66/417 kB | 58 kB | 54/160 kBProgress (5): 24 kB | 102/126 kB | 66/417 kB | 58 kB | 54/160 kBProgress (5): 24 kB | 106/126 kB | 66/417 kB | 58 kB | 54/160 kBProgress (5): 24 kB | 106/126 kB | 70/417 kB | 58 kB | 54/160 kBProgress (5): 24 kB | 106/126 kB | 74/417 kB | 58 kB | 54/160 kBProgress (5): 24 kB | 110/126 kB | 74/417 kB | 58 kB | 54/160 kBProgress (5): 24 kB | 110/126 kB | 78/417 kB | 58 kB | 54/160 kBProgress (5): 24 kB | 114/126 kB | 78/417 kB | 58 kB | 54/160 kBProgress (5): 24 kB | 114/126 kB | 82/417 kB | 58 kB | 54/160 kBProgress (5): 24 kB | 118/126 kB | 82/417 kB | 58 kB | 54/160 kBProgress (5): 24 kB | 123/126 kB | 82/417 kB | 58 kB | 54/160 kBProgress (5): 24 kB | 126 kB | 82/417 kB | 58 kB | 54/160 kB    Progress (5): 24 kB | 126 kB | 86/417 kB | 58 kB | 54/160 kBProgress (5): 24 kB | 126 kB | 90/417 kB | 58 kB | 54/160 kBProgress (5): 24 kB | 126 kB | 94/417 kB | 58 kB | 54/160 kBProgress (5): 24 kB | 126 kB | 98/417 kB | 58 kB | 54/160 kBProgress (5): 24 kB | 126 kB | 98/417 kB | 58 kB | 58/160 kBProgress (5): 24 kB | 126 kB | 98/417 kB | 58 kB | 62/160 kBProgress (5): 24 kB | 126 kB | 98/417 kB | 58 kB | 66/160 kBProgress (5): 24 kB | 126 kB | 98/417 kB | 58 kB | 70/160 kBProgress (5): 24 kB | 126 kB | 98/417 kB | 58 kB | 74/160 kBProgress (5): 24 kB | 126 kB | 98/417 kB | 58 kB | 78/160 kBProgress (5): 24 kB | 126 kB | 98/417 kB | 58 kB | 82/160 kBProgress (5): 24 kB | 126 kB | 98/417 kB | 58 kB | 86/160 kBProgress (5): 24 kB | 126 kB | 98/417 kB | 58 kB | 91/160 kBProgress (5): 24 kB | 126 kB | 98/417 kB | 58 kB | 95/160 kBProgress (5): 24 kB | 126 kB | 98/417 kB | 58 kB | 99/160 kBProgress (5): 24 kB | 126 kB | 98/417 kB | 58 kB | 103/160 kB                                                             Downloaded from tycho: https://oss.sonatype.org/content/repositories/public/org/eclipse/tycho/org.eclipse.tycho.surefire.junit4/1.1.0/org.eclipse.tycho.surefire.junit4-1.1.0.jar (58 kB at 197 kB/s)
Downloading from tycho: https://oss.sonatype.org/content/repositories/public/org/apache/maven/surefire/surefire-api/2.17/surefire-api-2.17.jar
Progress (4): 24 kB | 126 kB | 102/417 kB | 103/160 kBProgress (4): 24 kB | 126 kB | 106/417 kB | 103/160 kBProgress (4): 24 kB | 126 kB | 111/417 kB | 103/160 kBProgress (4): 24 kB | 126 kB | 115/417 kB | 103/160 kBProgress (4): 24 kB | 126 kB | 119/417 kB | 103/160 kBProgress (4): 24 kB | 126 kB | 123/417 kB | 103/160 kBProgress (4): 24 kB | 126 kB | 127/417 kB | 103/160 kBProgress (4): 24 kB | 126 kB | 131/417 kB | 103/160 kBProgress (4): 24 kB | 126 kB | 135/417 kB | 103/160 kBProgress (4): 24 kB | 126 kB | 139/417 kB | 103/160 kBProgress (4): 24 kB | 126 kB | 143/417 kB | 103/160 kBProgress (4): 24 kB | 126 kB | 147/417 kB | 103/160 kBProgress (4): 24 kB | 126 kB | 152/417 kB | 103/160 kBProgress (4): 24 kB | 126 kB | 156/417 kB | 103/160 kBProgress (4): 24 kB | 126 kB | 160/417 kB | 103/160 kBProgress (4): 24 kB | 126 kB | 164/417 kB | 103/160 kBProgress (4): 24 kB | 126 kB | 164/417 kB | 107/160 kBProgress (4): 24 kB | 126 kB | 164/417 kB | 111/160 kBProgress (4): 24 kB | 126 kB | 164/417 kB | 115/160 kBProgress (4): 24 kB | 126 kB | 168/417 kB | 115/160 kBProgress (4): 24 kB | 126 kB | 168/417 kB | 119/160 kBProgress (4): 24 kB | 126 kB | 172/417 kB | 119/160 kBProgress (4): 24 kB | 126 kB | 176/417 kB | 119/160 kBProgress (4): 24 kB | 126 kB | 180/417 kB | 119/160 kBProgress (4): 24 kB | 126 kB | 180/417 kB | 123/160 kBProgress (4): 24 kB | 126 kB | 180/417 kB | 127/160 kBProgress (4): 24 kB | 126 kB | 180/417 kB | 131/160 kBProgress (4): 24 kB | 126 kB | 180/417 kB | 136/160 kBProgress (4): 24 kB | 126 kB | 180/417 kB | 140/160 kBProgress (4): 24 kB | 126 kB | 180/417 kB | 144/160 kBProgress (4): 24 kB | 126 kB | 180/417 kB | 148/160 kBProgress (4): 24 kB | 126 kB | 180/417 kB | 152/160 kBProgress (4): 24 kB | 126 kB | 180/417 kB | 156/160 kBProgress (4): 24 kB | 126 kB | 180/417 kB | 160 kB                                                      Downloaded from tycho: https://oss.sonatype.org/content/repositories/public/org/eclipse/tycho/org.eclipse.tycho.surefire.testng/1.1.0/org.eclipse.tycho.surefire.testng-1.1.0.jar (126 kB at 390 kB/s)
Downloading from tycho: https://oss.sonatype.org/content/repositories/public/org/apache/maven/surefire/maven-surefire-common/2.17/maven-surefire-common-2.17.jar
Progress (3): 24 kB | 184/417 kB | 160 kBProgress (3): 24 kB | 188/417 kB | 160 kBProgress (3): 24 kB | 193/417 kB | 160 kBProgress (3): 24 kB | 197/417 kB | 160 kBProgress (3): 24 kB | 201/417 kB | 160 kBProgress (3): 24 kB | 205/417 kB | 160 kBProgress (3): 24 kB | 209/417 kB | 160 kBProgress (3): 24 kB | 213/417 kB | 160 kBProgress (3): 24 kB | 217/417 kB | 160 kBProgress (3): 24 kB | 221/417 kB | 160 kBProgress (3): 24 kB | 225/417 kB | 160 kBProgress (3): 24 kB | 229/417 kB | 160 kB                                         Downloading from tycho: https://oss.sonatype.org/content/repositories/public/org/apache/maven/surefire/surefire-booter/2.17/surefire-booter-2.17.jar
Progress (3): 24 kB | 233/417 kB | 160 kBProgress (3): 24 kB | 238/417 kB | 160 kBProgress (3): 24 kB | 242/417 kB | 160 kBProgress (3): 24 kB | 246/417 kB | 160 kB                                         Downloaded from tycho: https://oss.sonatype.org/content/repositories/public/org/eclipse/tycho/org.eclipse.tycho.surefire.junit47/1.1.0/org.eclipse.tycho.surefire.junit47-1.1.0.jar (160 kB at 435 kB/s)
Progress (2): 24 kB | 250/417 kB                                Downloading from tycho: https://oss.sonatype.org/content/repositories/public/org/apache/maven/maven-plugin-descriptor/2.0.9/maven-plugin-descriptor-2.0.9.jar
Progress (2): 24 kB | 254/417 kBProgress (2): 24 kB | 258/417 kBProgress (2): 24 kB | 262/417 kBProgress (2): 24 kB | 266/417 kBProgress (2): 24 kB | 270/417 kBProgress (2): 24 kB | 274/417 kBProgress (2): 24 kB | 279/417 kBProgress (2): 24 kB | 283/417 kBProgress (2): 24 kB | 287/417 kBProgress (2): 24 kB | 291/417 kBProgress (2): 24 kB | 295/417 kBProgress (2): 24 kB | 299/417 kBProgress (2): 24 kB | 303/417 kBProgress (2): 24 kB | 307/417 kBProgress (2): 24 kB | 311/417 kBProgress (2): 24 kB | 315/417 kBProgress (2): 24 kB | 319/417 kBProgress (2): 24 kB | 324/417 kBProgress (2): 24 kB | 328/417 kBProgress (2): 24 kB | 332/417 kBProgress (2): 24 kB | 336/417 kBProgress (2): 24 kB | 340/417 kBProgress (2): 24 kB | 344/417 kBProgress (2): 24 kB | 348/417 kBProgress (2): 24 kB | 352/417 kBProgress (2): 24 kB | 356/417 kBProgress (2): 24 kB | 360/417 kBProgress (2): 24 kB | 365/417 kBProgress (2): 24 kB | 369/417 kBProgress (2): 24 kB | 373/417 kBProgress (2): 24 kB | 377/417 kB                                Downloading from tycho: https://oss.sonatype.org/content/repositories/public/org/apache/maven/maven-project/2.0.9/maven-project-2.0.9.jar
Progress (2): 24 kB | 381/417 kBProgress (2): 24 kB | 385/417 kBProgress (2): 24 kB | 389/417 kBProgress (2): 24 kB | 393/417 kBProgress (2): 24 kB | 397/417 kBProgress (2): 24 kB | 401/417 kBProgress (2): 24 kB | 406/417 kBProgress (2): 24 kB | 410/417 kBProgress (2): 24 kB | 414/417 kBProgress (2): 24 kB | 417 kB                                Downloading from tycho: https://oss.sonatype.org/content/repositories/public/org/apache/maven/maven-profile/2.0.9/maven-profile-2.0.9.jar
Downloaded from tycho: https://oss.sonatype.org/content/repositories/public/org/eclipse/tycho/org.eclipse.tycho.surefire.junit/1.1.0/org.eclipse.tycho.surefire.junit-1.1.0.jar (24 kB at 57 kB/s)
Downloading from tycho: https://oss.sonatype.org/content/repositories/public/org/apache/maven/maven-artifact-manager/2.0.9/maven-artifact-manager-2.0.9.jar
Downloading from tycho: https://oss.sonatype.org/content/repositories/public/org/apache/maven/maven-plugin-registry/2.0.9/maven-plugin-registry-2.0.9.jar
Downloaded from tycho: https://oss.sonatype.org/content/repositories/public/org/eclipse/tycho/org.eclipse.tycho.surefire.osgibooter/1.1.0/org.eclipse.tycho.surefire.osgibooter-1.1.0.jar (417 kB at 915 kB/s)
Downloading from tycho: https://oss.sonatype.org/content/repositories/public/org/apache/maven/maven-toolchain/2.0.9/maven-toolchain-2.0.9.jar
Downloading from tycho: https://oss.sonatype.org/content/repositories/public/org/apache/commons/commons-lang3/3.1/commons-lang3-3.1.jar
Downloading from cbi-repo: https://repo.eclipse.org/content/repositories/cbi/org/apache/maven/surefire/surefire-api/2.17/surefire-api-2.17.jar
Downloading from cbi-repo: https://repo.eclipse.org/content/repositories/cbi/org/apache/maven/surefire/maven-surefire-common/2.17/maven-surefire-common-2.17.jar
Downloading from cbi-repo: https://repo.eclipse.org/content/repositories/cbi/org/apache/maven/maven-plugin-descriptor/2.0.9/maven-plugin-descriptor-2.0.9.jar
Downloading from cbi-repo: https://repo.eclipse.org/content/repositories/cbi/org/apache/maven/surefire/surefire-booter/2.17/surefire-booter-2.17.jar
Downloading from cbi-repo: https://repo.eclipse.org/content/repositories/cbi/org/apache/maven/maven-project/2.0.9/maven-project-2.0.9.jar
Downloading from cbi-repo: https://repo.eclipse.org/content/repositories/cbi/org/apache/maven/maven-profile/2.0.9/maven-profile-2.0.9.jar
Downloading from cbi-repo: https://repo.eclipse.org/content/repositories/cbi/org/apache/maven/maven-artifact-manager/2.0.9/maven-artifact-manager-2.0.9.jar
Downloading from cbi-repo: https://repo.eclipse.org/content/repositories/cbi/org/apache/maven/maven-plugin-registry/2.0.9/maven-plugin-registry-2.0.9.jar
Downloading from cbi-repo: https://repo.eclipse.org/content/repositories/cbi/org/apache/maven/maven-toolchain/2.0.9/maven-toolchain-2.0.9.jar
Downloading from cbi-repo: https://repo.eclipse.org/content/repositories/cbi/org/apache/commons/commons-lang3/3.1/commons-lang3-3.1.jar
Downloading from tycho-snapshot: https://repo.eclipse.org/content/repositories/tycho-snapshots/org/apache/maven/surefire/surefire-api/2.17/surefire-api-2.17.jar
Downloading from tycho-snapshot: https://repo.eclipse.org/content/repositories/tycho-snapshots/org/apache/maven/surefire/surefire-booter/2.17/surefire-booter-2.17.jar
Downloading from tycho-snapshot: https://repo.eclipse.org/content/repositories/tycho-snapshots/org/apache/maven/surefire/maven-surefire-common/2.17/maven-surefire-common-2.17.jar
Downloading from tycho-snapshot: https://repo.eclipse.org/content/repositories/tycho-snapshots/org/apache/maven/maven-plugin-descriptor/2.0.9/maven-plugin-descriptor-2.0.9.jar
Downloading from tycho-snapshot: https://repo.eclipse.org/content/repositories/tycho-snapshots/org/apache/maven/maven-project/2.0.9/maven-project-2.0.9.jar
Downloading from tycho-snapshot: https://repo.eclipse.org/content/repositories/tycho-snapshots/org/apache/maven/maven-profile/2.0.9/maven-profile-2.0.9.jar
Downloading from tycho-snapshot: https://repo.eclipse.org/content/repositories/tycho-snapshots/org/apache/maven/maven-artifact-manager/2.0.9/maven-artifact-manager-2.0.9.jar
Downloading from tycho-snapshot: https://repo.eclipse.org/content/repositories/tycho-snapshots/org/apache/maven/maven-plugin-registry/2.0.9/maven-plugin-registry-2.0.9.jar
Downloading from tycho-snapshot: https://repo.eclipse.org/content/repositories/tycho-snapshots/org/apache/maven/maven-toolchain/2.0.9/maven-toolchain-2.0.9.jar
Downloading from tycho-snapshot: https://repo.eclipse.org/content/repositories/tycho-snapshots/org/apache/commons/commons-lang3/3.1/commons-lang3-3.1.jar
Downloading from sonatype-public-grid: https://repository.sonatype.org/content/groups/sonatype-public-grid/org/apache/maven/surefire/surefire-api/2.17/surefire-api-2.17.jar
Downloading from sonatype-public-grid: https://repository.sonatype.org/content/groups/sonatype-public-grid/org/apache/maven/surefire/maven-surefire-common/2.17/maven-surefire-common-2.17.jar
Downloading from sonatype-public-grid: https://repository.sonatype.org/content/groups/sonatype-public-grid/org/apache/maven/surefire/surefire-booter/2.17/surefire-booter-2.17.jar
Downloading from sonatype-public-grid: https://repository.sonatype.org/content/groups/sonatype-public-grid/org/apache/maven/maven-plugin-descriptor/2.0.9/maven-plugin-descriptor-2.0.9.jar
Downloading from sonatype-public-grid: https://repository.sonatype.org/content/groups/sonatype-public-grid/org/apache/maven/maven-project/2.0.9/maven-project-2.0.9.jar
Progress (1): 4.1/147 kBProgress (1): 7.8/147 kBProgress (1): 7.9/147 kBProgress (2): 7.9/147 kB | 4.1/265 kBProgress (2): 7.9/147 kB | 7.8/265 kBProgress (2): 7.9/147 kB | 12/265 kB Progress (2): 7.9/147 kB | 16/265 kBProgress (2): 12/147 kB | 16/265 kB Progress (2): 16/147 kB | 16/265 kBProgress (2): 16/147 kB | 20/265 kBProgress (2): 16/147 kB | 20/265 kBProgress (2): 20/147 kB | 20/265 kBProgress (2): 24/147 kB | 20/265 kBProgress (2): 24/147 kB | 24/265 kBProgress (2): 24/147 kB | 28/265 kBProgress (2): 24/147 kB | 32/265 kBProgress (2): 24/147 kB | 33/265 kBProgress (2): 28/147 kB | 33/265 kBProgress (2): 32/147 kB | 33/265 kBProgress (2): 37/147 kB | 33/265 kBProgress (2): 41/147 kB | 33/265 kBProgress (2): 45/147 kB | 33/265 kBProgress (2): 49/147 kB | 33/265 kBProgress (3): 49/147 kB | 33/265 kB | 4.1/40 kBProgress (3): 53/147 kB | 33/265 kB | 4.1/40 kBProgress (3): 57/147 kB | 33/265 kB | 4.1/40 kBProgress (3): 57/147 kB | 33/265 kB | 7.8/40 kBProgress (3): 57/147 kB | 33/265 kB | 7.9/40 kBProgress (3): 57/147 kB | 33/265 kB | 12/40 kB Progress (3): 57/147 kB | 33/265 kB | 16/40 kBProgress (3): 57/147 kB | 33/265 kB | 20/40 kBProgress (3): 57/147 kB | 33/265 kB | 24/40 kBProgress (3): 57/147 kB | 33/265 kB | 28/40 kBProgress (3): 57/147 kB | 33/265 kB | 32/40 kBProgress (3): 57/147 kB | 33/265 kB | 37/40 kBProgress (3): 57/147 kB | 33/265 kB | 40 kB   Progress (3): 61/147 kB | 33/265 kB | 40 kBProgress (3): 65/147 kB | 33/265 kB | 40 kBProgress (3): 65/147 kB | 37/265 kB | 40 kBProgress (3): 69/147 kB | 37/265 kB | 40 kBProgress (3): 69/147 kB | 41/265 kB | 40 kBProgress (3): 70/147 kB | 41/265 kB | 40 kBProgress (3): 70/147 kB | 45/265 kB | 40 kBProgress (3): 70/147 kB | 49/265 kB | 40 kBProgress (3): 70/147 kB | 53/265 kB | 40 kBProgress (3): 70/147 kB | 54/265 kB | 40 kBProgress (3): 73/147 kB | 54/265 kB | 40 kBProgress (3): 77/147 kB | 54/265 kB | 40 kBProgress (3): 82/147 kB | 54/265 kB | 40 kBProgress (3): 86/147 kB | 54/265 kB | 40 kBProgress (3): 90/147 kB | 54/265 kB | 40 kBProgress (3): 94/147 kB | 54/265 kB | 40 kBProgress (3): 98/147 kB | 54/265 kB | 40 kBProgress (3): 102/147 kB | 54/265 kB | 40 kBProgress (3): 102/147 kB | 54/265 kB | 40 kBProgress (3): 106/147 kB | 54/265 kB | 40 kBProgress (3): 111/147 kB | 54/265 kB | 40 kBProgress (3): 115/147 kB | 54/265 kB | 40 kBProgress (3): 119/147 kB | 54/265 kB | 40 kBProgress (3): 123/147 kB | 54/265 kB | 40 kBProgress (3): 127/147 kB | 54/265 kB | 40 kBProgress (3): 131/147 kB | 54/265 kB | 40 kBProgress (3): 135/147 kB | 54/265 kB | 40 kBProgress (3): 139/147 kB | 54/265 kB | 40 kBProgress (3): 143/147 kB | 54/265 kB | 40 kBProgress (3): 147 kB | 54/265 kB | 40 kB    Progress (3): 147 kB | 58/265 kB | 40 kBProgress (3): 147 kB | 62/265 kB | 40 kBProgress (3): 147 kB | 66/265 kB | 40 kBProgress (3): 147 kB | 70/265 kB | 40 kBProgress (3): 147 kB | 74/265 kB | 40 kBProgress (3): 147 kB | 79/265 kB | 40 kBProgress (3): 147 kB | 83/265 kB | 40 kBProgress (3): 147 kB | 87/265 kB | 40 kBProgress (3): 147 kB | 91/265 kB | 40 kBProgress (3): 147 kB | 95/265 kB | 40 kBProgress (3): 147 kB | 99/265 kB | 40 kBProgress (3): 147 kB | 103/265 kB | 40 kBProgress (3): 147 kB | 107/265 kB | 40 kBProgress (3): 147 kB | 111/265 kB | 40 kBProgress (3): 147 kB | 115/265 kB | 40 kBProgress (3): 147 kB | 120/265 kB | 40 kBProgress (3): 147 kB | 124/265 kB | 40 kBProgress (3): 147 kB | 128/265 kB | 40 kBProgress (3): 147 kB | 132/265 kB | 40 kBProgress (3): 147 kB | 136/265 kB | 40 kBProgress (3): 147 kB | 140/265 kB | 40 kBProgress (3): 147 kB | 144/265 kB | 40 kBProgress (3): 147 kB | 148/265 kB | 40 kBProgress (3): 147 kB | 152/265 kB | 40 kBProgress (3): 147 kB | 156/265 kB | 40 kBProgress (3): 147 kB | 161/265 kB | 40 kBProgress (3): 147 kB | 165/265 kB | 40 kBProgress (3): 147 kB | 169/265 kB | 40 kBProgress (3): 147 kB | 173/265 kB | 40 kBProgress (3): 147 kB | 177/265 kB | 40 kBProgress (3): 147 kB | 181/265 kB | 40 kBProgress (3): 147 kB | 185/265 kB | 40 kB                                         Downloaded from sonatype-public-grid: https://repository.sonatype.org/content/groups/sonatype-public-grid/org/apache/maven/surefire/surefire-booter/2.17/surefire-booter-2.17.jar (40 kB at 230 kB/s)
Downloading from sonatype-public-grid: https://repository.sonatype.org/content/groups/sonatype-public-grid/org/apache/maven/maven-profile/2.0.9/maven-profile-2.0.9.jar
Progress (2): 147 kB | 189/265 kBProgress (2): 147 kB | 193/265 kBProgress (2): 147 kB | 197/265 kBProgress (2): 147 kB | 201/265 kBProgress (2): 147 kB | 206/265 kBProgress (2): 147 kB | 210/265 kBProgress (2): 147 kB | 214/265 kBProgress (2): 147 kB | 218/265 kBProgress (2): 147 kB | 222/265 kBProgress (2): 147 kB | 226/265 kBProgress (2): 147 kB | 230/265 kBProgress (2): 147 kB | 234/265 kBProgress (2): 147 kB | 238/265 kBProgress (2): 147 kB | 242/265 kBProgress (2): 147 kB | 247/265 kBProgress (2): 147 kB | 251/265 kBProgress (2): 147 kB | 255/265 kBProgress (2): 147 kB | 259/265 kBProgress (2): 147 kB | 263/265 kBProgress (2): 147 kB | 265 kB                                 Downloaded from sonatype-public-grid: https://repository.sonatype.org/content/groups/sonatype-public-grid/org/apache/maven/surefire/surefire-api/2.17/surefire-api-2.17.jar (147 kB at 801 kB/s)
Downloading from sonatype-public-grid: https://repository.sonatype.org/content/groups/sonatype-public-grid/org/apache/maven/maven-artifact-manager/2.0.9/maven-artifact-manager-2.0.9.jar
Progress (2): 265 kB | 4.1/35 kBProgress (2): 265 kB | 7.8/35 kBProgress (2): 265 kB | 7.9/35 kBProgress (2): 265 kB | 12/35 kB Progress (2): 265 kB | 16/35 kBProgress (2): 265 kB | 20/35 kBProgress (2): 265 kB | 24/35 kBProgress (2): 265 kB | 28/35 kBProgress (2): 265 kB | 32/35 kBProgress (2): 265 kB | 35 kB                               Downloaded from sonatype-public-grid: https://repository.sonatype.org/content/groups/sonatype-public-grid/org/apache/maven/surefire/maven-surefire-common/2.17/maven-surefire-common-2.17.jar (265 kB at 1.2 MB/s)
Downloading from sonatype-public-grid: https://repository.sonatype.org/content/groups/sonatype-public-grid/org/apache/maven/maven-plugin-registry/2.0.9/maven-plugin-registry-2.0.9.jar
Progress (2): 35 kB | 4.1/122 kBProgress (2): 35 kB | 7.8/122 kBProgress (2): 35 kB | 7.9/122 kBProgress (3): 35 kB | 7.9/122 kB | 4.1/58 kBProgress (3): 35 kB | 7.9/122 kB | 7.8/58 kBProgress (3): 35 kB | 7.9/122 kB | 12/58 kB Progress (3): 35 kB | 7.9/122 kB | 16/58 kBProgress (3): 35 kB | 7.9/122 kB | 20/58 kBProgress (3): 35 kB | 7.9/122 kB | 24/58 kBProgress (3): 35 kB | 7.9/122 kB | 28/58 kBProgress (3): 35 kB | 7.9/122 kB | 32/58 kBProgress (3): 35 kB | 7.9/122 kB | 33/58 kBProgress (3): 35 kB | 7.9/122 kB | 37/58 kBProgress (3): 35 kB | 7.9/122 kB | 41/58 kBProgress (3): 35 kB | 7.9/122 kB | 45/58 kBProgress (3): 35 kB | 7.9/122 kB | 49/58 kBProgress (3): 35 kB | 7.9/122 kB | 53/58 kBProgress (3): 35 kB | 7.9/122 kB | 57/58 kBProgress (3): 35 kB | 7.9/122 kB | 58 kB   Progress (4): 35 kB | 7.9/122 kB | 58 kB | 4.1/29 kBProgress (4): 35 kB | 7.9/122 kB | 58 kB | 7.8/29 kBProgress (4): 35 kB | 7.9/122 kB | 58 kB | 7.9/29 kBProgress (4): 35 kB | 7.9/122 kB | 58 kB | 12/29 kB Progress (4): 35 kB | 7.9/122 kB | 58 kB | 16/29 kBProgress (4): 35 kB | 7.9/122 kB | 58 kB | 20/29 kBProgress (4): 35 kB | 7.9/122 kB | 58 kB | 24/29 kBProgress (4): 35 kB | 7.9/122 kB | 58 kB | 28/29 kBProgress (4): 35 kB | 7.9/122 kB | 58 kB | 29 kB   Progress (5): 35 kB | 7.9/122 kB | 58 kB | 29 kB | 4.1/37 kBProgress (5): 35 kB | 7.9/122 kB | 58 kB | 29 kB | 7.8/37 kBProgress (5): 35 kB | 12/122 kB | 58 kB | 29 kB | 7.8/37 kB Progress (5): 35 kB | 12/122 kB | 58 kB | 29 kB | 12/37 kB Progress (5): 35 kB | 16/122 kB | 58 kB | 29 kB | 12/37 kBProgress (5): 35 kB | 16/122 kB | 58 kB | 29 kB | 16/37 kBProgress (5): 35 kB | 20/122 kB | 58 kB | 29 kB | 16/37 kBProgress (5): 35 kB | 24/122 kB | 58 kB | 29 kB | 16/37 kBProgress (5): 35 kB | 24/122 kB | 58 kB | 29 kB | 20/37 kBProgress (5): 35 kB | 24/122 kB | 58 kB | 29 kB | 24/37 kBProgress (5): 35 kB | 24/122 kB | 58 kB | 29 kB | 28/37 kBProgress (5): 35 kB | 28/122 kB | 58 kB | 29 kB | 28/37 kBProgress (5): 35 kB | 28/122 kB | 58 kB | 29 kB | 32/37 kBProgress (5): 35 kB | 32/122 kB | 58 kB | 29 kB | 32/37 kBProgress (5): 35 kB | 37/122 kB | 58 kB | 29 kB | 32/37 kBProgress (5): 35 kB | 41/122 kB | 58 kB | 29 kB | 32/37 kBProgress (5): 35 kB | 41/122 kB | 58 kB | 29 kB | 37/37 kBProgress (5): 35 kB | 41/122 kB | 58 kB | 29 kB | 37 kB                                                          Downloaded from sonatype-public-grid: https://repository.sonatype.org/content/groups/sonatype-public-grid/org/apache/maven/maven-profile/2.0.9/maven-profile-2.0.9.jar (35 kB at 126 kB/s)
Downloading from sonatype-public-grid: https://repository.sonatype.org/content/groups/sonatype-public-grid/org/apache/maven/maven-toolchain/2.0.9/maven-toolchain-2.0.9.jar
Progress (4): 45/122 kB | 58 kB | 29 kB | 37 kBProgress (4): 49/122 kB | 58 kB | 29 kB | 37 kBProgress (4): 53/122 kB | 58 kB | 29 kB | 37 kBProgress (4): 57/122 kB | 58 kB | 29 kB | 37 kB                                               Downloaded from sonatype-public-grid: https://repository.sonatype.org/content/groups/sonatype-public-grid/org/apache/maven/maven-plugin-registry/2.0.9/maven-plugin-registry-2.0.9.jar (29 kB at 100 kB/s)
Downloading from sonatype-public-grid: https://repository.sonatype.org/content/groups/sonatype-public-grid/org/apache/commons/commons-lang3/3.1/commons-lang3-3.1.jar
Progress (3): 61/122 kB | 58 kB | 37 kBProgress (3): 65/122 kB | 58 kB | 37 kBProgress (3): 66/122 kB | 58 kB | 37 kB                                       Downloaded from sonatype-public-grid: https://repository.sonatype.org/content/groups/sonatype-public-grid/org/apache/maven/maven-plugin-descriptor/2.0.9/maven-plugin-descriptor-2.0.9.jar (37 kB at 124 kB/s)
Downloaded from sonatype-public-grid: https://repository.sonatype.org/content/groups/sonatype-public-grid/org/apache/maven/maven-artifact-manager/2.0.9/maven-artifact-manager-2.0.9.jar (58 kB at 182 kB/s)
Progress (2): 66/122 kB | 4.1/38 kBProgress (2): 66/122 kB | 7.8/38 kBProgress (2): 66/122 kB | 7.9/38 kBProgress (2): 66/122 kB | 12/38 kB Progress (2): 66/122 kB | 16/38 kBProgress (2): 66/122 kB | 20/38 kBProgress (2): 66/122 kB | 24/38 kBProgress (2): 66/122 kB | 28/38 kBProgress (2): 66/122 kB | 32/38 kBProgress (2): 66/122 kB | 37/38 kBProgress (2): 66/122 kB | 38 kB   Progress (2): 70/122 kB | 38 kBProgress (2): 74/122 kB | 38 kBProgress (2): 78/122 kB | 38 kBProgress (2): 82/122 kB | 38 kBProgress (2): 86/122 kB | 38 kBProgress (2): 91/122 kB | 38 kBProgress (2): 95/122 kB | 38 kBProgress (2): 99/122 kB | 38 kBProgress (2): 103/122 kB | 38 kBProgress (2): 107/122 kB | 38 kBProgress (2): 111/122 kB | 38 kBProgress (2): 115/122 kB | 38 kBProgress (2): 119/122 kB | 38 kBProgress (2): 122 kB | 38 kB    Progress (3): 122 kB | 38 kB | 4.1/316 kBProgress (3): 122 kB | 38 kB | 7.8/316 kBProgress (3): 122 kB | 38 kB | 7.9/316 kBProgress (3): 122 kB | 38 kB | 12/316 kB Progress (3): 122 kB | 38 kB | 16/316 kBProgress (3): 122 kB | 38 kB | 20/316 kBProgress (3): 122 kB | 38 kB | 24/316 kBProgress (3): 122 kB | 38 kB | 28/316 kBProgress (3): 122 kB | 38 kB | 32/316 kBProgress (3): 122 kB | 38 kB | 37/316 kBProgress (3): 122 kB | 38 kB | 41/316 kBProgress (3): 122 kB | 38 kB | 45/316 kBProgress (3): 122 kB | 38 kB | 49/316 kBProgress (3): 122 kB | 38 kB | 53/316 kBProgress (3): 122 kB | 38 kB | 57/316 kBProgress (3): 122 kB | 38 kB | 61/316 kBProgress (3): 122 kB | 38 kB | 65/316 kBProgress (3): 122 kB | 38 kB | 69/316 kBProgress (3): 122 kB | 38 kB | 73/316 kBProgress (3): 122 kB | 38 kB | 77/316 kBProgress (3): 122 kB | 38 kB | 82/316 kBProgress (3): 122 kB | 38 kB | 86/316 kBProgress (3): 122 kB | 38 kB | 90/316 kBProgress (3): 122 kB | 38 kB | 94/316 kBProgress (3): 122 kB | 38 kB | 98/316 kBProgress (3): 122 kB | 38 kB | 102/316 kBProgress (3): 122 kB | 38 kB | 106/316 kBProgress (3): 122 kB | 38 kB | 110/316 kBProgress (3): 122 kB | 38 kB | 114/316 kBProgress (3): 122 kB | 38 kB | 118/316 kBProgress (3): 122 kB | 38 kB | 123/316 kBProgress (3): 122 kB | 38 kB | 127/316 kBProgress (3): 122 kB | 38 kB | 131/316 kBProgress (3): 122 kB | 38 kB | 135/316 kBProgress (3): 122 kB | 38 kB | 139/316 kBProgress (3): 122 kB | 38 kB | 143/316 kBProgress (3): 122 kB | 38 kB | 147/316 kBProgress (3): 122 kB | 38 kB | 151/316 kBProgress (3): 122 kB | 38 kB | 155/316 kBProgress (3): 122 kB | 38 kB | 159/316 kBProgress (3): 122 kB | 38 kB | 164/316 kBProgress (3): 122 kB | 38 kB | 168/316 kBProgress (3): 122 kB | 38 kB | 172/316 kBProgress (3): 122 kB | 38 kB | 176/316 kBProgress (3): 122 kB | 38 kB | 180/316 kB                                         Downloaded from sonatype-public-grid: https://repository.sonatype.org/content/groups/sonatype-public-grid/org/apache/maven/maven-toolchain/2.0.9/maven-toolchain-2.0.9.jar (38 kB at 105 kB/s)
Progress (2): 122 kB | 184/316 kBProgress (2): 122 kB | 188/316 kBProgress (2): 122 kB | 192/316 kBProgress (2): 122 kB | 196/316 kBProgress (2): 122 kB | 200/316 kBProgress (2): 122 kB | 204/316 kBProgress (2): 122 kB | 209/316 kBProgress (2): 122 kB | 213/316 kBProgress (2): 122 kB | 217/316 kBProgress (2): 122 kB | 221/316 kBProgress (2): 122 kB | 225/316 kBProgress (2): 122 kB | 229/316 kBProgress (2): 122 kB | 233/316 kBProgress (2): 122 kB | 237/316 kBProgress (2): 122 kB | 241/316 kBProgress (2): 122 kB | 245/316 kBProgress (2): 122 kB | 250/316 kBProgress (2): 122 kB | 254/316 kBProgress (2): 122 kB | 258/316 kBProgress (2): 122 kB | 262/316 kBProgress (2): 122 kB | 266/316 kBProgress (2): 122 kB | 270/316 kBProgress (2): 122 kB | 274/316 kBProgress (2): 122 kB | 278/316 kBProgress (2): 122 kB | 282/316 kBProgress (2): 122 kB | 286/316 kBProgress (2): 122 kB | 290/316 kB                                 Downloaded from sonatype-public-grid: https://repository.sonatype.org/content/groups/sonatype-public-grid/org/apache/maven/maven-project/2.0.9/maven-project-2.0.9.jar (122 kB at 308 kB/s)
Progress (1): 295/316 kBProgress (1): 299/316 kBProgress (1): 303/316 kBProgress (1): 307/316 kBProgress (1): 311/316 kBProgress (1): 315/316 kBProgress (1): 316 kB                        Downloaded from sonatype-public-grid: https://repository.sonatype.org/content/groups/sonatype-public-grid/org/apache/commons/commons-lang3/3.1/commons-lang3-3.1.jar (316 kB at 504 kB/s)
Downloading from tycho: https://oss.sonatype.org/content/repositories/public/org/eclipse/tycho/tycho-p2-publisher-plugin/1.1.0/tycho-p2-publisher-plugin-1.1.0.pom
Progress (1): 2.1 kB                    Downloaded from tycho: https://oss.sonatype.org/content/repositories/public/org/eclipse/tycho/tycho-p2-publisher-plugin/1.1.0/tycho-p2-publisher-plugin-1.1.0.pom (2.1 kB at 7.3 kB/s)
Downloading from tycho: https://oss.sonatype.org/content/repositories/public/org/eclipse/tycho/tycho-p2-publisher-plugin/1.1.0/tycho-p2-publisher-plugin-1.1.0.jar
Progress (1): 4.1/20 kBProgress (1): 7.8/20 kBProgress (1): 12/20 kB Progress (1): 16/20 kBProgress (1): 20 kB                      Downloaded from tycho: https://oss.sonatype.org/content/repositories/public/org/eclipse/tycho/tycho-p2-publisher-plugin/1.1.0/tycho-p2-publisher-plugin-1.1.0.jar (20 kB at 99 kB/s)
Downloading from tycho: https://oss.sonatype.org/content/repositories/public/org/eclipse/tycho/tycho-p2-repository-plugin/1.1.0/tycho-p2-repository-plugin-1.1.0.pom
Progress (1): 1.4 kB                    Downloaded from tycho: https://oss.sonatype.org/content/repositories/public/org/eclipse/tycho/tycho-p2-repository-plugin/1.1.0/tycho-p2-repository-plugin-1.1.0.pom (1.4 kB at 13 kB/s)
Downloading from tycho: https://oss.sonatype.org/content/repositories/public/org/eclipse/tycho/tycho-p2-repository-plugin/1.1.0/tycho-p2-repository-plugin-1.1.0.jar
Progress (1): 4.1/14 kBProgress (1): 7.8/14 kBProgress (1): 12/14 kB Progress (1): 14 kB                      Downloaded from tycho: https://oss.sonatype.org/content/repositories/public/org/eclipse/tycho/tycho-p2-repository-plugin/1.1.0/tycho-p2-repository-plugin-1.1.0.jar (14 kB at 115 kB/s)
[INFO] Computing target platform for MavenProject: org.eclipse.webtools.common:org.eclipse.wst.common.api.doc:1.0.2-SNAPSHOT @ /jobs/genie.webtools/webtools-common_R3_10/workspace/docs/org.eclipse.wst.common.api.doc/pom.xml
[INFO] Adding repository http://download.eclipse.org/cbi/updates/license/1.0.1.v20140414-1359
[INFO] Fetching content.jar from http://download.eclipse.org/cbi/updates/license/1.0.1.v20140414-1359/ (3.83kB)
[INFO] Fetching content.jar from http://download.eclipse.org/cbi/updates/license/1.0.1.v20140414-1359/ (3.83kB)
[INFO] Adding repository http://download.eclipse.org/eclipse/downloads/drops4/S-4.8RC4-201806071630
[ERROR] Internal error: java.lang.RuntimeException: Failed to load p2 repository with ID 'platform' from location http://download.eclipse.org/eclipse/downloads/drops4/S-4.8RC4-201806071630/: No repository found at http://download.eclipse.org/eclipse/downloads/drops4/S-4.8RC4-201806071630. -> [Help 1]
org.apache.maven.InternalErrorException: Internal error: java.lang.RuntimeException: Failed to load p2 repository with ID 'platform' from location http://download.eclipse.org/eclipse/downloads/drops4/S-4.8RC4-201806071630/
    at org.apache.maven.DefaultMaven.execute (DefaultMaven.java:122)
    at org.apache.maven.cli.MavenCli.execute (MavenCli.java:955)
    at org.apache.maven.cli.MavenCli.doMain (MavenCli.java:290)
    at org.apache.maven.cli.MavenCli.main (MavenCli.java:194)
    at sun.reflect.NativeMethodAccessorImpl.invoke0 (Native Method)
    at sun.reflect.NativeMethodAccessorImpl.invoke (NativeMethodAccessorImpl.java:62)
    at sun.reflect.DelegatingMethodAccessorImpl.invoke (DelegatingMethodAccessorImpl.java:43)
    at java.lang.reflect.Method.invoke (Method.java:498)
    at org.codehaus.plexus.classworlds.launcher.Launcher.launchEnhanced (Launcher.java:289)
    at org.codehaus.plexus.classworlds.launcher.Launcher.launch (Launcher.java:229)
    at org.codehaus.plexus.classworlds.launcher.Launcher.mainWithExitCode (Launcher.java:415)
    at org.codehaus.plexus.classworlds.launcher.Launcher.main (Launcher.java:356)
Caused by: java.lang.RuntimeException: Failed to load p2 repository with ID 'platform' from location http://download.eclipse.org/eclipse/downloads/drops4/S-4.8RC4-201806071630/
    at org.eclipse.tycho.p2.target.TargetPlatformFactoryImpl.loadMetadataRepository (TargetPlatformFactoryImpl.java:302)
    at org.eclipse.tycho.p2.target.TargetPlatformFactoryImpl.gatherExternalInstallableUnits (TargetPlatformFactoryImpl.java:270)
    at org.eclipse.tycho.p2.target.TargetPlatformFactoryImpl.createTargetPlatform (TargetPlatformFactoryImpl.java:176)
    at org.eclipse.tycho.p2.target.TargetPlatformFactoryImpl.createTargetPlatform (TargetPlatformFactoryImpl.java:128)
    at org.eclipse.tycho.p2.target.TargetPlatformFactoryImpl.createTargetPlatform (TargetPlatformFactoryImpl.java:1)
    at org.eclipse.tycho.p2.manager.ReactorRepositoryManagerImpl.computePreliminaryTargetPlatform (ReactorRepositoryManagerImpl.java:84)
    at org.eclipse.tycho.p2.resolver.P2DependencyResolver.computePreliminaryTargetPlatform (P2DependencyResolver.java:223)
    at org.eclipse.tycho.core.resolver.DefaultTychoResolver.resolveProject (DefaultTychoResolver.java:109)
    at org.eclipse.tycho.core.maven.TychoMavenLifecycleParticipant.afterProjectsRead (TychoMavenLifecycleParticipant.java:95)
    at org.apache.maven.DefaultMaven.doExecute (DefaultMaven.java:267)
    at org.apache.maven.DefaultMaven.doExecute (DefaultMaven.java:194)
    at org.apache.maven.DefaultMaven.execute (DefaultMaven.java:107)
    at org.apache.maven.cli.MavenCli.execute (MavenCli.java:955)
    at org.apache.maven.cli.MavenCli.doMain (MavenCli.java:290)
    at org.apache.maven.cli.MavenCli.main (MavenCli.java:194)
    at sun.reflect.NativeMethodAccessorImpl.invoke0 (Native Method)
    at sun.reflect.NativeMethodAccessorImpl.invoke (NativeMethodAccessorImpl.java:62)
    at sun.reflect.DelegatingMethodAccessorImpl.invoke (DelegatingMethodAccessorImpl.java:43)
    at java.lang.reflect.Method.invoke (Method.java:498)
    at org.codehaus.plexus.classworlds.launcher.Launcher.launchEnhanced (Launcher.java:289)
    at org.codehaus.plexus.classworlds.launcher.Launcher.launch (Launcher.java:229)
    at org.codehaus.plexus.classworlds.launcher.Launcher.mainWithExitCode (Launcher.java:415)
    at org.codehaus.plexus.classworlds.launcher.Launcher.main (Launcher.java:356)
Caused by: org.eclipse.equinox.p2.core.ProvisionException: No repository found at http://download.eclipse.org/eclipse/downloads/drops4/S-4.8RC4-201806071630.
    at org.eclipse.equinox.internal.p2.repository.helpers.AbstractRepositoryManager.fail (AbstractRepositoryManager.java:395)
    at org.eclipse.equinox.internal.p2.repository.helpers.AbstractRepositoryManager.loadRepository (AbstractRepositoryManager.java:692)
    at org.eclipse.equinox.internal.p2.metadata.repository.MetadataRepositoryManager.loadRepository (MetadataRepositoryManager.java:96)
    at org.eclipse.tycho.p2.remote.RemoteMetadataRepositoryManager.loadRepository (RemoteMetadataRepositoryManager.java:61)
    at org.eclipse.tycho.p2.remote.RemoteMetadataRepositoryManager.loadRepository (RemoteMetadataRepositoryManager.java:53)
    at org.eclipse.tycho.p2.target.TargetPlatformFactoryImpl.loadMetadataRepository (TargetPlatformFactoryImpl.java:298)
    at org.eclipse.tycho.p2.target.TargetPlatformFactoryImpl.gatherExternalInstallableUnits (TargetPlatformFactoryImpl.java:270)
    at org.eclipse.tycho.p2.target.TargetPlatformFactoryImpl.createTargetPlatform (TargetPlatformFactoryImpl.java:176)
    at org.eclipse.tycho.p2.target.TargetPlatformFactoryImpl.createTargetPlatform (TargetPlatformFactoryImpl.java:128)
    at org.eclipse.tycho.p2.target.TargetPlatformFactoryImpl.createTargetPlatform (TargetPlatformFactoryImpl.java:1)
    at org.eclipse.tycho.p2.manager.ReactorRepositoryManagerImpl.computePreliminaryTargetPlatform (ReactorRepositoryManagerImpl.java:84)
    at org.eclipse.tycho.p2.resolver.P2DependencyResolver.computePreliminaryTargetPlatform (P2DependencyResolver.java:223)
    at org.eclipse.tycho.core.resolver.DefaultTychoResolver.resolveProject (DefaultTychoResolver.java:109)
    at org.eclipse.tycho.core.maven.TychoMavenLifecycleParticipant.afterProjectsRead (TychoMavenLifecycleParticipant.java:95)
    at org.apache.maven.DefaultMaven.doExecute (DefaultMaven.java:267)
    at org.apache.maven.DefaultMaven.doExecute (DefaultMaven.java:194)
    at org.apache.maven.DefaultMaven.execute (DefaultMaven.java:107)
    at org.apache.maven.cli.MavenCli.execute (MavenCli.java:955)
    at org.apache.maven.cli.MavenCli.doMain (MavenCli.java:290)
    at org.apache.maven.cli.MavenCli.main (MavenCli.java:194)
    at sun.reflect.NativeMethodAccessorImpl.invoke0 (Native Method)
    at sun.reflect.NativeMethodAccessorImpl.invoke (NativeMethodAccessorImpl.java:62)
    at sun.reflect.DelegatingMethodAccessorImpl.invoke (DelegatingMethodAccessorImpl.java:43)
    at java.lang.reflect.Method.invoke (Method.java:498)
    at org.codehaus.plexus.classworlds.launcher.Launcher.launchEnhanced (Launcher.java:289)
    at org.codehaus.plexus.classworlds.launcher.Launcher.launch (Launcher.java:229)
    at org.codehaus.plexus.classworlds.launcher.Launcher.mainWithExitCode (Launcher.java:415)
    at org.codehaus.plexus.classworlds.launcher.Launcher.main (Launcher.java:356)
[ERROR] 
[ERROR] To see the full stack trace of the errors, re-run Maven with the -e switch.
[ERROR] Re-run Maven using the -X switch to enable full debug logging.
[ERROR] 
[ERROR] For more information about the errors and possible solutions, please read the following articles:
[ERROR] [Help 1] http://cwiki.apache.org/confluence/display/MAVEN/InternalErrorException
Build step 'Invoke top-level Maven targets' marked build as failure
Taking screenshot.
[workspace] $ echo $XAUTHORITY
<https://ci.eclipse.org/webtools/job/webtools-common_R3_10/ws/.Xauthority-4030793716421609561>
[workspace] $ ls -l $XAUTHORITY
-rw-rw-r-- 1 genie.webtools webtools 0 Jun  8 10:40 <https://ci.eclipse.org/webtools/job/webtools-common_R3_10/ws/.Xauthority-4030793716421609561>
[workspace] $ import -window root -display :457 screenshot.jpg
Terminating xvnc.
[WARNINGS] Skipping publisher since build result is FAILURE
append disk usage
Started calculate disk usage of build
Finished Calculation of disk usage of build in  2 second
Started calculate disk usage of workspace
Finished Calculation of disk usage of workspace in 0 seconds