[Date Prev][Date Next][Thread Prev][Thread Next][Date Index][Thread Index] [List Home]
[virgo-build] Build failed in Jenkins: gemini-web-container.snapshot #2714

See <https://ci.eclipse.org/gemini/job/gemini-web-container.snapshot/2714/display/redirect>

------------------------------------------
[...truncated 67.87 KB...]
     [echo] exec-ant for target 'jar' gave return code 0
   [subant] Leaving directory: /jobs/genie.gemini/gemini-web-container.snapshot/workspace/org.eclipse.gemini.web.jaspic.fragment
   [subant] Entering directory: /jobs/genie.gemini/gemini-web-container.snapshot/workspace/org.eclipse.gemini.web
Trying to override old definition of task dist-jar
Trying to override old definition of task src-jar

exec-ant:
     [echo] exec-ant for target 'jar' executing in directory '/jobs/genie.gemini/gemini-web-container.snapshot/workspace/org.eclipse.gemini.web'
     [exec] Picked up JAVA_TOOL_OPTIONS: -Xmx2G -Djava.io.tmpdir=/tmp/genie.gemini
     [exec] Buildfile: /jobs/genie.gemini/gemini-web-container.snapshot/workspace/org.eclipse.gemini.web/build.xml
     [exec] Trying to override old definition of task dist-jar
     [exec] Trying to override old definition of task src-jar
     [exec] 
     [exec] ivy.init:
     [exec] 
     [exec] ivy.file.exists:
     [exec] 
     [exec] resolve.init:
     [exec] 
     [exec] resolve.compile:
     [exec] [ivy:cachepath] :: Apache Ivy 2.3.0 - 20130110142753 :: http://ant.apache.org/ivy/ ::
     [exec] [ivy:cachepath] :: loading settings :: file = /jobs/genie.gemini/gemini-web-container.snapshot/workspace/virgo-build/common/ivysettings.xml
     [exec] [ivy:cachepath] DEPRECATED: 'checkUpToDate' is deprecated, use the 'overwriteMode' on the 'ivy:retrieve' task instead (file:/jobs/genie.gemini/gemini-web-container.snapshot/workspace/virgo-build/common/ivysettings.xml)
     [exec] [ivy:cachepath] downloading /opt/public/hipp/homes/genie.gemini/virgo-build-cache/integration-repo/org.eclipse.gemini/org.eclipse.gemini.web.extender/3.0.4.CI-2714/org.eclipse.gemini.web.extender-3.0.4.CI-2714.jar ...
     [exec] [ivy:cachepath] .. (5kB)
     [exec] [ivy:cachepath] .. (0kB)
     [exec] [ivy:cachepath] 	[SUCCESSFUL ] org.eclipse.gemini#org.eclipse.gemini.web.extender;3.0.4.CI-2714!org.eclipse.gemini.web.extender.jar (8ms)
     [exec] [ivy:cachepath] downloading /opt/public/hipp/homes/genie.gemini/virgo-build-cache/integration-repo/org.eclipse.gemini/org.eclipse.gemini.web.extender/3.0.4.CI-2714/org.eclipse.gemini.web.extender-sources-3.0.4.CI-2714.jar ...
     [exec] [ivy:cachepath] .. (3kB)
     [exec] [ivy:cachepath] .. (0kB)
     [exec] [ivy:cachepath] 	[SUCCESSFUL ] org.eclipse.gemini#org.eclipse.gemini.web.extender;3.0.4.CI-2714!org.eclipse.gemini.web.extender-sources.jar(src) (6ms)
     [exec] [ivy:cachepath] downloading /opt/public/hipp/homes/genie.gemini/virgo-build-cache/integration-repo/org.eclipse.gemini/org.eclipse.gemini.web.tomcat/3.0.4.CI-2714/org.eclipse.gemini.web.tomcat-sources-3.0.4.CI-2714.jar ...
     [exec] [ivy:cachepath] .. (61kB)
     [exec] [ivy:cachepath] .. (0kB)
     [exec] [ivy:cachepath] 	[SUCCESSFUL ] org.eclipse.gemini#org.eclipse.gemini.web.tomcat;3.0.4.CI-2714!org.eclipse.gemini.web.tomcat-sources.jar(src) (11ms)
     [exec] [ivy:cachepath] downloading /opt/public/hipp/homes/genie.gemini/virgo-build-cache/integration-repo/org.eclipse.gemini/org.eclipse.gemini.web.tomcat/3.0.4.CI-2714/org.eclipse.gemini.web.tomcat-3.0.4.CI-2714.jar ...
     [exec] [ivy:cachepath] ... (116kB)
     [exec] [ivy:cachepath] .. (0kB)
     [exec] [ivy:cachepath] 	[SUCCESSFUL ] org.eclipse.gemini#org.eclipse.gemini.web.tomcat;3.0.4.CI-2714!org.eclipse.gemini.web.tomcat.jar (13ms)
     [exec] [ivy:cachepath] downloading /opt/public/hipp/homes/genie.gemini/virgo-build-cache/integration-repo/org.eclipse.gemini/org.eclipse.gemini.web.jaspic.fragment/3.0.4.CI-2714/org.eclipse.gemini.web.jaspic.fragment-3.0.4.CI-2714.jar ...
     [exec] [ivy:cachepath] .. (1kB)
     [exec] [ivy:cachepath] .. (0kB)
     [exec] [ivy:cachepath] 	[SUCCESSFUL ] org.eclipse.gemini#org.eclipse.gemini.web.jaspic.fragment;3.0.4.CI-2714!org.eclipse.gemini.web.jaspic.fragment.jar (8ms)
     [exec] [ivy:cachepath] downloading /opt/public/hipp/homes/genie.gemini/virgo-build-cache/integration-repo/org.eclipse.gemini/org.eclipse.gemini.web.jaspic.fragment/3.0.4.CI-2714/org.eclipse.gemini.web.jaspic.fragment-sources-3.0.4.CI-2714.jar ...
     [exec] [ivy:cachepath] .. (0kB)
     [exec] [ivy:cachepath] .. (0kB)
     [exec] [ivy:cachepath] 	[SUCCESSFUL ] org.eclipse.gemini#org.eclipse.gemini.web.jaspic.fragment;3.0.4.CI-2714!org.eclipse.gemini.web.jaspic.fragment-sources.jar(src) (6ms)
     [exec] 
     [exec] jar:
     [exec]     [mkdir] Created dir: /jobs/genie.gemini/gemini-web-container.snapshot/workspace/org.eclipse.gemini.web/target/artifacts
     [exec] [ivy:publish] :: delivering :: org.eclipse.gemini#org.eclipse.gemini.web;working@hipp7 :: 3.0.4.CI-2714 :: integration :: Fri May 04 01:54:02 EDT 2018
     [exec] [ivy:publish] 	delivering ivy file to /jobs/genie.gemini/gemini-web-container.snapshot/workspace/org.eclipse.gemini.web/target/artifacts/ivy.xml
     [exec] [ivy:publish] :: publishing :: org.eclipse.gemini#org.eclipse.gemini.web
     [exec] [ivy:publish] 	published ivy to /opt/public/hipp/homes/genie.gemini/virgo-build-cache/integration-repo/org.eclipse.gemini/org.eclipse.gemini.web/3.0.4.CI-2714.part/ivy-3.0.4.CI-2714.xml
     [exec] [ivy:publish] 	publish commited: moved /opt/public/hipp/homes/genie.gemini/virgo-build-cache/integration-repo/org.eclipse.gemini/org.eclipse.gemini.web/3.0.4.CI-2714.part 
     [exec] [ivy:publish] 		to /opt/public/hipp/homes/genie.gemini/virgo-build-cache/integration-repo/org.eclipse.gemini/org.eclipse.gemini.web/3.0.4.CI-2714
     [exec] 
     [exec] BUILD SUCCESSFUL
     [exec] Total time: 2 seconds
     [echo] exec-ant for target 'jar' gave return code 0
   [subant] Leaving directory: /jobs/genie.gemini/gemini-web-container.snapshot/workspace/org.eclipse.gemini.web
   [subant] Entering directory: /jobs/genie.gemini/gemini-web-container.snapshot/workspace/test-bundles/customizer-bundle

exec-ant:
     [echo] exec-ant for target 'jar' executing in directory '/jobs/genie.gemini/gemini-web-container.snapshot/workspace/test-bundles/customizer-bundle'
     [exec] Picked up JAVA_TOOL_OPTIONS: -Xmx2G -Djava.io.tmpdir=/tmp/genie.gemini
     [exec] Buildfile: /jobs/genie.gemini/gemini-web-container.snapshot/workspace/test-bundles/customizer-bundle/build.xml
     [exec] 
     [exec] ivy.init:
     [exec] 
     [exec] ivy.file.exists:
     [exec] 
     [exec] resolve.init:
     [exec] 
     [exec] resolve.compile:
     [exec] [ivy:cachepath] :: Apache Ivy 2.3.0 - 20130110142753 :: http://ant.apache.org/ivy/ ::
     [exec] [ivy:cachepath] :: loading settings :: file = /jobs/genie.gemini/gemini-web-container.snapshot/workspace/virgo-build/common/ivysettings.xml
     [exec] [ivy:cachepath] DEPRECATED: 'checkUpToDate' is deprecated, use the 'overwriteMode' on the 'ivy:retrieve' task instead (file:/jobs/genie.gemini/gemini-web-container.snapshot/workspace/virgo-build/common/ivysettings.xml)
     [exec] 
     [exec] compile.init:
     [exec] 
     [exec] jar.init:
     [exec] 
     [exec] jar:
     [exec]     [mkdir] Created dir: /jobs/genie.gemini/gemini-web-container.snapshot/workspace/test-bundles/customizer-bundle/target/artifacts
     [exec]     [mkdir] Created dir: /jobs/genie.gemini/gemini-web-container.snapshot/workspace/test-bundles/customizer-bundle/target/classes
     [exec]   [s:javac] Compiling 5 source files to /jobs/genie.gemini/gemini-web-container.snapshot/workspace/test-bundles/customizer-bundle/target/classes
     [exec]      [copy] Copying 2 files to /jobs/genie.gemini/gemini-web-container.snapshot/workspace/test-bundles/customizer-bundle/target/classes
     [exec] 
     [exec] ivy.init:
     [exec] 
     [exec] bundlor.init:
     [exec] 
     [exec] bundlor:
     [exec]       [jar] Building jar: /jobs/genie.gemini/gemini-web-container.snapshot/workspace/org.eclipse.gemini.web.test/target/resources/customizer-bundle.jar
     [exec]       [jar] Building jar: /jobs/genie.gemini/gemini-web-container.snapshot/workspace/test-bundles/customizer-bundle/target/artifacts/customizer-bundle-sources.jar
     [exec] [ivy:publish] :: delivering :: org.eclipse.gemini#customizer-bundle;working@hipp7 :: 3.0.4.CI-2714 :: integration :: Fri May 04 01:54:02 EDT 2018
     [exec] [ivy:publish] 	delivering ivy file to /jobs/genie.gemini/gemini-web-container.snapshot/workspace/test-bundles/customizer-bundle/target/artifacts/ivy.xml
     [exec] [ivy:publish] :: publishing :: org.eclipse.gemini#customizer-bundle
     [exec] [ivy:publish] 	published customizer-bundle to /opt/public/hipp/homes/genie.gemini/virgo-build-cache/integration-repo/org.eclipse.gemini/customizer-bundle/3.0.4.CI-2714.part/customizer-bundle-3.0.4.CI-2714.jar
     [exec] [ivy:publish] 	published customizer-bundle-sources to /opt/public/hipp/homes/genie.gemini/virgo-build-cache/integration-repo/org.eclipse.gemini/customizer-bundle/3.0.4.CI-2714.part/customizer-bundle-sources-3.0.4.CI-2714.jar
     [exec] [ivy:publish] 	published ivy to /opt/public/hipp/homes/genie.gemini/virgo-build-cache/integration-repo/org.eclipse.gemini/customizer-bundle/3.0.4.CI-2714.part/ivy-3.0.4.CI-2714.xml
     [exec] [ivy:publish] 	publish commited: moved /opt/public/hipp/homes/genie.gemini/virgo-build-cache/integration-repo/org.eclipse.gemini/customizer-bundle/3.0.4.CI-2714.part 
     [exec] [ivy:publish] 		to /opt/public/hipp/homes/genie.gemini/virgo-build-cache/integration-repo/org.eclipse.gemini/customizer-bundle/3.0.4.CI-2714
     [exec] 
     [exec] BUILD SUCCESSFUL
     [exec] Total time: 3 seconds
     [echo] exec-ant for target 'jar' gave return code 0
   [subant] Leaving directory: /jobs/genie.gemini/gemini-web-container.snapshot/workspace/test-bundles/customizer-bundle
   [subant] Entering directory: /jobs/genie.gemini/gemini-web-container.snapshot/workspace/org.eclipse.gemini.web.test

exec-ant:
     [echo] exec-ant for target 'jar' executing in directory '/jobs/genie.gemini/gemini-web-container.snapshot/workspace/org.eclipse.gemini.web.test'
     [exec] Picked up JAVA_TOOL_OPTIONS: -Xmx2G -Djava.io.tmpdir=/tmp/genie.gemini
     [exec] Buildfile: /jobs/genie.gemini/gemini-web-container.snapshot/workspace/org.eclipse.gemini.web.test/build.xml
     [exec] 
     [exec] ivy.init:
     [exec] 
     [exec] ivy.file.exists:
     [exec] 
     [exec] resolve.init:
     [exec] 
     [exec] resolve.compile:
     [exec] [ivy:cachepath] :: Apache Ivy 2.3.0 - 20130110142753 :: http://ant.apache.org/ivy/ ::
     [exec] [ivy:cachepath] :: loading settings :: file = /jobs/genie.gemini/gemini-web-container.snapshot/workspace/virgo-build/common/ivysettings.xml
     [exec] [ivy:cachepath] DEPRECATED: 'checkUpToDate' is deprecated, use the 'overwriteMode' on the 'ivy:retrieve' task instead (file:/jobs/genie.gemini/gemini-web-container.snapshot/workspace/virgo-build/common/ivysettings.xml)
     [exec] 
     [exec] compile.init:
     [exec] 
     [exec] jar.init:
     [exec] 
     [exec] jar:
     [exec]     [mkdir] Created dir: /jobs/genie.gemini/gemini-web-container.snapshot/workspace/org.eclipse.gemini.web.test/target/artifacts
     [exec]     [mkdir] Created dir: /jobs/genie.gemini/gemini-web-container.snapshot/workspace/org.eclipse.gemini.web.test/target/classes
     [exec] 
     [exec] ivy.init:
     [exec] 
     [exec] bundlor.init:
     [exec] [ivy:cachepath] :: loading settings :: file = /jobs/genie.gemini/gemini-web-container.snapshot/workspace/virgo-build/common/ivysettings.xml
     [exec] [ivy:cachepath] DEPRECATED: 'checkUpToDate' is deprecated, use the 'overwriteMode' on the 'ivy:retrieve' task instead (file:/jobs/genie.gemini/gemini-web-container.snapshot/workspace/virgo-build/common/ivysettings.xml)
     [exec] 
     [exec] bundlor:
     [exec] [bundlor:bundlor] Manifest written to '/jobs/genie.gemini/gemini-web-container.snapshot/workspace/org.eclipse.gemini.web.test/target/classes/META-INF/MANIFEST.MF'
     [exec]       [jar] Building jar: /jobs/genie.gemini/gemini-web-container.snapshot/workspace/org.eclipse.gemini.web.test/target/artifacts/org.eclipse.gemini.web.test.jar
     [exec]       [jar] Building MANIFEST-only jar: /jobs/genie.gemini/gemini-web-container.snapshot/workspace/org.eclipse.gemini.web.test/target/artifacts/org.eclipse.gemini.web.test-sources.jar
     [exec] [ivy:publish] :: delivering :: org.eclipse.gemini#org.eclipse.gemini.web.test;working@hipp7 :: 3.0.4.CI-2714 :: integration :: Fri May 04 01:54:02 EDT 2018
     [exec] [ivy:publish] 	delivering ivy file to /jobs/genie.gemini/gemini-web-container.snapshot/workspace/org.eclipse.gemini.web.test/target/artifacts/ivy.xml
     [exec] [ivy:publish] :: publishing :: org.eclipse.gemini#org.eclipse.gemini.web.test
     [exec] [ivy:publish] 	published org.eclipse.gemini.web.test to /opt/public/hipp/homes/genie.gemini/virgo-build-cache/integration-repo/org.eclipse.gemini/org.eclipse.gemini.web.test/3.0.4.CI-2714.part/org.eclipse.gemini.web.test-3.0.4.CI-2714.jar
     [exec] [ivy:publish] 	published org.eclipse.gemini.web.test-sources to /opt/public/hipp/homes/genie.gemini/virgo-build-cache/integration-repo/org.eclipse.gemini/org.eclipse.gemini.web.test/3.0.4.CI-2714.part/org.eclipse.gemini.web.test-sources-3.0.4.CI-2714.jar
     [exec] [ivy:publish] 	published ivy to /opt/public/hipp/homes/genie.gemini/virgo-build-cache/integration-repo/org.eclipse.gemini/org.eclipse.gemini.web.test/3.0.4.CI-2714.part/ivy-3.0.4.CI-2714.xml
     [exec] [ivy:publish] 	publish commited: moved /opt/public/hipp/homes/genie.gemini/virgo-build-cache/integration-repo/org.eclipse.gemini/org.eclipse.gemini.web.test/3.0.4.CI-2714.part 
     [exec] [ivy:publish] 		to /opt/public/hipp/homes/genie.gemini/virgo-build-cache/integration-repo/org.eclipse.gemini/org.eclipse.gemini.web.test/3.0.4.CI-2714
     [exec] 
     [exec] BUILD SUCCESSFUL
     [exec] Total time: 4 seconds
     [echo] exec-ant for target 'jar' gave return code 0
   [subant] Leaving directory: /jobs/genie.gemini/gemini-web-container.snapshot/workspace/org.eclipse.gemini.web.test

test.pre:
    [mkdir] Created dir: /jobs/genie.gemini/gemini-web-container.snapshot/workspace/build-web-container/target/test-results/xml

test.do:
   [subant] Entering directory: /jobs/genie.gemini/gemini-web-container.snapshot/workspace/org.eclipse.gemini.web.core

exec-ant:
     [echo] exec-ant for target 'test.do' executing in directory '/jobs/genie.gemini/gemini-web-container.snapshot/workspace/org.eclipse.gemini.web.core'
     [exec] Picked up JAVA_TOOL_OPTIONS: -Xmx2G -Djava.io.tmpdir=/tmp/genie.gemini
     [exec] Buildfile: /jobs/genie.gemini/gemini-web-container.snapshot/workspace/org.eclipse.gemini.web.core/build.xml
     [exec] 
     [exec] ivy.init:
     [exec] 
     [exec] ivy.file.exists:
     [exec] 
     [exec] resolve.init:
     [exec] 
     [exec] resolve.compile:
     [exec] [ivy:cachepath] :: Apache Ivy 2.3.0 - 20130110142753 :: http://ant.apache.org/ivy/ ::
     [exec] [ivy:cachepath] :: loading settings :: file = /jobs/genie.gemini/gemini-web-container.snapshot/workspace/virgo-build/common/ivysettings.xml
     [exec] [ivy:cachepath] DEPRECATED: 'checkUpToDate' is deprecated, use the 'overwriteMode' on the 'ivy:retrieve' task instead (file:/jobs/genie.gemini/gemini-web-container.snapshot/workspace/virgo-build/common/ivysettings.xml)
     [exec] 
     [exec] BUILD FAILED
     [exec] /jobs/genie.gemini/gemini-web-container.snapshot/workspace/virgo-build/common/common.xml:118: impossible to configure ivy:settings with given file: /jobs/genie.gemini/gemini-web-container.snapshot/workspace/virgo-build/common/ivysettings.xml : java.text.ParseException: failed to load settings from file:/jobs/genie.gemini/gemini-web-container.snapshot/workspace/virgo-build/common/ivysettings.xml: impossible to add configured child for ivy on class org.apache.ivy.plugins.resolver.FileSystemResolver: ivy pattern must be absolute: ?/virgo-build-cache/integration-repo/[organisation]/[module]/[revision]/[artifact]-[revision].[ext]
     [exec] 	at org.apache.ivy.core.settings.XmlSettingsParser.doParse(XmlSettingsParser.java:165)
     [exec] 	at org.apache.ivy.core.settings.XmlSettingsParser.parse(XmlSettingsParser.java:150)
     [exec] 	at org.apache.ivy.core.settings.IvySettings.load(IvySettings.java:391)
     [exec] 	at org.apache.ivy.Ivy.configure(Ivy.java:416)
     [exec] 	at org.apache.ivy.ant.IvyAntSettings.createIvyEngine(IvyAntSettings.java:287)
     [exec] 	at org.apache.ivy.ant.IvyAntSettings.getConfiguredIvyInstance(IvyAntSettings.java:245)
     [exec] 	at org.apache.ivy.ant.IvyAntSettings.getConfiguredIvyInstance(IvyAntSettings.java:254)
     [exec] 	at org.apache.ivy.ant.IvyTask.getIvyInstance(IvyTask.java:92)
     [exec] 	at org.apache.ivy.ant.IvyTask.prepareTask(IvyTask.java:256)
     [exec] 	at org.apache.ivy.ant.IvyTask.execute(IvyTask.java:276)
     [exec] 	at org.apache.tools.ant.UnknownElement.execute(UnknownElement.java:291)
     [exec] 	at sun.reflect.GeneratedMethodAccessor6.invoke(Unknown Source)
     [exec] 	at sun.reflect.DelegatingMethodAccessorImpl.invoke(DelegatingMethodAccessorImpl.java:43)
     [exec] 	at java.lang.reflect.Method.invoke(Method.java:606)
     [exec] 	at org.apache.tools.ant.dispatch.DispatchUtils.execute(DispatchUtils.java:106)
     [exec] 	at org.apache.tools.ant.Task.perform(Task.java:348)
     [exec] 	at org.apache.tools.ant.Target.execute(Target.java:392)
     [exec] 	at org.apache.tools.ant.Target.performTasks(Target.java:413)
     [exec] 	at org.apache.tools.ant.Project.executeSortedTargets(Project.java:1399)
     [exec] 	at org.apache.tools.ant.Project.executeTarget(Project.java:1368)
     [exec] 	at org.apache.tools.ant.helper.DefaultExecutor.executeTargets(DefaultExecutor.java:41)
     [exec] 	at org.apache.tools.ant.Project.executeTargets(Project.java:1251)
     [exec] 	at org.apache.tools.ant.Main.runBuild(Main.java:811)
     [exec] 	at org.apache.tools.ant.Main.startAnt(Main.java:217)
     [exec] 	at org.apache.tools.ant.launch.Launcher.run(Launcher.java:280)
     [exec] 	at org.apache.tools.ant.launch.Launcher.main(Launcher.java:109)
     [exec] Caused by: java.lang.IllegalArgumentException: impossible to add configured child for ivy on class org.apache.ivy.plugins.resolver.FileSystemResolver: ivy pattern must be absolute: ?/virgo-build-cache/integration-repo/[organisation]/[module]/[revision]/[artifact]-[revision].[ext]
     [exec] 	at org.apache.ivy.util.Configurator.endCreateChild(Configurator.java:713)
     [exec] 	at org.apache.ivy.core.settings.XmlSettingsParser.endElement(XmlSettingsParser.java:597)
     [exec] 	at com.sun.org.apache.xerces.internal.parsers.AbstractSAXParser.endElement(AbstractSAXParser.java:609)
     [exec] 	at com.sun.org.apache.xerces.internal.parsers.AbstractXMLDocumentParser.emptyElement(AbstractXMLDocumentParser.java:183)
     [exec] 	at com.sun.org.apache.xerces.internal.impl.XMLDocumentFragmentScannerImpl.scanStartElement(XMLDocumentFragmentScannerImpl.java:1343)
     [exec] 	at com.sun.org.apache.xerces.internal.impl.XMLDocumentFragmentScannerImpl$FragmentContentDriver.next(XMLDocumentFragmentScannerImpl.java:2786)
     [exec] 	at com.sun.org.apache.xerces.internal.impl.XMLDocumentScannerImpl.next(XMLDocumentScannerImpl.java:606)
     [exec] 	at com.sun.org.apache.xerces.internal.impl.XMLDocumentFragmentScannerImpl.scanDocument(XMLDocumentFragmentScannerImpl.java:510)
     [exec] 	at com.sun.org.apache.xerces.internal.parsers.XML11Configuration.parse(XML11Configuration.java:848)
     [exec] 	at com.sun.org.apache.xerces.internal.parsers.XML11Configuration.parse(XML11Configuration.java:777)
     [exec] 	at com.sun.org.apache.xerces.internal.parsers.XMLParser.parse(XMLParser.java:141)
     [exec] 	at com.sun.org.apache.xerces.internal.parsers.AbstractSAXParser.parse(AbstractSAXParser.java:1213)
     [exec] 	at com.sun.org.apache.xerces.internal.jaxp.SAXParserImpl$JAXPSAXParser.parse(SAXParserImpl.java:648)
     [exec] 	at com.sun.org.apache.xerces.internal.jaxp.SAXParserImpl.parse(SAXParserImpl.java:332)
     [exec] 	at javax.xml.parsers.SAXParser.parse(SAXParser.java:274)
     [exec] 	at org.apache.ivy.core.settings.XmlSettingsParser.doParse(XmlSettingsParser.java:160)
     [exec] 	... 25 more
     [exec] Caused by: java.lang.reflect.InvocationTargetException
     [exec] 	at sun.reflect.NativeMethodAccessorImpl.invoke0(Native Method)
     [exec] 	at sun.reflect.NativeMethodAccessorImpl.invoke(NativeMethodAccessorImpl.java:57)
     [exec] 	at sun.reflect.DelegatingMethodAccessorImpl.invoke(DelegatingMethodAccessorImpl.java:43)
     [exec] 	at java.lang.reflect.Method.invoke(Method.java:606)
     [exec] 	at org.apache.ivy.util.Configurator.endCreateChild(Configurator.java:709)
     [exec] 	... 40 more
     [exec] Caused by: java.lang.IllegalArgumentException: ivy pattern must be absolute: ?/virgo-build-cache/integration-repo/[organisation]/[module]/[revision]/[artifact]-[revision].[ext]
     [exec] 	at org.apache.ivy.util.Checks.checkAbsolute(Checks.java:57)
     [exec] 	at org.apache.ivy.plugins.resolver.FileSystemResolver.addConfiguredIvy(FileSystemResolver.java:305)
     [exec] 	... 45 more
     [exec] 
     [exec] Total time: 1 second
   [subant] Leaving directory: /jobs/genie.gemini/gemini-web-container.snapshot/workspace/org.eclipse.gemini.web.core

BUILD FAILED
/jobs/genie.gemini/gemini-web-container.snapshot/workspace/virgo-build/multi-bundle/quality.xml:46: The following error occurred while executing this line:
/jobs/genie.gemini/gemini-web-container.snapshot/workspace/virgo-build/multi-bundle/common.xml:186: The following error occurred while executing this line:
/jobs/genie.gemini/gemini-web-container.snapshot/workspace/virgo-build/common/common.xml:200: exec returned: 1

Total time: 3 minutes 21 seconds
Build step 'Execute shell' marked build as failure