Skip to main content

[Date Prev][Date Next][Thread Prev][Thread Next][Date Index][Thread Index] [List Home]
[virgo-build] [Hudson] Build failed in Hudson: virgo.packaging.snapshot #359

See <https://hudson.eclipse.org/virgo/job/virgo.packaging.snapshot/359/>

------------------------------------------
[...truncated 6730 lines...]
    [junit] Oct 15, 2014 3:46:59 AM ClientCommunicatorAdmin restart
    [junit] WARNING: Failed to restart: java.io.IOException: Failed to get a RMI stub: javax.naming.ServiceUnavailableException [Root exception is java.rmi.ConnectException: Connection refused to host: localhost; nested exception is: 
    [junit] 	java.net.ConnectException: Connection refused]
    [junit] Oct 15, 2014 3:46:59 AM ClientCommunicatorAdmin restart
    [junit] WARNING: Failed to restart: java.io.IOException: Failed to get a RMI stub: javax.naming.ServiceUnavailableException [Root exception is java.rmi.ConnectException: Connection refused to host: localhost; nested exception is: 
    [junit] 	java.net.ConnectException: Connection refused]
    [junit] Oct 15, 2014 3:46:59 AM RMIConnector RMIClientCommunicatorAdmin-doStop
    [junit] WARNING: Failed to call the method close():java.rmi.ConnectException: Connection refused to host: 172.30.206.103; nested exception is: 
    [junit] 	java.net.ConnectException: Connection refused
    [junit] Oct 15, 2014 3:46:59 AM ClientCommunicatorAdmin Checker-run
    [junit] WARNING: Failed to check connection: java.net.ConnectException: Connection refused
    [junit] Oct 15, 2014 3:46:59 AM RMIConnector RMIClientCommunicatorAdmin-doStop
    [junit] WARNING: Failed to call the method close():java.rmi.ConnectException: Connection refused to host: 172.30.206.103; nested exception is: 
    [junit] 	java.net.ConnectException: Connection refused
    [junit] Oct 15, 2014 3:46:59 AM ClientCommunicatorAdmin Checker-run
    [junit] WARNING: stopping
    [junit] Oct 15, 2014 3:46:59 AM ClientCommunicatorAdmin Checker-run
    [junit] WARNING: Failed to check connection: java.net.ConnectException: Connection refused
    [junit] Oct 15, 2014 3:46:59 AM ClientCommunicatorAdmin Checker-run
    [junit] WARNING: stopping
    [junit] Oct 15, 2014 3:46:59 AM ClientCommunicatorAdmin restart
    [junit] WARNING: Failed to restart: java.io.IOException: Failed to get a RMI stub: javax.naming.ServiceUnavailableException [Root exception is java.rmi.ConnectException: Connection refused to host: localhost; nested exception is: 
    [junit] 	java.net.ConnectException: Connection refused]
    [junit] Oct 15, 2014 3:46:59 AM ClientCommunicatorAdmin restart
    [junit] WARNING: Failed to restart: java.io.IOException: Failed to get a RMI stub: javax.naming.ServiceUnavailableException [Root exception is java.rmi.ConnectException: Connection refused to host: localhost; nested exception is: 
    [junit] 	java.net.ConnectException: Connection refused]
    [junit] Oct 15, 2014 3:46:59 AM ClientCommunicatorAdmin restart
    [junit] WARNING: Failed to restart: java.io.IOException: Failed to get a RMI stub: javax.naming.ServiceUnavailableException [Root exception is java.rmi.ConnectException: Connection refused to host: localhost; nested exception is: 
    [junit] 	java.net.ConnectException: Connection refused]
    [junit] Oct 15, 2014 3:46:59 AM ClientCommunicatorAdmin restart
    [junit] WARNING: Failed to restart: java.io.IOException: Failed to get a RMI stub: javax.naming.ServiceUnavailableException [Root exception is java.rmi.ConnectException: Connection refused to host: localhost; nested exception is: 
    [junit] 	java.net.ConnectException: Connection refused]
    [junit] Oct 15, 2014 3:46:59 AM RMIConnector RMIClientCommunicatorAdmin-doStop
    [junit] WARNING: Failed to call the method close():java.rmi.ConnectException: Connection refused to host: 172.30.206.103; nested exception is: 
    [junit] 	java.net.ConnectException: Connection refused
    [junit] Oct 15, 2014 3:46:59 AM ClientCommunicatorAdmin Checker-run
    [junit] WARNING: Failed to check connection: java.net.ConnectException: Connection refused
    [junit] Oct 15, 2014 3:46:59 AM RMIConnector RMIClientCommunicatorAdmin-doStop
    [junit] WARNING: Failed to call the method close():java.rmi.ConnectException: Connection refused to host: 172.30.206.103; nested exception is: 
    [junit] 	java.net.ConnectException: Connection refused
    [junit] Oct 15, 2014 3:46:59 AM ClientCommunicatorAdmin Checker-run
    [junit] WARNING: stopping
    [junit] Oct 15, 2014 3:46:59 AM ClientCommunicatorAdmin Checker-run
    [junit] WARNING: Failed to check connection: java.net.ConnectException: Connection refused
    [junit] Oct 15, 2014 3:46:59 AM RMIConnector RMIClientCommunicatorAdmin-doStop
    [junit] WARNING: Failed to call the method close():java.rmi.ConnectException: Connection refused to host: 172.30.206.103; nested exception is: 
    [junit] 	java.net.ConnectException: Connection refused
    [junit] Oct 15, 2014 3:46:59 AM RMIConnector RMIClientCommunicatorAdmin-doStop
    [junit] WARNING: Failed to call the method close():java.rmi.ConnectException: Connection refused to host: 172.30.206.103; nested exception is: 
    [junit] 	java.net.ConnectException: Connection refused
    [junit] Oct 15, 2014 3:46:59 AM ClientCommunicatorAdmin Checker-run
    [junit] WARNING: stopping
    [junit] Oct 15, 2014 3:46:59 AM ClientCommunicatorAdmin Checker-run
    [junit] WARNING: Failed to check connection: java.net.ConnectException: Connection refused
    [junit] Oct 15, 2014 3:46:59 AM ClientCommunicatorAdmin Checker-run
    [junit] WARNING: stopping
    [junit] Oct 15, 2014 3:46:59 AM ClientCommunicatorAdmin restart
    [junit] WARNING: Failed to restart: java.io.IOException: Failed to get a RMI stub: javax.naming.ServiceUnavailableException [Root exception is java.rmi.ConnectException: Connection refused to host: localhost; nested exception is: 
    [junit] 	java.net.ConnectException: Connection refused]
    [junit] Oct 15, 2014 3:46:59 AM ClientCommunicatorAdmin Checker-run
    [junit] WARNING: Failed to check connection: java.net.ConnectException: Connection refused
    [junit] Oct 15, 2014 3:46:59 AM ClientCommunicatorAdmin restart
    [junit] WARNING: Failed to restart: java.io.IOException: Failed to get a RMI stub: javax.naming.ServiceUnavailableException [Root exception is java.rmi.ConnectException: Connection refused to host: localhost; nested exception is: 
    [junit] 	java.net.ConnectException: Connection refused]
    [junit] Oct 15, 2014 3:46:59 AM ClientCommunicatorAdmin restart
    [junit] WARNING: Failed to restart: java.io.IOException: Failed to get a RMI stub: javax.naming.ServiceUnavailableException [Root exception is java.rmi.ConnectException: Connection refused to host: localhost; nested exception is: 
    [junit] 	java.net.ConnectException: Connection refused]
    [junit] Oct 15, 2014 3:46:59 AM RMIConnector RMIClientCommunicatorAdmin-doStop
    [junit] WARNING: Failed to call the method close():java.rmi.ConnectException: Connection refused to host: 172.30.206.103; nested exception is: 
    [junit] 	java.net.ConnectException: Connection refused
    [junit] Oct 15, 2014 3:46:59 AM ClientCommunicatorAdmin Checker-run
    [junit] WARNING: Failed to check connection: java.net.ConnectException: Connection refused
    [junit] Oct 15, 2014 3:46:59 AM ClientCommunicatorAdmin Checker-run
    [junit] WARNING: stopping
    [junit] Oct 15, 2014 3:46:59 AM RMIConnector RMIClientCommunicatorAdmin-doStop
    [junit] WARNING: Failed to call the method close():java.rmi.ConnectException: Connection refused to host: 172.30.206.103; nested exception is: 
    [junit] 	java.net.ConnectException: Connection refused
    [junit] Oct 15, 2014 3:46:59 AM ClientCommunicatorAdmin Checker-run
    [junit] WARNING: Failed to check connection: java.net.ConnectException: Connection refused
    [junit] Oct 15, 2014 3:46:59 AM ClientCommunicatorAdmin Checker-run
    [junit] WARNING: stopping
    [junit] Oct 15, 2014 3:46:59 AM ClientCommunicatorAdmin Checker-run
    [junit] WARNING: stopping
    [junit] Oct 15, 2014 3:46:59 AM RMIConnector RMIClientCommunicatorAdmin-doStop
    [junit] WARNING: Failed to call the method close():java.rmi.ConnectException: Connection refused to host: 172.30.206.103; nested exception is: 
    [junit] 	java.net.ConnectException: Connection refused
    [junit] Oct 15, 2014 3:46:59 AM ClientCommunicatorAdmin Checker-run
    [junit] WARNING: Failed to check connection: java.net.ConnectException: Connection refused
    [junit] Oct 15, 2014 3:46:59 AM ClientCommunicatorAdmin Checker-run
    [junit] WARNING: stopping
    [junit] ------------- ---------------- ---------------
   [subant] Leaving directory: /jobs/genie.rt.virgo/virgo.packaging.snapshot/workspace/build-packaging/nano/org.eclipse.virgo.nano.smoketest

test.post:
    [mkdir] Created dir: /jobs/genie.rt.virgo/virgo.packaging.snapshot/workspace/build-packaging/target/test-results/html
[junitreport] Processing /jobs/genie.rt.virgo/virgo.packaging.snapshot/workspace/build-packaging/TESTS-TestSuites.xml to /tmp/null826182156
[junitreport] Loading stylesheet jar:file:/shared/common/apache-ant-1.8.4/lib/ant-junit.jar!/org/apache/tools/ant/taskdefs/optional/junit/xsl/junit-frames.xsl
[junitreport] Transform time: 150ms
[junitreport] Deleting: /tmp/null826182156
   [delete] Deleting: /jobs/genie.rt.virgo/virgo.packaging.snapshot/workspace/build-packaging/TESTS-TestSuites.xml

smoke-test-kernel:

test.pre:
   [delete] Deleting directory /jobs/genie.rt.virgo/virgo.packaging.snapshot/workspace/build-packaging/target/test-results
    [mkdir] Created dir: /jobs/genie.rt.virgo/virgo.packaging.snapshot/workspace/build-packaging/target/test-results/xml
   [subant] Entering directory: /jobs/genie.rt.virgo/virgo.packaging.snapshot/workspace/build-packaging/kernel/org.eclipse.virgo.kernel.smoketest

test-package:

unzip.package:
   [delete] Deleting directory /jobs/genie.rt.virgo/virgo.packaging.snapshot/workspace/build-packaging/kernel/org.eclipse.virgo.kernel.smoketest/target/test-expanded
    [mkdir] Created dir: /jobs/genie.rt.virgo/virgo.packaging.snapshot/workspace/build-packaging/kernel/org.eclipse.virgo.kernel.smoketest/target/test-expanded
    [unzip] Expanding: /jobs/genie.rt.virgo/virgo.packaging.snapshot/workspace/build-packaging/target/artifacts/virgo-kernel-3.7.0.CI-2014-10-15_03-37-42.zip into /jobs/genie.rt.virgo/virgo.packaging.snapshot/workspace/build-packaging/kernel/org.eclipse.virgo.kernel.smoketest/target/test-expanded

ivy.init:

ivy.file.exists:

resolve.init:

resolve.compile:
[ivy:cachepath] :: Ivy 2.1.0 - 20090925235825 :: http://ant.apache.org/ivy/ ::
[ivy:cachepath] :: loading settings :: file = /jobs/genie.rt.virgo/virgo.packaging.snapshot/workspace/virgo-build/common/ivysettings.xml

resolve.test:

compile.init:

test.init:
   [delete] Deleting: /jobs/genie.rt.virgo/virgo.packaging.snapshot/workspace/build-packaging/kernel/user-ivy.properties
   [delete] Deleting: /jobs/genie.rt.virgo/virgo.packaging.snapshot/workspace/build-packaging/kernel/org.eclipse.virgo.kernel.smoketest/tmp.file

test.do:
   [delete] Deleting directory /jobs/genie.rt.virgo/virgo.packaging.snapshot/workspace/build-packaging/kernel/org.eclipse.virgo.kernel.smoketest/target/test-classes
    [mkdir] Created dir: /jobs/genie.rt.virgo/virgo.packaging.snapshot/workspace/build-packaging/kernel/org.eclipse.virgo.kernel.smoketest/target/test-classes
  [s:javac] Compiling 2 source files to /jobs/genie.rt.virgo/virgo.packaging.snapshot/workspace/build-packaging/kernel/org.eclipse.virgo.kernel.smoketest/target/test-classes
    [junit] Testsuite: org.eclipse.virgo.kernel.smoketest.KernelStartupAndShutdownTests
    [junit] Tests run: 2, Failures: 0, Errors: 0, Time elapsed: 27.207 sec
    [junit] 
    [junit] ------------- Standard Output ---------------
    [junit] The Server could not be reached, it may already be stopped.
    [junit] [2014-10-15 03:47:11.855] startup-tracker              <KE0001I> Kernel starting. 
    [junit] [2014-10-15 03:47:14.120] startup-tracker              <KE0002I> Kernel started. 
    [junit] [2014-10-15 03:47:14.459] system-artifacts             <DE0000I> Installing plan 'org.eclipse.virgo.kernel.userregion.blueprint' version '3.7.0'. 
    [junit] [2014-10-15 03:47:14.566] system-artifacts             <DE0000I> Installing bundle 'org.eclipse.gemini.blueprint.core' version '2.0.0.M02'. 
    [junit] [2014-10-15 03:47:14.599] system-artifacts             <DE0000I> Installing bundle 'org.eclipse.gemini.blueprint.extender' version '2.0.0.M02'. 
    [junit] [2014-10-15 03:47:14.611] system-artifacts             <DE0000I> Installing bundle 'org.eclipse.gemini.blueprint.io' version '2.0.0.M02'. 
    [junit] [2014-10-15 03:47:14.620] system-artifacts             <DE0000I> Installing bundle 'org.eclipse.virgo.kernel.agent.dm' version '3.7.0.D-20140919123907'. 
    [junit] [2014-10-15 03:47:14.626] system-artifacts             <DE0000I> Installing bundle 'org.eclipse.virgo.kernel.deployer.dm' version '3.7.0.D-20140919123907'. 
    [junit] [2014-10-15 03:47:14.647] system-artifacts             <DE0000I> Installing bundle 'org.eclipse.equinox.ds' version '1.4.0.v20120112-1400'. 
    [junit] [2014-10-15 03:47:14.663] system-artifacts             <DE0000I> Installing bundle 'org.eclipse.equinox.util' version '1.0.300.v20111010-1614'. 
    [junit] [2014-10-15 03:47:14.668] system-artifacts             <DE0000I> Installing configuration 'osgi.console' version '0.0.0'. 
    [junit] [2014-10-15 03:47:15.815] system-artifacts             <DE0001I> Installed bundle 'org.eclipse.gemini.blueprint.core' version '2.0.0.M02'. 
    [junit] [2014-10-15 03:47:15.816] system-artifacts             <DE0001I> Installed bundle 'org.eclipse.gemini.blueprint.extender' version '2.0.0.M02'. 
    [junit] [2014-10-15 03:47:15.818] system-artifacts             <DE0001I> Installed bundle 'org.eclipse.gemini.blueprint.io' version '2.0.0.M02'. 
    [junit] [2014-10-15 03:47:15.819] system-artifacts             <DE0001I> Installed bundle 'org.eclipse.virgo.kernel.agent.dm' version '3.7.0.D-20140919123907'. 
    [junit] [2014-10-15 03:47:15.821] system-artifacts             <DE0001I> Installed bundle 'org.eclipse.virgo.kernel.deployer.dm' version '3.7.0.D-20140919123907'. 
    [junit] [2014-10-15 03:47:15.822] system-artifacts             <DE0001I> Installed bundle 'org.eclipse.equinox.ds' version '1.4.0.v20120112-1400'. 
    [junit] [2014-10-15 03:47:15.824] system-artifacts             <DE0001I> Installed bundle 'org.eclipse.equinox.util' version '1.0.300.v20111010-1614'. 
    [junit] [2014-10-15 03:47:15.825] system-artifacts             <DE0001I> Installed configuration 'osgi.console' version '0.0.0'. 
    [junit] [2014-10-15 03:47:15.827] system-artifacts             <DE0001I> Installed plan 'org.eclipse.virgo.kernel.userregion.blueprint' version '3.7.0'. 
    [junit] [2014-10-15 03:47:15.860] system-artifacts             <DE0004I> Starting plan 'org.eclipse.virgo.kernel.userregion.blueprint' version '3.7.0'. 
    [junit] [2014-10-15 03:47:15.867] system-artifacts             <DE0004I> Starting bundle 'org.eclipse.gemini.blueprint.core' version '2.0.0.M02'. 
    [junit] [2014-10-15 03:47:15.872] start-signalling-1           <DE0005I> Started bundle 'org.eclipse.gemini.blueprint.core' version '2.0.0.M02'. 
    [junit] [2014-10-15 03:47:15.876] system-artifacts             <DE0004I> Starting bundle 'org.eclipse.gemini.blueprint.extender' version '2.0.0.M02'. 
    [junit] [2014-10-15 03:47:16.440] start-signalling-1           <DE0005I> Started bundle 'org.eclipse.gemini.blueprint.extender' version '2.0.0.M02'. 
    [junit] [2014-10-15 03:47:16.444] system-artifacts             <DE0004I> Starting bundle 'org.eclipse.gemini.blueprint.io' version '2.0.0.M02'. 
    [junit] [2014-10-15 03:47:16.447] start-signalling-1           <DE0005I> Started bundle 'org.eclipse.gemini.blueprint.io' version '2.0.0.M02'. 
    [junit] [2014-10-15 03:47:16.454] system-artifacts             <DE0004I> Starting bundle 'org.eclipse.virgo.kernel.agent.dm' version '3.7.0.D-20140919123907'. 
    [junit] [2014-10-15 03:47:16.457] start-signalling-1           <DE0005I> Started bundle 'org.eclipse.virgo.kernel.agent.dm' version '3.7.0.D-20140919123907'. 
    [junit] [2014-10-15 03:47:16.460] system-artifacts             <DE0004I> Starting bundle 'org.eclipse.virgo.kernel.deployer.dm' version '3.7.0.D-20140919123907'. 
    [junit] [2014-10-15 03:47:16.470] system-artifacts             <DE0004I> Starting bundle 'org.eclipse.equinox.ds' version '1.4.0.v20120112-1400'. 
    [junit] [2014-10-15 03:47:16.673] start-signalling-1           <DE0005I> Started bundle 'org.eclipse.equinox.ds' version '1.4.0.v20120112-1400'. 
    [junit] [2014-10-15 03:47:16.680] system-artifacts             <DE0004I> Starting bundle 'org.eclipse.equinox.util' version '1.0.300.v20111010-1614'. 
    [junit] [2014-10-15 03:47:16.720] start-signalling-1           <DE0005I> Started bundle 'org.eclipse.virgo.kernel.deployer.dm' version '3.7.0.D-20140919123907'. 
    [junit] [2014-10-15 03:47:16.741] start-signalling-1           <DE0005I> Started bundle 'org.eclipse.equinox.util' version '1.0.300.v20111010-1614'. 
    [junit] [2014-10-15 03:47:16.741] system-artifacts             <DE0004I> Starting configuration 'osgi.console' version '0.0.0'. 
    [junit] [2014-10-15 03:47:16.955] system-artifacts             <DE0005I> Started configuration 'osgi.console' version '0.0.0'. 
    [junit] [2014-10-15 03:47:16.956] system-artifacts             <DE0005I> Started plan 'org.eclipse.virgo.kernel.userregion.blueprint' version '3.7.0'. 
    [junit] [2014-10-15 03:47:17.053] system-artifacts             <DE0000I> Installing plan 'org.eclipse.virgo.management' version '3.7.0'. 
    [junit] [2014-10-15 03:47:17.090] system-artifacts             <DE0000I> Installing bundle 'osgi.enterprise' version '4.2.0.v201108120515'. 
    [junit] [2014-10-15 03:47:17.105] system-artifacts             <DE0000I> Installing bundle 'org.eclipse.gemini.management' version '1.0.5.RELEASE'. 
    [junit] [2014-10-15 03:47:17.110] system-artifacts             <DE0000I> Installing bundle 'org.eclipse.virgo.management.fragment' version '3.6.3.RELEASE'. 
    [junit] [2014-10-15 03:47:17.265] system-artifacts             <DE0001I> Installed bundle 'osgi.enterprise' version '4.2.0.v201108120515'. 
    [junit] [2014-10-15 03:47:17.266] system-artifacts             <DE0001I> Installed bundle 'org.eclipse.gemini.management' version '1.0.5.RELEASE'. 
    [junit] [2014-10-15 03:47:17.267] system-artifacts             <DE0001I> Installed bundle 'org.eclipse.virgo.management.fragment' version '3.6.3.RELEASE'. 
    [junit] [2014-10-15 03:47:17.269] system-artifacts             <DE0001I> Installed plan 'org.eclipse.virgo.management' version '3.7.0'. 
    [junit] [2014-10-15 03:47:17.291] system-artifacts             <DE0004I> Starting plan 'org.eclipse.virgo.management' version '3.7.0'. 
    [junit] [2014-10-15 03:47:17.293] system-artifacts             <DE0004I> Starting bundle 'osgi.enterprise' version '4.2.0.v201108120515'. 
    [junit] [2014-10-15 03:47:17.299] start-signalling-1           <DE0005I> Started bundle 'osgi.enterprise' version '4.2.0.v201108120515'. 
    [junit] [2014-10-15 03:47:17.300] system-artifacts             <DE0004I> Starting bundle 'org.eclipse.gemini.management' version '1.0.5.RELEASE'. 
    [junit] [2014-10-15 03:47:17.320] start-signalling-1           <DE0005I> Started bundle 'org.eclipse.gemini.management' version '1.0.5.RELEASE'. 
    [junit] [2014-10-15 03:47:17.321] system-artifacts             <DE0005I> Started bundle 'org.eclipse.virgo.management.fragment' version '3.6.3.RELEASE'. 
    [junit] [2014-10-15 03:47:17.323] system-artifacts             <DE0005I> Started plan 'org.eclipse.virgo.management' version '3.7.0'. 
    [junit] [2014-10-15 03:47:17.328] sync Event Dispatcher Thread <UR0001I> User region ready. 
    [junit] [2014-10-15 03:47:17.332] startup-readiness            <KE0007I> Virgo ready. Started for 9.148s. 
    [junit] [2014-10-15 03:47:18.334] fs-watcher                   <HD0001I> Hot deployer processing 'INITIAL' event for file 'org.eclipse.virgo.management.console_3.7.0.D-20140919123907.jar'. 
    [junit] [2014-10-15 03:47:18.456] fs-watcher                   <DE0000I> Installing bundle 'org.eclipse.virgo.management.console' version '3.7.0.D-20140919123907'. 
    [junit] [2014-10-15 03:47:18.532] fs-watcher                   <DE0001I> Installed bundle 'org.eclipse.virgo.management.console' version '3.7.0.D-20140919123907'. 
    [junit] [2014-10-15 03:47:18.540] fs-watcher                   <DE0004I> Starting bundle 'org.eclipse.virgo.management.console' version '3.7.0.D-20140919123907'. 
    [junit] [2014-10-15 03:47:18.636] start-signalling-1           <DE0005I> Started bundle 'org.eclipse.virgo.management.console' version '3.7.0.D-20140919123907'. 
    [junit] ------------- ---------------- ---------------
   [subant] Leaving directory: /jobs/genie.rt.virgo/virgo.packaging.snapshot/workspace/build-packaging/kernel/org.eclipse.virgo.kernel.smoketest

test.post:
    [mkdir] Created dir: /jobs/genie.rt.virgo/virgo.packaging.snapshot/workspace/build-packaging/target/test-results/html
[junitreport] Processing /jobs/genie.rt.virgo/virgo.packaging.snapshot/workspace/build-packaging/TESTS-TestSuites.xml to /tmp/null2052384512
[junitreport] Loading stylesheet jar:file:/shared/common/apache-ant-1.8.4/lib/ant-junit.jar!/org/apache/tools/ant/taskdefs/optional/junit/xsl/junit-frames.xsl
[junitreport] Transform time: 165ms
[junitreport] Deleting: /tmp/null2052384512
   [delete] Deleting: /jobs/genie.rt.virgo/virgo.packaging.snapshot/workspace/build-packaging/TESTS-TestSuites.xml

smoke-test-jetty-server:

test.pre:
   [delete] Deleting directory /jobs/genie.rt.virgo/virgo.packaging.snapshot/workspace/build-packaging/target/test-results
    [mkdir] Created dir: /jobs/genie.rt.virgo/virgo.packaging.snapshot/workspace/build-packaging/target/test-results/xml
   [subant] Entering directory: /jobs/genie.rt.virgo/virgo.packaging.snapshot/workspace/build-packaging/jetty-server/org.eclipse.virgo.jetty.smoketest

test-package:

unzip.package:
   [delete] Deleting directory /jobs/genie.rt.virgo/virgo.packaging.snapshot/workspace/build-packaging/jetty-server/org.eclipse.virgo.jetty.smoketest/target/test-expanded
    [mkdir] Created dir: /jobs/genie.rt.virgo/virgo.packaging.snapshot/workspace/build-packaging/jetty-server/org.eclipse.virgo.jetty.smoketest/target/test-expanded
    [unzip] Expanding: /jobs/genie.rt.virgo/virgo.packaging.snapshot/workspace/build-packaging/target/artifacts/virgo-jetty-server-3.7.0.CI-2014-10-15_03-37-42.zip into /jobs/genie.rt.virgo/virgo.packaging.snapshot/workspace/build-packaging/jetty-server/org.eclipse.virgo.jetty.smoketest/target/test-expanded

startup.pre:
     [copy] Copying 1 file to /jobs/genie.rt.virgo/virgo.packaging.snapshot/workspace/build-packaging/jetty-server/org.eclipse.virgo.jetty.smoketest/target/test-expanded/virgo-jetty-server-3.7.0.CI-2014-10-15_03-37-42/pickup

shutdown:
     [echo] Shutting Down Virgo Server

startup:
     [echo] Starting Up Virgo Server
   [subant] Leaving directory: /jobs/genie.rt.virgo/virgo.packaging.snapshot/workspace/build-packaging/jetty-server/org.eclipse.virgo.jetty.smoketest

BUILD FAILED
/jobs/genie.rt.virgo/virgo.packaging.snapshot/workspace/build-packaging/build.xml:101: The following error occurred while executing this line:
/jobs/genie.rt.virgo/virgo.packaging.snapshot/workspace/build-packaging/jetty-server/build-jetty-server.xml:270: The following error occurred while executing this line:
/jobs/genie.rt.virgo/virgo.packaging.snapshot/workspace/virgo-build/multi-bundle/common.xml:168: The following error occurred while executing this line:
/jobs/genie.rt.virgo/virgo.packaging.snapshot/workspace/build-packaging/jetty-server/test-package.xml:12: The following error occurred while executing this line:
/jobs/genie.rt.virgo/virgo.packaging.snapshot/workspace/build-packaging/jetty-server/test-package.xml:50: Virgo Jetty Server start up failed

Total time: 14 minutes 55 seconds
[locks-and-latches] Releasing all the locks
[locks-and-latches] All the locks released
Recording test results
Archiving artifacts

--
This message is automatically generated by Hudson. 
For more information on Hudson, see: http://hudson-ci.org/


Back to the top