[Date Prev][Date Next][Thread Prev][Thread Next][Date Index][Thread Index] [List Home]
[stp-dev] Build failed in Hudson: stp.toplevel.trunk.jdk5 #100

See <https://build.eclipse.org/hudson/job/stp.toplevel.trunk.jdk5/100/>

------------------------------------------
[...truncated 402 lines...]
     [java] org.eclipse.stp.sca.feature.frascati:eclipse.feature: Trying provider svn(http://dev.eclipse.org/svnroot/stp/org.eclipse.stp.sca-tools/org.eclipse.stp.sca/tags/3.6RC2/features/{0})
     [java] org.eclipse.stp.sca.feature.xmleditors:eclipse.feature: Using resource map <https://build.eclipse.org/hudson/job/stp.toplevel.trunk.jdk5/ws/trunk/stp/stp.rmap>
     [java] org.eclipse.stp.sca.feature.xmleditors:eclipse.feature: Using search path sca.features
     [java] org.eclipse.stp.sca.feature.xmleditors:eclipse.feature: Trying provider local({0}/org.eclipse.stp.sca/features/{1})
     [java] org.eclipse.stp.sca.feature.xmleditors:eclipse.feature: Found match 
     [java] org.eclipse.stp.sca.feature.xmleditors:eclipse.feature: Using provider local({0}/org.eclipse.stp.sca/features/{1})
     [java] org.eclipse.stp.sca.feature.frascati:eclipse.feature: trunk/head will be searched
     [java] org.eclipse.stp.sca.feature.xmleditors:eclipse.feature: Resolution attempt ended with exception: Provider local(<https://build.eclipse.org/hudson/job/stp.toplevel.trunk.jdk5/ws/org.eclipse.stp.sca/features/org.eclipse.stp.sca.feature.xmleditors)>: Missing CSpec source required by component type eclipse.feature
     [java] org.eclipse.stp.sca.feature.xmleditors:eclipse.feature: Trying provider svn(http://dev.eclipse.org/svnroot/stp/org.eclipse.stp.sca-tools/org.eclipse.stp.sca/tags/3.6RC2/features/{0})
     [java] org.eclipse.stp.im.runtime.feature:eclipse.feature: trunk/head will be searched
     [java] org.eclipse.stp.sca.feature.xmleditors:eclipse.feature: trunk/head will be searched
     [java] Obtaining remote folder http://dev.eclipse.org/svnroot/stp/org.eclipse.stp.intermediate-model/org.eclipse.stp.model/tags/3.6RC2/features/org.eclipse.stp.im.bpmn.feature[HEAD]
     [java] org.eclipse.stp.im.bpmn.feature:eclipse.feature: Rejecting provider svn(http://dev.eclipse.org/svnroot/stp/org.eclipse.stp.intermediate-model/org.eclipse.stp.model/tags/3.6RC2/features/{0}): No component match was found
     [java] org.eclipse.stp.im.bpmn.feature:eclipse.feature: No provider was found that could resolve the request
     [java] ERROR   [0002] : No suitable provider for component org.eclipse.stp.im.bpmn.feature:eclipse.feature was found in resourceMap <https://build.eclipse.org/hudson/job/stp.toplevel.trunk.jdk5/ws/trunk/stp/stp.rmap>
     [java]   ERROR   [0002] : No suitable provider for component org.eclipse.stp.im.bpmn.feature:eclipse.feature was found in searchPath im.features
     [java]     ERROR   [0002] : Resolution attempt ended with exception: Provider local(<https://build.eclipse.org/hudson/job/stp.toplevel.trunk.jdk5/ws/org.eclipse.stp.model/features/org.eclipse.stp.im.bpmn.feature)>: Missing CSpec source required by component type eclipse.feature
     [java]       ERROR   Provider local(<https://build.eclipse.org/hudson/job/stp.toplevel.trunk.jdk5/ws/org.eclipse.stp.model/features/org.eclipse.stp.im.bpmn.feature)>: Missing CSpec source required by component type eclipse.feature
     [java]     ERROR   [0002] : Rejecting provider svn(http://dev.eclipse.org/svnroot/stp/org.eclipse.stp.intermediate-model/org.eclipse.stp.model/tags/3.6RC2/features/{0}): No component match was found
     [java]       ERROR   org.tigris.subversion.svnclientadapter.SVNClientException: org.tigris.subversion.javahl.ClientException: svn: Malformed XML
     [java] org.eclipse.stp.im.sca.feature:eclipse.feature: Using resource map <https://build.eclipse.org/hudson/job/stp.toplevel.trunk.jdk5/ws/trunk/stp/stp.rmap>
     [java] org.eclipse.stp.im.sca.feature:eclipse.feature: Using search path im.features
     [java] org.eclipse.stp.im.sca.feature:eclipse.feature: Trying provider local({0}/org.eclipse.stp.model/features/{1})
     [java] org.eclipse.stp.im.sca.feature:eclipse.feature: Found match 
     [java] org.eclipse.stp.im.sca.feature:eclipse.feature: Using provider local({0}/org.eclipse.stp.model/features/{1})
     [java] org.eclipse.stp.im.sca.feature:eclipse.feature: Resolution attempt ended with exception: Provider local(<https://build.eclipse.org/hudson/job/stp.toplevel.trunk.jdk5/ws/org.eclipse.stp.model/features/org.eclipse.stp.im.sca.feature)>: Missing CSpec source required by component type eclipse.feature
     [java] org.eclipse.stp.im.sca.feature:eclipse.feature: Trying provider svn(http://dev.eclipse.org/svnroot/stp/org.eclipse.stp.intermediate-model/org.eclipse.stp.model/tags/3.6RC2/features/{0})
     [java] ERROR   [0002] : No suitable provider for component org.eclipse.stp.sca.feature.xmleditors:eclipse.feature was found in resourceMap <https://build.eclipse.org/hudson/job/stp.toplevel.trunk.jdk5/ws/trunk/stp/stp.rmap>
     [java]   ERROR   [0002] : No suitable provider for component org.eclipse.stp.sca.feature.xmleditors:eclipse.feature was found in searchPath sca.features
     [java]     ERROR   [0002] : Resolution attempt ended with exception: Provider local(<https://build.eclipse.org/hudson/job/stp.toplevel.trunk.jdk5/ws/org.eclipse.stp.sca/features/org.eclipse.stp.sca.feature.xmleditors)>: Missing CSpec source required by component type eclipse.feature
     [java]       ERROR   Provider local(<https://build.eclipse.org/hudson/job/stp.toplevel.trunk.jdk5/ws/org.eclipse.stp.sca/features/org.eclipse.stp.sca.feature.xmleditors)>: Missing CSpec source required by component type eclipse.feature
     [java]     ERROR   [0002] : Rejecting provider svn(http://dev.eclipse.org/svnroot/stp/org.eclipse.stp.sca-tools/org.eclipse.stp.sca/tags/3.6RC2/features/{0}): No component match was found
     [java]       ERROR   org.tigris.subversion.svnclientadapter.SVNClientException: org.tigris.subversion.javahl.ClientException: svn: Malformed XML
     [java] Obtaining remote folder http://dev.eclipse.org/svnroot/stp/org.eclipse.stp.sca-tools/org.eclipse.stp.sca/tags/3.6RC2/features/org.eclipse.stp.sca.feature.xmleditors[HEAD]
     [java] org.eclipse.stp.sca.feature.xmleditors:eclipse.feature: Rejecting provider svn(http://dev.eclipse.org/svnroot/stp/org.eclipse.stp.sca-tools/org.eclipse.stp.sca/tags/3.6RC2/features/{0}): No component match was found
     [java] org.eclipse.stp.sca.feature.xmleditors:eclipse.feature: No provider was found that could resolve the request
     [java] Obtaining remote folder http://dev.eclipse.org/svnroot/stp/org.eclipse.stp.intermediate-model/org.eclipse.stp.model/tags/3.6RC2/features/org.eclipse.stp.im.runtime.feature[HEAD]
     [java] org.eclipse.stp.im.sca.feature:eclipse.feature: trunk/head will be searched
     [java] org.eclipse.stp.im.runtime.feature:eclipse.feature: Rejecting provider svn(http://dev.eclipse.org/svnroot/stp/org.eclipse.stp.intermediate-model/org.eclipse.stp.model/tags/3.6RC2/features/{0}): No component match was found
     [java] org.eclipse.stp.im.runtime.feature:eclipse.feature: No provider was found that could resolve the request
     [java] ERROR   [0002] : No suitable provider for component org.eclipse.stp.im.runtime.feature:eclipse.feature was found in resourceMap <https://build.eclipse.org/hudson/job/stp.toplevel.trunk.jdk5/ws/trunk/stp/stp.rmap>
     [java]   ERROR   [0002] : No suitable provider for component org.eclipse.stp.im.runtime.feature:eclipse.feature was found in searchPath im.features
     [java]     ERROR   [0002] : Resolution attempt ended with exception: Provider local(<https://build.eclipse.org/hudson/job/stp.toplevel.trunk.jdk5/ws/org.eclipse.stp.model/features/org.eclipse.stp.im.runtime.feature)>: Missing CSpec source required by component type eclipse.feature
     [java]       ERROR   Provider local(<https://build.eclipse.org/hudson/job/stp.toplevel.trunk.jdk5/ws/org.eclipse.stp.model/features/org.eclipse.stp.im.runtime.feature)>: Missing CSpec source required by component type eclipse.feature
     [java]     ERROR   [0002] : Rejecting provider svn(http://dev.eclipse.org/svnroot/stp/org.eclipse.stp.intermediate-model/org.eclipse.stp.model/tags/3.6RC2/features/{0}): No component match was found
     [java]       ERROR   org.tigris.subversion.svnclientadapter.SVNClientException: org.tigris.subversion.javahl.ClientException: svn: Malformed XML
     [java] org.eclipse.stp.branding:osgi.bundle: Using resource map <https://build.eclipse.org/hudson/job/stp.toplevel.trunk.jdk5/ws/trunk/stp/stp.rmap>
     [java] org.eclipse.stp.branding:osgi.bundle: Using search path stp.toplevel
     [java] org.eclipse.stp.branding:osgi.bundle: Trying provider local({0}/{1})
     [java] org.eclipse.stp.branding:osgi.bundle: Found match 
     [java] org.eclipse.stp.branding:osgi.bundle: Using provider local({0}/{1})
     [java] Obtaining remote folder http://dev.eclipse.org/svnroot/stp/org.eclipse.stp.sca-tools/org.eclipse.stp.sca/tags/3.6RC2/features/org.eclipse.stp.sca.feature.frascati[HEAD]
     [java] org.eclipse.stp.sca.feature.frascati:eclipse.feature: Rejecting provider svn(http://dev.eclipse.org/svnroot/stp/org.eclipse.stp.sca-tools/org.eclipse.stp.sca/tags/3.6RC2/features/{0}): No component match was found
     [java] org.eclipse.stp.sca.feature.frascati:eclipse.feature: No provider was found that could resolve the request
     [java] ERROR   [0002] : No suitable provider for component org.eclipse.stp.sca.feature.frascati:eclipse.feature was found in resourceMap <https://build.eclipse.org/hudson/job/stp.toplevel.trunk.jdk5/ws/trunk/stp/stp.rmap>
     [java]   ERROR   [0002] : No suitable provider for component org.eclipse.stp.sca.feature.frascati:eclipse.feature was found in searchPath sca.features
     [java]     ERROR   [0002] : Resolution attempt ended with exception: Provider local(<https://build.eclipse.org/hudson/job/stp.toplevel.trunk.jdk5/ws/org.eclipse.stp.sca/features/org.eclipse.stp.sca.feature.frascati)>: Missing CSpec source required by component type eclipse.feature
     [java]       ERROR   Provider local(<https://build.eclipse.org/hudson/job/stp.toplevel.trunk.jdk5/ws/org.eclipse.stp.sca/features/org.eclipse.stp.sca.feature.frascati)>: Missing CSpec source required by component type eclipse.feature
     [java]     ERROR   [0002] : Rejecting provider svn(http://dev.eclipse.org/svnroot/stp/org.eclipse.stp.sca-tools/org.eclipse.stp.sca/tags/3.6RC2/features/{0}): No component match was found
     [java]       ERROR   org.tigris.subversion.svnclientadapter.SVNClientException: org.tigris.subversion.javahl.ClientException: svn: Malformed XML
     [java] Obtaining remote folder http://dev.eclipse.org/svnroot/stp/org.eclipse.stp.intermediate-model/org.eclipse.stp.model/tags/3.6RC2/features/org.eclipse.stp.im.sca.feature[HEAD]
     [java] org.eclipse.stp.im.sca.feature:eclipse.feature: Rejecting provider svn(http://dev.eclipse.org/svnroot/stp/org.eclipse.stp.intermediate-model/org.eclipse.stp.model/tags/3.6RC2/features/{0}): No component match was found
     [java] org.eclipse.stp.im.sca.feature:eclipse.feature: No provider was found that could resolve the request
     [java] ERROR   [0002] : No suitable provider for component org.eclipse.stp.im.sca.feature:eclipse.feature was found in resourceMap <https://build.eclipse.org/hudson/job/stp.toplevel.trunk.jdk5/ws/trunk/stp/stp.rmap>
     [java]   ERROR   [0002] : No suitable provider for component org.eclipse.stp.im.sca.feature:eclipse.feature was found in searchPath im.features
     [java]     ERROR   [0002] : Resolution attempt ended with exception: Provider local(<https://build.eclipse.org/hudson/job/stp.toplevel.trunk.jdk5/ws/org.eclipse.stp.model/features/org.eclipse.stp.im.sca.feature)>: Missing CSpec source required by component type eclipse.feature
     [java]       ERROR   Provider local(<https://build.eclipse.org/hudson/job/stp.toplevel.trunk.jdk5/ws/org.eclipse.stp.model/features/org.eclipse.stp.im.sca.feature)>: Missing CSpec source required by component type eclipse.feature
     [java]     ERROR   [0002] : Rejecting provider svn(http://dev.eclipse.org/svnroot/stp/org.eclipse.stp.intermediate-model/org.eclipse.stp.model/tags/3.6RC2/features/{0}): No component match was found
     [java]       ERROR   org.tigris.subversion.svnclientadapter.SVNClientException: org.tigris.subversion.javahl.ClientException: svn: Malformed XML
     [java] org.eclipse.core.runtime:osgi.bundle/3.4.0#OSGi: Found match 3.6.0.v20091204#OSGi
     [java] org.eclipse.ui:osgi.bundle/3.4.1#OSGi: Found match 3.6.0.I20100127-1800#OSGi
     [java] org.eclipse.ui.workbench:osgi.bundle/[3.5.0,4.0.0)#OSGi: Found match 3.6.0.I20100127-1800#OSGi
     [java] org.eclipse.jface:osgi.bundle/[3.5.0,4.0.0)#OSGi: Found match 3.6.0.I20100122-0800#OSGi
     [java] org.eclipse.swt:osgi.bundle/[3.5.0,4.0.0)#OSGi: Found match 3.6.0.v3631#OSGi
     [java] org.eclipse.core.expressions:osgi.bundle/[3.4.0,4.0.0)#OSGi: Found match 3.4.100.v20091203#OSGi
     [java] org.eclipse.osgi:osgi.bundle: Found match 3.6.0.v20100128-1430#OSGi
     [java] org.eclipse.equinox.preferences:osgi.bundle/[3.3.0,4.0.0)#OSGi: Found match 3.3.0.v20100121#OSGi
     [java] org.eclipse.equinox.app:osgi.bundle/[1.0.0,2.0.0)#OSGi: Found match 1.3.0.v20100108#OSGi
     [java] org.eclipse.equinox.common:osgi.bundle/[3.5.0,4.0.0)#OSGi: Found match 3.6.0.v20100125#OSGi
     [java] org.eclipse.core.contenttype:osgi.bundle/[3.3.0,4.0.0)#OSGi: Found match 3.4.100.v20091109#OSGi
     [java] org.eclipse.equinox.registry:osgi.bundle/[3.4.0,4.0.0)#OSGi: Found match 3.5.0.v20091203#OSGi
     [java] org.eclipse.core.jobs:osgi.bundle/[3.2.0,4.0.0)#OSGi: Found match 3.5.0.v20091221#OSGi
     [java] org.eclipse.core.commands:osgi.bundle/[3.4.0,4.0.0)#OSGi: Found match 3.6.0.I20100122-0800#OSGi
     [java] org.eclipse.help:osgi.bundle/[3.2.0,4.0.0)#OSGi: Found match 3.5.0.v20100120#OSGi
     [java] org.eclipse.core.databinding.observable:osgi.bundle/[1.2.0,2.0.0)#OSGi: Found match 1.3.0.I20090901-0800#OSGi
     [java] org.eclipse.jface.databinding:osgi.bundle/[1.3.0,2.0.0)#OSGi: Found match 1.4.0.I20100125-1345#OSGi
     [java] org.eclipse.core.databinding.property:osgi.bundle/[1.2.0,2.0.0)#OSGi: Found match 1.2.100.I20100119-0800#OSGi
     [java] org.eclipse.core.databinding:osgi.bundle/[1.2.0,2.0.0)#OSGi: Found match 1.3.0.I20100125-1345#OSGi
     [java] INFO:  TAG-ID 0002 = Query for org.eclipse.stp.toplevel.feature:eclipse.feature, path: org.eclipse.stp.toplevel.feature:eclipse.feature$2.1.0.qualifier#OSGi
     [java] 
     [java] ERROR: Attempt to use an unresolved node. Request is org.eclipse.stp.sca.feature.tuscany:eclipse.feature
     [java] org.eclipse.buckminster.core.metadata.model.UnresolvedNodeException: Attempt to use an unresolved node. Request is org.eclipse.stp.sca.feature.tuscany:eclipse.feature
     [java] 	at org.eclipse.buckminster.core.metadata.model.UnresolvedNode.addMaterializationCandidates(UnresolvedNode.java:102)
     [java] 	at org.eclipse.buckminster.core.metadata.model.ResolvedNode.addMaterializationCandidates(ResolvedNode.java:252)
     [java] 	at org.eclipse.buckminster.core.metadata.model.BillOfMaterials.addMaterializationCandidates(BillOfMaterials.java:187)
     [java] 	at org.eclipse.buckminster.core.metadata.model.BillOfMaterials.findMaterializationCandidates(BillOfMaterials.java:228)
     [java] 	at org.eclipse.buckminster.core.materializer.MaterializationJob.prepareJobs(MaterializationJob.java:198)
     [java] 	at org.eclipse.buckminster.core.materializer.MaterializationJob.internalRun(MaterializationJob.java:167)
     [java] 	at org.eclipse.buckminster.core.materializer.MaterializationJob.run(MaterializationJob.java:144)
     [java] 	at org.eclipse.core.internal.jobs.Worker.run(Worker.java:55)
     [java] INFO:  Import complete.
     [java] Doing full workspace refresh
     [java] Waiting for jobs to end
     [java] Executing '/opt/ibm/ibm-java2-ppc-50/jre/bin/java' with arguments:
     [java] '-Djava.io.tmpdir=<https://build.eclipse.org/hudson/job/stp.toplevel.trunk.jdk5/ws/100_2959/working/temp'>
     [java] '-Dproject.source=<https://build.eclipse.org/hudson/job/stp.toplevel.trunk.jdk5/ws/trunk/'>
     [java] '-Dproject.build=<https://build.eclipse.org/hudson/job/stp.toplevel.trunk.jdk5/ws/trunk/stp/'>
     [java] '-Dproject.repo='
     [java] '-Dproject.root=<https://build.eclipse.org/hudson/job/stp.toplevel.trunk.jdk5/ws/'>
     [java] '-Dproject.component='
     [java] '-Dproject.tag=trunk'
     [java] '-jar'
     [java] '/shared/stp/platforms/buckminster/3.5/buckminster/plugins/org.eclipse.equinox.launcher_1.0.200.v20090429-1630.jar'
     [java] '-data'
     [java] '<https://build.eclipse.org/hudson/job/stp.toplevel.trunk.jdk5/ws/100_2959/working/build/workspace'>
     [java] '--displaystacktrace'
     [java] '--loglevel'
     [java] 'DEBUG'
     [java] 'org.eclipse.buckminster.core.build'
     [java] 
     [java] The ' characters around the executable and arguments are
     [java] not part of the command.
     [java] org.eclipse.buckminster.core.build
     [java] Doing full workspace refresh
     [java] Waiting for jobs to end
     [java] Executing '/opt/ibm/ibm-java2-ppc-50/jre/bin/java' with arguments:
     [java] '-Djava.io.tmpdir=<https://build.eclipse.org/hudson/job/stp.toplevel.trunk.jdk5/ws/100_2959/working/temp'>
     [java] '-Dproject.source=<https://build.eclipse.org/hudson/job/stp.toplevel.trunk.jdk5/ws/trunk/'>
     [java] '-Dproject.build=<https://build.eclipse.org/hudson/job/stp.toplevel.trunk.jdk5/ws/trunk/stp/'>
     [java] '-Dproject.repo='
     [java] '-Dproject.root=<https://build.eclipse.org/hudson/job/stp.toplevel.trunk.jdk5/ws/'>
     [java] '-Dproject.component='
     [java] '-Dproject.tag=trunk'
     [java] '-jar'
     [java] '/shared/stp/platforms/buckminster/3.5/buckminster/plugins/org.eclipse.equinox.launcher_1.0.200.v20090429-1630.jar'
     [java] '-data'
     [java] '<https://build.eclipse.org/hudson/job/stp.toplevel.trunk.jdk5/ws/100_2959/working/build/workspace'>
     [java] '--displaystacktrace'
     [java] '--loglevel'
     [java] 'DEBUG'
     [java] 'org.eclipse.buckminster.core.perform'
     [java] '-Dbuckminster.output.root=<https://build.eclipse.org/hudson/job/stp.toplevel.trunk.jdk5/ws/100_2959/stp.site'>
     [java] '-Dsite.pack200=true'
     [java] '-Dcbi.include.source=false'
     [java] '-Dsite.signing=false'
     [java] 'org.eclipse.stp.toplevel.feature#site.p2.zip'
     [java] 
     [java] The ' characters around the executable and arguments are
     [java] not part of the command.
     [java] org.eclipse.buckminster.core.perform '-Dbuckminster.output.root=<https://build.eclipse.org/hudson/job/stp.toplevel.trunk.jdk5/ws/100_2959/stp.site'> '-Dsite.pack200=true' '-Dcbi.include.source=false' '-Dsite.signing=false' 'org.eclipse.stp.toplevel.feature#site.p2.zip'
     [java] Platform install location: /opt/public/stp/platforms/buckminster/3.5/buckminster
     [java] Target platform provided by class org.eclipse.buckminster.pde.internal.PDETargetPlatform
     [java] org.eclipse.stp.toplevel.feature: Using resolver rmap
     [java] org.eclipse.buckminster.core.metadata.MissingComponentException: No component named org.eclipse.stp.toplevel.feature is known to Buckminster
     [java] 	at org.eclipse.buckminster.core.metadata.WorkspaceInfo.getResolution(WorkspaceInfo.java:433)
     [java] 	at org.eclipse.buckminster.core.commands.Perform.handleUnparsed(Perform.java:186)
     [java] 	at org.eclipse.buckminster.cmdline.AbstractCommand.parseOptions(AbstractCommand.java:182)
     [java] 	at org.eclipse.buckminster.cmdline.AbstractCommand.basicRun(AbstractCommand.java:149)
     [java] 	at org.eclipse.buckminster.cmdline.Headless.run(Headless.java:341)
     [java] 	at org.eclipse.buckminster.cmdline.Headless.run(Headless.java:135)
     [java] 	at org.eclipse.buckminster.cmdline.Headless.start(Headless.java:189)
     [java] 	at org.eclipse.equinox.internal.app.EclipseAppHandle.run(EclipseAppHandle.java:194)
     [java] 	at org.eclipse.core.runtime.internal.adaptor.EclipseAppLauncher.runApplication(EclipseAppLauncher.java:110)
     [java] 	at org.eclipse.core.runtime.internal.adaptor.EclipseAppLauncher.start(EclipseAppLauncher.java:79)
     [java] 	at org.eclipse.core.runtime.adaptor.EclipseStarter.run(EclipseStarter.java:368)
     [java] 	at org.eclipse.core.runtime.adaptor.EclipseStarter.run(EclipseStarter.java:179)
     [java] 	at sun.reflect.NativeMethodAccessorImpl.invoke0(Native Method)
     [java] 	at sun.reflect.NativeMethodAccessorImpl.invoke(NativeMethodAccessorImpl.java:79)
     [java] 	at sun.reflect.DelegatingMethodAccessorImpl.invoke(DelegatingMethodAccessorImpl.java:43)
     [java] 	at java.lang.reflect.Method.invoke(Method.java:618)
     [java] 	at org.eclipse.equinox.launcher.Main.invokeFramework(Main.java:559)
     [java] 	at org.eclipse.equinox.launcher.Main.basicRun(Main.java:514)
     [java] 	at org.eclipse.equinox.launcher.Main.run(Main.java:1311)
     [java] 	at org.eclipse.equinox.launcher.Main.main(Main.java:1287)
     [java] No component named org.eclipse.stp.toplevel.feature is known to Buckminster

BUILD FAILED
<https://build.eclipse.org/hudson/job/stp.toplevel.trunk.jdk5/ws/trunk/shared/build.xml>:37: The following error occurred while executing this line:
<https://build.eclipse.org/hudson/job/stp.toplevel.trunk.jdk5/ws/trunk/buckminster/buckminster.xml>:18: Java returned: 1
	at org.apache.tools.ant.ProjectHelper.addLocationToBuildException(ProjectHelper.java:508)
	at org.apache.tools.ant.taskdefs.MacroInstance.execute(MacroInstance.java:397)
	at org.apache.tools.ant.UnknownElement.execute(UnknownElement.java:288)
	at sun.reflect.GeneratedMethodAccessor3.invoke(Unknown Source)
	at sun.reflect.DelegatingMethodAccessorImpl.invoke(DelegatingMethodAccessorImpl.java:43)
	at java.lang.reflect.Method.invoke(Method.java:618)
	at org.apache.tools.ant.dispatch.DispatchUtils.execute(DispatchUtils.java:106)
	at org.apache.tools.ant.Task.perform(Task.java:348)
	at org.apache.tools.ant.Target.execute(Target.java:357)
	at org.apache.tools.ant.Target.performTasks(Target.java:385)
	at org.apache.tools.ant.Project.executeSortedTargets(Project.java:1337)
	at org.apache.tools.ant.Project.executeTarget(Project.java:1306)
	at org.apache.tools.ant.helper.DefaultExecutor.executeTargets(DefaultExecutor.java:41)
	at org.apache.tools.ant.Project.executeTargets(Project.java:1189)
	at org.apache.tools.ant.Main.runBuild(Main.java:758)
	at org.apache.tools.ant.Main.startAnt(Main.java:217)
	at org.apache.tools.ant.launch.Launcher.run(Launcher.java:257)
	at org.apache.tools.ant.launch.Launcher.main(Launcher.java:104)
Caused by: <https://build.eclipse.org/hudson/job/stp.toplevel.trunk.jdk5/ws/trunk/buckminster/buckminster.xml>:18: Java returned: 1
	at org.apache.tools.ant.taskdefs.Java.execute(Java.java:108)
	at org.apache.tools.ant.UnknownElement.execute(UnknownElement.java:288)
	at sun.reflect.GeneratedMethodAccessor3.invoke(Unknown Source)
	at sun.reflect.DelegatingMethodAccessorImpl.invoke(DelegatingMethodAccessorImpl.java:43)
	at java.lang.reflect.Method.invoke(Method.java:618)
	at org.apache.tools.ant.dispatch.DispatchUtils.execute(DispatchUtils.java:106)
	at org.apache.tools.ant.Task.perform(Task.java:348)
	at org.apache.tools.ant.taskdefs.Sequential.execute(Sequential.java:62)
	at org.apache.tools.ant.UnknownElement.execute(UnknownElement.java:288)
	at sun.reflect.GeneratedMethodAccessor3.invoke(Unknown Source)
	at sun.reflect.DelegatingMethodAccessorImpl.invoke(DelegatingMethodAccessorImpl.java:43)
	at java.lang.reflect.Method.invoke(Method.java:618)
	at org.apache.tools.ant.dispatch.DispatchUtils.execute(DispatchUtils.java:106)
	at org.apache.tools.ant.Task.perform(Task.java:348)
	at org.apache.tools.ant.taskdefs.MacroInstance.execute(MacroInstance.java:394)
	... 16 more
--- Nested Exception ---
<https://build.eclipse.org/hudson/job/stp.toplevel.trunk.jdk5/ws/trunk/buckminster/buckminster.xml>:18: Java returned: 1
	at org.apache.tools.ant.taskdefs.Java.execute(Java.java:108)
	at org.apache.tools.ant.UnknownElement.execute(UnknownElement.java:288)
	at sun.reflect.GeneratedMethodAccessor3.invoke(Unknown Source)
	at sun.reflect.DelegatingMethodAccessorImpl.invoke(DelegatingMethodAccessorImpl.java:43)
	at java.lang.reflect.Method.invoke(Method.java:618)
	at org.apache.tools.ant.dispatch.DispatchUtils.execute(DispatchUtils.java:106)
	at org.apache.tools.ant.Task.perform(Task.java:348)
	at org.apache.tools.ant.taskdefs.Sequential.execute(Sequential.java:62)
	at org.apache.tools.ant.UnknownElement.execute(UnknownElement.java:288)
	at sun.reflect.GeneratedMethodAccessor3.invoke(Unknown Source)
	at sun.reflect.DelegatingMethodAccessorImpl.invoke(DelegatingMethodAccessorImpl.java:43)
	at java.lang.reflect.Method.invoke(Method.java:618)
	at org.apache.tools.ant.dispatch.DispatchUtils.execute(DispatchUtils.java:106)
	at org.apache.tools.ant.Task.perform(Task.java:348)
	at org.apache.tools.ant.taskdefs.MacroInstance.execute(MacroInstance.java:394)
	at org.apache.tools.ant.UnknownElement.execute(UnknownElement.java:288)
	at sun.reflect.GeneratedMethodAccessor3.invoke(Unknown Source)
	at sun.reflect.DelegatingMethodAccessorImpl.invoke(DelegatingMethodAccessorImpl.java:43)
	at java.lang.reflect.Method.invoke(Method.java:618)
	at org.apache.tools.ant.dispatch.DispatchUtils.execute(DispatchUtils.java:106)
	at org.apache.tools.ant.Task.perform(Task.java:348)
	at org.apache.tools.ant.Target.execute(Target.java:357)
	at org.apache.tools.ant.Target.performTasks(Target.java:385)
	at org.apache.tools.ant.Project.executeSortedTargets(Project.java:1337)
	at org.apache.tools.ant.Project.executeTarget(Project.java:1306)
	at org.apache.tools.ant.helper.DefaultExecutor.executeTargets(DefaultExecutor.java:41)
	at org.apache.tools.ant.Project.executeTargets(Project.java:1189)
	at org.apache.tools.ant.Main.runBuild(Main.java:758)
	at org.apache.tools.ant.Main.startAnt(Main.java:217)
	at org.apache.tools.ant.launch.Launcher.run(Launcher.java:257)
	at org.apache.tools.ant.launch.Launcher.main(Launcher.java:104)

Total time: 1 minute 51 seconds