[Date Prev][Date Next][Thread Prev][Thread Next][Date Index][Thread Index] [List Home]
[rdf4j-dev] Build failed in Jenkins: rdf4j-storage-master-verify #62

See <https://ci.eclipse.org/rdf4j/job/rdf4j-storage-master-verify/62/display/redirect>

------------------------------------------
[...truncated 1.35 MB...]
	at org.junit.runners.model.FrameworkMethod$1.runReflectiveCall(FrameworkMethod.java:50) [junit-4.12.jar:4.12]
	at org.junit.internal.runners.model.ReflectiveCallable.run(ReflectiveCallable.java:12) [junit-4.12.jar:4.12]
	at org.junit.runners.model.FrameworkMethod.invokeExplosively(FrameworkMethod.java:47) [junit-4.12.jar:4.12]
	at org.junit.internal.runners.statements.InvokeMethod.evaluate(InvokeMethod.java:17) [junit-4.12.jar:4.12]
	at org.junit.runners.ParentRunner.runLeaf(ParentRunner.java:325) [junit-4.12.jar:4.12]
	at org.junit.runners.BlockJUnit4ClassRunner.runChild(BlockJUnit4ClassRunner.java:78) [junit-4.12.jar:4.12]
	at org.junit.runners.BlockJUnit4ClassRunner.runChild(BlockJUnit4ClassRunner.java:57) [junit-4.12.jar:4.12]
	at org.junit.runners.ParentRunner$3.run(ParentRunner.java:290) [junit-4.12.jar:4.12]
	at org.junit.runners.ParentRunner$1.schedule(ParentRunner.java:71) [junit-4.12.jar:4.12]
	at org.junit.runners.ParentRunner.runChildren(ParentRunner.java:288) [junit-4.12.jar:4.12]
	at org.junit.runners.ParentRunner.access$000(ParentRunner.java:58) [junit-4.12.jar:4.12]
	at org.junit.runners.ParentRunner$2.evaluate(ParentRunner.java:268) [junit-4.12.jar:4.12]
	at org.junit.internal.runners.statements.RunBefores.evaluate(RunBefores.java:26) [junit-4.12.jar:4.12]
	at org.junit.runners.ParentRunner.run(ParentRunner.java:363) [junit-4.12.jar:4.12]
	at org.apache.maven.surefire.junit4.JUnit4Provider.execute(JUnit4Provider.java:367) [surefire-junit4-2.19.1.jar:2.19.1]
	at org.apache.maven.surefire.junit4.JUnit4Provider.executeWithRerun(JUnit4Provider.java:274) [surefire-junit4-2.19.1.jar:2.19.1]
	at org.apache.maven.surefire.junit4.JUnit4Provider.executeTestSet(JUnit4Provider.java:238) [surefire-junit4-2.19.1.jar:2.19.1]
	at org.apache.maven.surefire.junit4.JUnit4Provider.invoke(JUnit4Provider.java:161) [surefire-junit4-2.19.1.jar:2.19.1]
	at org.apache.maven.surefire.booter.ForkedBooter.invokeProviderInSameClassLoader(ForkedBooter.java:290) [surefire-booter-2.19.1.jar:2.19.1]
	at org.apache.maven.surefire.booter.ForkedBooter.runSuitesInProcess(ForkedBooter.java:242) [surefire-booter-2.19.1.jar:2.19.1]
	at org.apache.maven.surefire.booter.ForkedBooter.main(ForkedBooter.java:121) [surefire-booter-2.19.1.jar:2.19.1]
08:41:22.074 [main] ERROR exception while uploading input data
java.lang.ClassCastException: org.eclipse.rdf4j.sail.memory.model.MemLiteral cannot be cast to org.eclipse.rdf4j.model.Resource
	at org.eclipse.rdf4j.sail.inferencer.fc.SchemaCachingRDFSInferencer.addSubClassOfStatement(SchemaCachingRDFSInferencer.java:385) ~[rdf4j-storage-2.4-SNAPSHOT.jar:2.4-SNAPSHOT+4e84313]
	at org.eclipse.rdf4j.sail.inferencer.fc.SchemaCachingRDFSInferencerConnection.processForSchemaCache(SchemaCachingRDFSInferencerConnection.java:74) ~[rdf4j-storage-2.4-SNAPSHOT.jar:2.4-SNAPSHOT+4e84313]
	at org.eclipse.rdf4j.sail.inferencer.fc.SchemaCachingRDFSInferencerConnection.addStatement(SchemaCachingRDFSInferencerConnection.java:194) ~[rdf4j-storage-2.4-SNAPSHOT.jar:2.4-SNAPSHOT+4e84313]
	at org.eclipse.rdf4j.sail.inferencer.fc.SchemaCachingRDFSInferencerConnection.addStatement(SchemaCachingRDFSInferencerConnection.java:184) ~[rdf4j-storage-2.4-SNAPSHOT.jar:2.4-SNAPSHOT+4e84313]
	at org.eclipse.rdf4j.repository.sail.SailRepositoryConnection.addWithoutCommit(SailRepositoryConnection.java:363) ~[rdf4j-storage-2.4-SNAPSHOT.jar:2.4-SNAPSHOT+4e84313]
	at org.eclipse.rdf4j.repository.base.AbstractRepositoryConnection.add(AbstractRepositoryConnection.java:509) ~[rdf4j-client-2.4-SNAPSHOT.jar:2.4-SNAPSHOT+ef0d080]
	at org.eclipse.rdf4j.repository.util.RDFInserter.addStatement(RDFInserter.java:69) ~[rdf4j-client-2.4-SNAPSHOT.jar:2.4-SNAPSHOT+ef0d080]
	at org.eclipse.rdf4j.repository.util.AbstractRDFInserter.handleStatement(AbstractRDFInserter.java:190) ~[rdf4j-client-2.4-SNAPSHOT.jar:2.4-SNAPSHOT+ef0d080]
	at org.eclipse.rdf4j.rio.ntriples.NTriplesParser.parseTriple(NTriplesParser.java:324) ~[rdf4j-client-2.4-SNAPSHOT.jar:2.4-SNAPSHOT+ef0d080]
	at org.eclipse.rdf4j.rio.ntriples.NTriplesParser.parse(NTriplesParser.java:179) ~[rdf4j-client-2.4-SNAPSHOT.jar:2.4-SNAPSHOT+ef0d080]
	at org.eclipse.rdf4j.rio.ntriples.NTriplesParser.parse(NTriplesParser.java:118) ~[rdf4j-client-2.4-SNAPSHOT.jar:2.4-SNAPSHOT+ef0d080]
	at org.eclipse.rdf4j.repository.util.RDFLoader.loadInputStreamOrReader(RDFLoader.java:286) ~[rdf4j-client-2.4-SNAPSHOT.jar:2.4-SNAPSHOT+ef0d080]
	at org.eclipse.rdf4j.repository.util.RDFLoader.load(RDFLoader.java:197) ~[rdf4j-client-2.4-SNAPSHOT.jar:2.4-SNAPSHOT+ef0d080]
	at org.eclipse.rdf4j.repository.base.AbstractRepositoryConnection.add(AbstractRepositoryConnection.java:329) ~[rdf4j-client-2.4-SNAPSHOT.jar:2.4-SNAPSHOT+ef0d080]
	at org.eclipse.rdf4j.sail.InferencingTest.runTest(InferencingTest.java:81) [rdf4j-store-testsuite-2.4-SNAPSHOT.jar:2.4-SNAPSHOT+041aace]
	at org.eclipse.rdf4j.sail.InferencingTest.testSubClassOfError001(InferencingTest.java:194) [rdf4j-store-testsuite-2.4-SNAPSHOT.jar:2.4-SNAPSHOT+041aace]
	at sun.reflect.NativeMethodAccessorImpl.invoke0(Native Method) ~[na:1.8.0_162]
	at sun.reflect.NativeMethodAccessorImpl.invoke(NativeMethodAccessorImpl.java:62) ~[na:1.8.0_162]
	at sun.reflect.DelegatingMethodAccessorImpl.invoke(DelegatingMethodAccessorImpl.java:43) ~[na:1.8.0_162]
	at java.lang.reflect.Method.invoke(Method.java:498) ~[na:1.8.0_162]
	at org.junit.runners.model.FrameworkMethod$1.runReflectiveCall(FrameworkMethod.java:50) [junit-4.12.jar:4.12]
	at org.junit.internal.runners.model.ReflectiveCallable.run(ReflectiveCallable.java:12) [junit-4.12.jar:4.12]
	at org.junit.runners.model.FrameworkMethod.invokeExplosively(FrameworkMethod.java:47) [junit-4.12.jar:4.12]
	at org.junit.internal.runners.statements.InvokeMethod.evaluate(InvokeMethod.java:17) [junit-4.12.jar:4.12]
	at org.junit.runners.ParentRunner.runLeaf(ParentRunner.java:325) [junit-4.12.jar:4.12]
	at org.junit.runners.BlockJUnit4ClassRunner.runChild(BlockJUnit4ClassRunner.java:78) [junit-4.12.jar:4.12]
	at org.junit.runners.BlockJUnit4ClassRunner.runChild(BlockJUnit4ClassRunner.java:57) [junit-4.12.jar:4.12]
	at org.junit.runners.ParentRunner$3.run(ParentRunner.java:290) [junit-4.12.jar:4.12]
	at org.junit.runners.ParentRunner$1.schedule(ParentRunner.java:71) [junit-4.12.jar:4.12]
	at org.junit.runners.ParentRunner.runChildren(ParentRunner.java:288) [junit-4.12.jar:4.12]
	at org.junit.runners.ParentRunner.access$000(ParentRunner.java:58) [junit-4.12.jar:4.12]
	at org.junit.runners.ParentRunner$2.evaluate(ParentRunner.java:268) [junit-4.12.jar:4.12]
	at org.junit.internal.runners.statements.RunBefores.evaluate(RunBefores.java:26) [junit-4.12.jar:4.12]
	at org.junit.runners.ParentRunner.run(ParentRunner.java:363) [junit-4.12.jar:4.12]
	at org.apache.maven.surefire.junit4.JUnit4Provider.execute(JUnit4Provider.java:367) [surefire-junit4-2.19.1.jar:2.19.1]
	at org.apache.maven.surefire.junit4.JUnit4Provider.executeWithRerun(JUnit4Provider.java:274) [surefire-junit4-2.19.1.jar:2.19.1]
	at org.apache.maven.surefire.junit4.JUnit4Provider.executeTestSet(JUnit4Provider.java:238) [surefire-junit4-2.19.1.jar:2.19.1]
	at org.apache.maven.surefire.junit4.JUnit4Provider.invoke(JUnit4Provider.java:161) [surefire-junit4-2.19.1.jar:2.19.1]
	at org.apache.maven.surefire.booter.ForkedBooter.invokeProviderInSameClassLoader(ForkedBooter.java:290) [surefire-booter-2.19.1.jar:2.19.1]
	at org.apache.maven.surefire.booter.ForkedBooter.runSuitesInProcess(ForkedBooter.java:242) [surefire-booter-2.19.1.jar:2.19.1]
	at org.apache.maven.surefire.booter.ForkedBooter.main(ForkedBooter.java:121) [surefire-booter-2.19.1.jar:2.19.1]
Tests run: 24, Failures: 0, Errors: 0, Skipped: 0, Time elapsed: 1.22 sec - in org.eclipse.rdf4j.sail.memory.SchemaCachingRDFSInferencerMemInferencingTest
Picked up JAVA_TOOL_OPTIONS: -Xmx2G -Djava.io.tmpdir=/tmp/genie.rdf4j
Running org.eclipse.rdf4j.sail.memory.PersistentMemoryStoreTest
Tests run: 36, Failures: 0, Errors: 0, Skipped: 1, Time elapsed: 0.774 sec - in org.eclipse.rdf4j.sail.memory.PersistentMemoryStoreTest
Picked up JAVA_TOOL_OPTIONS: -Xmx2G -Djava.io.tmpdir=/tmp/genie.rdf4j
Running org.eclipse.rdf4j.sail.memory.StoreSerializationTest
Tests run: 3, Failures: 0, Errors: 0, Skipped: 0, Time elapsed: 0.606 sec - in org.eclipse.rdf4j.sail.memory.StoreSerializationTest
Picked up JAVA_TOOL_OPTIONS: -Xmx2G -Djava.io.tmpdir=/tmp/genie.rdf4j
Running org.eclipse.rdf4j.sail.memory.SchemaCachingRDFSMemoryStoreConcurrencyTest
08:41:25.872 [main] INFO  executing two large concurrent transactions
08:41:29.198 [Thread-1] INFO  Uploaded 200000 statements
08:41:32.927 [Thread-0] INFO  Uploaded 200000 statements
08:41:33.568 [main] INFO  committed both txns in 7s
08:41:34.002 [main] INFO  Running concurrency test...
08:41:40.482 [MemoryStore snapshot cleanup] INFO  Thread MemoryStore snapshot cleanup is waiting on 5 active Read locks
08:41:50.625 [MemoryStore snapshot cleanup] INFO  Thread MemoryStore snapshot cleanup is waiting on 6 active Read locks
08:42:04.040 [main] INFO  Test succeeded
Tests run: 3, Failures: 0, Errors: 0, Skipped: 1, Time elapsed: 38.594 sec - in org.eclipse.rdf4j.sail.memory.SchemaCachingRDFSMemoryStoreConcurrencyTest
Picked up JAVA_TOOL_OPTIONS: -Xmx2G -Djava.io.tmpdir=/tmp/genie.rdf4j
Running org.eclipse.rdf4j.sail.memory.MemInferencingTest
Tests run: 21, Failures: 0, Errors: 0, Skipped: 0, Time elapsed: 1.943 sec - in org.eclipse.rdf4j.sail.memory.MemInferencingTest
Picked up JAVA_TOOL_OPTIONS: -Xmx2G -Djava.io.tmpdir=/tmp/genie.rdf4j
Running org.eclipse.rdf4j.sail.memory.MemCustomInferencingTest
Tests run: 6, Failures: 0, Errors: 0, Skipped: 0, Time elapsed: 0.608 sec - in org.eclipse.rdf4j.sail.memory.MemCustomInferencingTest
Picked up JAVA_TOOL_OPTIONS: -Xmx2G -Djava.io.tmpdir=/tmp/genie.rdf4j
Running org.eclipse.rdf4j.sail.memory.MemoryStoreTest
Tests run: 36, Failures: 0, Errors: 0, Skipped: 1, Time elapsed: 0.807 sec - in org.eclipse.rdf4j.sail.memory.MemoryStoreTest
Picked up JAVA_TOOL_OPTIONS: -Xmx2G -Djava.io.tmpdir=/tmp/genie.rdf4j
Running org.eclipse.rdf4j.sail.memory.PersistentMemoryStoreIsolationLevelTest
Tests run: 6, Failures: 0, Errors: 0, Skipped: 0, Time elapsed: 0.793 sec - in org.eclipse.rdf4j.sail.memory.PersistentMemoryStoreIsolationLevelTest
Picked up JAVA_TOOL_OPTIONS: -Xmx2G -Djava.io.tmpdir=/tmp/genie.rdf4j
Running org.eclipse.rdf4j.sail.memory.MemoryStoreConcurrencyTest
08:42:12.116 [main] INFO  executing two large concurrent transactions
08:42:13.506 [Thread-1] INFO  Uploaded 200000 statements
08:42:13.547 [Thread-0] INFO  Uploaded 200000 statements
08:42:14.024 [main] INFO  committed both txns in 1s
08:42:14.392 [main] INFO  executing two large concurrent transactions
08:42:16.039 [Thread-3] INFO  Uploaded 200000 statements
08:42:16.051 [Thread-2] INFO  Uploaded 200000 statements
08:42:16.312 [Thread-3] INFO  Testing rollback of 200000 statements
08:42:16.313 [main] INFO  completed both txns in 1s
08:42:16.470 [main] INFO  Running concurrency test...
08:42:21.612 [MemoryStore snapshot cleanup] INFO  Thread MemoryStore snapshot cleanup is waiting on 7 active Read locks
08:42:31.768 [MemoryStore snapshot cleanup] INFO  Thread MemoryStore snapshot cleanup is waiting on 6 active Read locks
08:42:46.474 [main] INFO  Test succeeded
Tests run: 3, Failures: 0, Errors: 0, Skipped: 0, Time elapsed: 34.584 sec - in org.eclipse.rdf4j.sail.memory.MemoryStoreConcurrencyTest
Picked up JAVA_TOOL_OPTIONS: -Xmx2G -Djava.io.tmpdir=/tmp/genie.rdf4j
Running org.eclipse.rdf4j.sail.nativerdf.NativeStoreDirLockTest
Tests run: 1, Failures: 0, Errors: 0, Skipped: 0, Time elapsed: 0.423 sec - in org.eclipse.rdf4j.sail.nativerdf.NativeStoreDirLockTest
Picked up JAVA_TOOL_OPTIONS: -Xmx2G -Djava.io.tmpdir=/tmp/genie.rdf4j
Running org.eclipse.rdf4j.sail.nativerdf.NativeStoreInferencingTest
Tests run: 21, Failures: 0, Errors: 0, Skipped: 0, Time elapsed: 9.666 sec - in org.eclipse.rdf4j.sail.nativerdf.NativeStoreInferencingTest
Picked up JAVA_TOOL_OPTIONS: -Xmx2G -Djava.io.tmpdir=/tmp/genie.rdf4j
Running org.eclipse.rdf4j.sail.nativerdf.NativeStoreIsolationLevelTest
Tests run: 6, Failures: 0, Errors: 0, Skipped: 0, Time elapsed: 4.265 sec - in org.eclipse.rdf4j.sail.nativerdf.NativeStoreIsolationLevelTest
Picked up JAVA_TOOL_OPTIONS: -Xmx2G -Djava.io.tmpdir=/tmp/genie.rdf4j
Running org.eclipse.rdf4j.sail.nativerdf.NativeStoreInterruptTest
Tests run: 1, Failures: 0, Errors: 0, Skipped: 0, Time elapsed: 0.671 sec - in org.eclipse.rdf4j.sail.nativerdf.NativeStoreInterruptTest
Picked up JAVA_TOOL_OPTIONS: -Xmx2G -Djava.io.tmpdir=/tmp/genie.rdf4j
Running org.eclipse.rdf4j.sail.nativerdf.NativeStoreTest
Tests run: 37, Failures: 0, Errors: 0, Skipped: 1, Time elapsed: 6.176 sec - in org.eclipse.rdf4j.sail.nativerdf.NativeStoreTest
Picked up JAVA_TOOL_OPTIONS: -Xmx2G -Djava.io.tmpdir=/tmp/genie.rdf4j
Running org.eclipse.rdf4j.sail.nativerdf.NativeStoreConcurrencyTest
08:43:12.680 [main] INFO  executing two large concurrent transactions
08:43:13.495 [Thread-2] INFO  Uploaded 200000 statements
08:43:13.520 [Thread-1] INFO  Uploaded 200000 statements
08:43:18.020 [main] INFO  committed both txns in 5s
08:43:19.846 [main] INFO  executing two large concurrent transactions
08:43:20.577 [Thread-4] INFO  Uploaded 200000 statements
08:43:20.667 [Thread-5] INFO  Uploaded 200000 statements
08:43:20.667 [Thread-5] INFO  Testing rollback of 200000 statements
08:43:22.595 [main] INFO  completed both txns in 2s
08:43:24.088 [main] INFO  Running concurrency test...
08:43:55.252 [main] INFO  Test succeeded
Tests run: 3, Failures: 0, Errors: 0, Skipped: 0, Time elapsed: 49.801 sec - in org.eclipse.rdf4j.sail.nativerdf.NativeStoreConcurrencyTest
Picked up JAVA_TOOL_OPTIONS: -Xmx2G -Djava.io.tmpdir=/tmp/genie.rdf4j
Running org.eclipse.rdf4j.sail.nativerdf.NativeStoreContextTest
Tests run: 36, Failures: 0, Errors: 0, Skipped: 1, Time elapsed: 6.075 sec - in org.eclipse.rdf4j.sail.nativerdf.NativeStoreContextTest
Picked up JAVA_TOOL_OPTIONS: -Xmx2G -Djava.io.tmpdir=/tmp/genie.rdf4j
Running org.eclipse.rdf4j.sail.nativerdf.NativeStoreConsistencyTest
08:44:10.045 [main] INFO  Preserving initial state ...
08:44:23.768 [main] INFO  Number of statements: 59991
08:44:23.769 [main] INFO  Removing old context
08:44:23.770 [main] INFO  Adding updated context
08:44:24.915 [main] INFO  Not deleted statements: 0
08:44:25.042 [main] INFO  Repository size with SPOC index only: 48607
08:44:25.402 [main] INFO  Repository size with PSOC index only: 48607
08:44:25.638 [main] INFO  Computing differences of sets...
08:45:01.516 [main] INFO  Difference SPOC MINUS PSOC: 0
08:45:01.517 [main] INFO  Difference PSOC MINUS SPOC: 0
08:45:01.517 [main] INFO  Different statements in SPOC MINUS PSOC (Mind the contexts):
08:45:01.517 [main] INFO  Different statements in PSOC MINUS SPOC (Mind the contexts):
Tests run: 1, Failures: 0, Errors: 0, Skipped: 0, Time elapsed: 51.903 sec - in org.eclipse.rdf4j.sail.nativerdf.NativeStoreConsistencyTest
Picked up JAVA_TOOL_OPTIONS: -Xmx2G -Djava.io.tmpdir=/tmp/genie.rdf4j
Running org.eclipse.rdf4j.sail.nativerdf.NativeStoreCustomInferencingTest
Tests run: 6, Failures: 0, Errors: 0, Skipped: 0, Time elapsed: 2.285 sec - in org.eclipse.rdf4j.sail.nativerdf.NativeStoreCustomInferencingTest
Picked up JAVA_TOOL_OPTIONS: -Xmx2G -Djava.io.tmpdir=/tmp/genie.rdf4j
Running org.eclipse.rdf4j.sail.federation.FederationConnectionTest
08:45:07.159 [Time-limited test] WARN  [Rio error] Illegal language tag char: '_' (6, -1)
08:45:07.190 [Time-limited test] WARN  [Rio error] Illegal language tag char: '_' (6, -1)
Tests run: 76, Failures: 0, Errors: 0, Skipped: 2, Time elapsed: 1.04 sec - in org.eclipse.rdf4j.sail.federation.FederationConnectionTest
Picked up JAVA_TOOL_OPTIONS: -Xmx2G -Djava.io.tmpdir=/tmp/genie.rdf4j
Running org.eclipse.rdf4j.sail.federation.FederationTest
Tests run: 35, Failures: 0, Errors: 0, Skipped: 1, Time elapsed: 0.845 sec - in org.eclipse.rdf4j.sail.federation.FederationTest
Picked up JAVA_TOOL_OPTIONS: -Xmx2G -Djava.io.tmpdir=/tmp/genie.rdf4j
Running org.eclipse.rdf4j.sail.helpers.NotifyingSailConnectionWrapperTest
Tests run: 1, Failures: 0, Errors: 0, Skipped: 0, Time elapsed: 0.473 sec - in org.eclipse.rdf4j.sail.helpers.NotifyingSailConnectionWrapperTest

Results :

Tests in error: 
org.eclipse.rdf4j.repository.sail.nativerdf.CustomGraphQueryInferencerNativeRepositoryConnectionTest.testExclusiveNullContext[READ_COMMITTED](org.eclipse.rdf4j.repository.sail.nativerdf.CustomGraphQueryInferencerNativeRepositoryConnectionTest)
  Run 1: CustomGraphQueryInferencerNativeRepositoryConnectionTest>RepositoryConnectionTest.setUp:212->createRepository:38 Â FileAlreadyExists
  Run 2: CustomGraphQueryInferencerNativeRepositoryConnectionTest.tearDown:53 Â NullPointer

org.eclipse.rdf4j.repository.sail.nativerdf.LimitedSizeNativeStoreConnectionTest.testAddDeleteAdd[READ_UNCOMMITTED](org.eclipse.rdf4j.repository.sail.nativerdf.LimitedSizeNativeStoreConnectionTest)
  Run 1: LimitedSizeNativeStoreConnectionTest>RepositoryConnectionTest.setUp:212->createRepository:45 Â FileAlreadyExists
  Run 2: LimitedSizeNativeStoreConnectionTest.tearDown:57 Â NullPointer

org.eclipse.rdf4j.repository.sail.nativerdf.LimitedSizeNativeStoreConnectionTest.testAddStatement[READ_COMMITTED](org.eclipse.rdf4j.repository.sail.nativerdf.LimitedSizeNativeStoreConnectionTest)
  Run 1: LimitedSizeNativeStoreConnectionTest>RepositoryConnectionTest.setUp:212->createRepository:45 Â FileAlreadyExists
  Run 2: LimitedSizeNativeStoreConnectionTest.tearDown:57 Â NullPointer

org.eclipse.rdf4j.repository.sail.nativerdf.NativeComplexSPARQLQueryTest.testSameTermRepeatInUnionAndOptional(org.eclipse.rdf4j.repository.sail.nativerdf.NativeComplexSPARQLQueryTest)
  Run 1: NativeComplexSPARQLQueryTest>ComplexSPARQLQueryTest.setUp:104->newRepository:29 Â FileAlreadyExists
  Run 2: NativeComplexSPARQLQueryTest.tearDown:42 Â NullPointer


Tests run: 4821, Failures: 0, Errors: 4, Skipped: 150

[INFO] 
[INFO] --- maven-failsafe-plugin:2.19.1:verify (verify) @ rdf4j-store-compliance ---
[INFO] ------------------------------------------------------------------------
[INFO] Reactor Summary:
[INFO] 
[INFO] RDF4J Storage 2.4-SNAPSHOT ......................... SUCCESS [  1.757 s]
[INFO] RDF4J: Sail API .................................... SUCCESS [  2.893 s]
[INFO] RDF4J: Sail Model .................................. SUCCESS [  0.879 s]
[INFO] RDF4J: Inferencer Sails ............................ SUCCESS [  1.151 s]
[INFO] RDF4J: Query algebra - evaluation .................. SUCCESS [  7.627 s]
[INFO] RDF4J: Sail base implementations ................... SUCCESS [  3.869 s]
[INFO] RDF4J: MemoryStore ................................. SUCCESS [  3.466 s]
[INFO] RDF4J: SailRepository .............................. SUCCESS [  3.512 s]
[INFO] RDF4J Lucene Sail API .............................. SUCCESS [  2.381 s]
[INFO] RDF4J Elastic Search Sail Index .................... SUCCESS [  3.249 s]
[INFO] RDF4J: Federation SAIL ............................. SUCCESS [  3.914 s]
[INFO] RDF4J: Query algebra - GeoSPARQL ................... SUCCESS [  2.886 s]
[INFO] RDF4J Lucene Sail Index ............................ SUCCESS [  6.420 s]
[INFO] RDF4J: SPIN ........................................ SUCCESS [  7.159 s]
[INFO] RDF4J: SPIN SAIL ................................... SUCCESS [01:26 min]
[INFO] RDF4J: NativeStore ................................. SUCCESS [  3.798 s]
[INFO] RDF4J Lucene Sail Spin ............................. SUCCESS [ 23.863 s]
[INFO] RDF4J: DatasetRepository (wrapper) ................. SUCCESS [  0.970 s]
[INFO] RDF4J Solr Sail Index .............................. SUCCESS [  8.948 s]
[INFO] RDF4J: SHACL ....................................... SUCCESS [  6.201 s]
[INFO] RDF4J: Storage ..................................... SUCCESS [ 31.034 s]
[INFO] RDF4J compliance tests ............................. SUCCESS [  0.480 s]
[INFO] RDF4J Model compliance test ........................ SUCCESS [  5.458 s]
[INFO] RDF4J Lucene Sail Tests ............................ SUCCESS [  3.103 s]
[INFO] RDF4J Elasticsearch Sail Tests ..................... SUCCESS [01:16 min]
[INFO] RDF4J Solr Sail Tests .............................. SUCCESS [01:25 min]
[INFO] RDF4J SAIL and Repository compliance test .......... FAILURE [27:20 min]
[INFO] RDF4J SeRQL query parser compliance tests .......... SKIPPED
[INFO] RDF4J GeoSPARQL compliance tests ................... SKIPPED
[INFO] RDF4J SHACL compliance tests 2.4-SNAPSHOT .......... SKIPPED
[INFO] ------------------------------------------------------------------------
[INFO] BUILD FAILURE
[INFO] ------------------------------------------------------------------------
[INFO] Total time: 33:46 min
[INFO] Finished at: 2018-09-13T08:45:10-04:00
[INFO] ------------------------------------------------------------------------
[ERROR] Failed to execute goal org.apache.maven.plugins:maven-failsafe-plugin:2.19.1:verify (verify) on project rdf4j-store-compliance: There are test failures.
[ERROR] 
[ERROR] Please refer to /jobs/genie.rdf4j/rdf4j-storage-master-verify/workspace/compliance/store/target/failsafe-reports for the individual test results.
[ERROR] -> [Help 1]
[ERROR] 
[ERROR] To see the full stack trace of the errors, re-run Maven with the -e switch.
[ERROR] Re-run Maven using the -X switch to enable full debug logging.
[ERROR] 
[ERROR] For more information about the errors and possible solutions, please read the following articles:
[ERROR] [Help 1] http://cwiki.apache.org/confluence/display/MAVEN/MojoFailureException
[ERROR] 
[ERROR] After correcting the problems, you can resume the build with the command
[ERROR]   mvn <goals> -rf :rdf4j-store-compliance
Build step 'Invoke top-level Maven targets' marked build as failure