[Date Prev][Date Next][Thread Prev][Thread Next][Date Index][Thread Index] [List Home]
[rdf4j-dev] Build failed in Jenkins: rdf4j-storage-master-verify #61

See <https://ci.eclipse.org/rdf4j/job/rdf4j-storage-master-verify/61/display/redirect>

------------------------------------------
[...truncated 1.27 MB...]
	at org.junit.runners.ParentRunner.runLeaf(ParentRunner.java:325) [junit-4.12.jar:4.12]
	at org.junit.runners.BlockJUnit4ClassRunner.runChild(BlockJUnit4ClassRunner.java:78) [junit-4.12.jar:4.12]
	at org.junit.runners.BlockJUnit4ClassRunner.runChild(BlockJUnit4ClassRunner.java:57) [junit-4.12.jar:4.12]
	at org.junit.runners.ParentRunner$3.run(ParentRunner.java:290) [junit-4.12.jar:4.12]
	at org.junit.runners.ParentRunner$1.schedule(ParentRunner.java:71) [junit-4.12.jar:4.12]
	at org.junit.runners.ParentRunner.runChildren(ParentRunner.java:288) [junit-4.12.jar:4.12]
	at org.junit.runners.ParentRunner.access$000(ParentRunner.java:58) [junit-4.12.jar:4.12]
	at org.junit.runners.ParentRunner$2.evaluate(ParentRunner.java:268) [junit-4.12.jar:4.12]
	at org.junit.internal.runners.statements.RunBefores.evaluate(RunBefores.java:26) [junit-4.12.jar:4.12]
	at org.junit.runners.ParentRunner.run(ParentRunner.java:363) [junit-4.12.jar:4.12]
	at org.apache.maven.surefire.junit4.JUnit4Provider.execute(JUnit4Provider.java:367) [surefire-junit4-2.19.1.jar:2.19.1]
	at org.apache.maven.surefire.junit4.JUnit4Provider.executeWithRerun(JUnit4Provider.java:274) [surefire-junit4-2.19.1.jar:2.19.1]
	at org.apache.maven.surefire.junit4.JUnit4Provider.executeTestSet(JUnit4Provider.java:238) [surefire-junit4-2.19.1.jar:2.19.1]
	at org.apache.maven.surefire.junit4.JUnit4Provider.invoke(JUnit4Provider.java:161) [surefire-junit4-2.19.1.jar:2.19.1]
	at org.apache.maven.surefire.booter.ForkedBooter.invokeProviderInSameClassLoader(ForkedBooter.java:290) [surefire-booter-2.19.1.jar:2.19.1]
	at org.apache.maven.surefire.booter.ForkedBooter.runSuitesInProcess(ForkedBooter.java:242) [surefire-booter-2.19.1.jar:2.19.1]
	at org.apache.maven.surefire.booter.ForkedBooter.main(ForkedBooter.java:121) [surefire-booter-2.19.1.jar:2.19.1]
07:48:56.556 [main] ERROR exception while uploading input data
java.lang.ClassCastException: org.eclipse.rdf4j.sail.memory.model.MemLiteral cannot be cast to org.eclipse.rdf4j.model.Resource
	at org.eclipse.rdf4j.sail.inferencer.fc.SchemaCachingRDFSInferencer.addSubClassOfStatement(SchemaCachingRDFSInferencer.java:385) ~[rdf4j-storage-2.4-SNAPSHOT.jar:2.4-SNAPSHOT+4e84313]
	at org.eclipse.rdf4j.sail.inferencer.fc.SchemaCachingRDFSInferencerConnection.processForSchemaCache(SchemaCachingRDFSInferencerConnection.java:74) ~[rdf4j-storage-2.4-SNAPSHOT.jar:2.4-SNAPSHOT+4e84313]
	at org.eclipse.rdf4j.sail.inferencer.fc.SchemaCachingRDFSInferencerConnection.addStatement(SchemaCachingRDFSInferencerConnection.java:194) ~[rdf4j-storage-2.4-SNAPSHOT.jar:2.4-SNAPSHOT+4e84313]
	at org.eclipse.rdf4j.sail.inferencer.fc.SchemaCachingRDFSInferencerConnection.addStatement(SchemaCachingRDFSInferencerConnection.java:184) ~[rdf4j-storage-2.4-SNAPSHOT.jar:2.4-SNAPSHOT+4e84313]
	at org.eclipse.rdf4j.repository.sail.SailRepositoryConnection.addWithoutCommit(SailRepositoryConnection.java:363) ~[rdf4j-storage-2.4-SNAPSHOT.jar:2.4-SNAPSHOT+4e84313]
	at org.eclipse.rdf4j.repository.base.AbstractRepositoryConnection.add(AbstractRepositoryConnection.java:509) ~[rdf4j-client-2.4-SNAPSHOT.jar:2.4-SNAPSHOT+ef0d080]
	at org.eclipse.rdf4j.repository.util.RDFInserter.addStatement(RDFInserter.java:69) ~[rdf4j-client-2.4-SNAPSHOT.jar:2.4-SNAPSHOT+ef0d080]
	at org.eclipse.rdf4j.repository.util.AbstractRDFInserter.handleStatement(AbstractRDFInserter.java:190) ~[rdf4j-client-2.4-SNAPSHOT.jar:2.4-SNAPSHOT+ef0d080]
	at org.eclipse.rdf4j.rio.ntriples.NTriplesParser.parseTriple(NTriplesParser.java:324) ~[rdf4j-client-2.4-SNAPSHOT.jar:2.4-SNAPSHOT+ef0d080]
	at org.eclipse.rdf4j.rio.ntriples.NTriplesParser.parse(NTriplesParser.java:179) ~[rdf4j-client-2.4-SNAPSHOT.jar:2.4-SNAPSHOT+ef0d080]
	at org.eclipse.rdf4j.rio.ntriples.NTriplesParser.parse(NTriplesParser.java:118) ~[rdf4j-client-2.4-SNAPSHOT.jar:2.4-SNAPSHOT+ef0d080]
	at org.eclipse.rdf4j.repository.util.RDFLoader.loadInputStreamOrReader(RDFLoader.java:286) ~[rdf4j-client-2.4-SNAPSHOT.jar:2.4-SNAPSHOT+ef0d080]
	at org.eclipse.rdf4j.repository.util.RDFLoader.load(RDFLoader.java:197) ~[rdf4j-client-2.4-SNAPSHOT.jar:2.4-SNAPSHOT+ef0d080]
	at org.eclipse.rdf4j.repository.base.AbstractRepositoryConnection.add(AbstractRepositoryConnection.java:329) ~[rdf4j-client-2.4-SNAPSHOT.jar:2.4-SNAPSHOT+ef0d080]
	at org.eclipse.rdf4j.sail.InferencingTest.runTest(InferencingTest.java:81) [rdf4j-store-testsuite-2.4-SNAPSHOT.jar:2.4-SNAPSHOT+041aace]
	at org.eclipse.rdf4j.sail.InferencingTest.testSubClassOfError001(InferencingTest.java:194) [rdf4j-store-testsuite-2.4-SNAPSHOT.jar:2.4-SNAPSHOT+041aace]
	at sun.reflect.NativeMethodAccessorImpl.invoke0(Native Method) ~[na:1.8.0_162]
	at sun.reflect.NativeMethodAccessorImpl.invoke(NativeMethodAccessorImpl.java:62) ~[na:1.8.0_162]
	at sun.reflect.DelegatingMethodAccessorImpl.invoke(DelegatingMethodAccessorImpl.java:43) ~[na:1.8.0_162]
	at java.lang.reflect.Method.invoke(Method.java:498) ~[na:1.8.0_162]
	at org.junit.runners.model.FrameworkMethod$1.runReflectiveCall(FrameworkMethod.java:50) [junit-4.12.jar:4.12]
	at org.junit.internal.runners.model.ReflectiveCallable.run(ReflectiveCallable.java:12) [junit-4.12.jar:4.12]
	at org.junit.runners.model.FrameworkMethod.invokeExplosively(FrameworkMethod.java:47) [junit-4.12.jar:4.12]
	at org.junit.internal.runners.statements.InvokeMethod.evaluate(InvokeMethod.java:17) [junit-4.12.jar:4.12]
	at org.junit.runners.ParentRunner.runLeaf(ParentRunner.java:325) [junit-4.12.jar:4.12]
	at org.junit.runners.BlockJUnit4ClassRunner.runChild(BlockJUnit4ClassRunner.java:78) [junit-4.12.jar:4.12]
	at org.junit.runners.BlockJUnit4ClassRunner.runChild(BlockJUnit4ClassRunner.java:57) [junit-4.12.jar:4.12]
	at org.junit.runners.ParentRunner$3.run(ParentRunner.java:290) [junit-4.12.jar:4.12]
	at org.junit.runners.ParentRunner$1.schedule(ParentRunner.java:71) [junit-4.12.jar:4.12]
	at org.junit.runners.ParentRunner.runChildren(ParentRunner.java:288) [junit-4.12.jar:4.12]
	at org.junit.runners.ParentRunner.access$000(ParentRunner.java:58) [junit-4.12.jar:4.12]
	at org.junit.runners.ParentRunner$2.evaluate(ParentRunner.java:268) [junit-4.12.jar:4.12]
	at org.junit.internal.runners.statements.RunBefores.evaluate(RunBefores.java:26) [junit-4.12.jar:4.12]
	at org.junit.runners.ParentRunner.run(ParentRunner.java:363) [junit-4.12.jar:4.12]
	at org.apache.maven.surefire.junit4.JUnit4Provider.execute(JUnit4Provider.java:367) [surefire-junit4-2.19.1.jar:2.19.1]
	at org.apache.maven.surefire.junit4.JUnit4Provider.executeWithRerun(JUnit4Provider.java:274) [surefire-junit4-2.19.1.jar:2.19.1]
	at org.apache.maven.surefire.junit4.JUnit4Provider.executeTestSet(JUnit4Provider.java:238) [surefire-junit4-2.19.1.jar:2.19.1]
	at org.apache.maven.surefire.junit4.JUnit4Provider.invoke(JUnit4Provider.java:161) [surefire-junit4-2.19.1.jar:2.19.1]
	at org.apache.maven.surefire.booter.ForkedBooter.invokeProviderInSameClassLoader(ForkedBooter.java:290) [surefire-booter-2.19.1.jar:2.19.1]
	at org.apache.maven.surefire.booter.ForkedBooter.runSuitesInProcess(ForkedBooter.java:242) [surefire-booter-2.19.1.jar:2.19.1]
	at org.apache.maven.surefire.booter.ForkedBooter.main(ForkedBooter.java:121) [surefire-booter-2.19.1.jar:2.19.1]
Tests run: 24, Failures: 0, Errors: 0, Skipped: 0, Time elapsed: 1.343 sec - in org.eclipse.rdf4j.sail.memory.SchemaCachingRDFSInferencerMemInferencingTest
Picked up JAVA_TOOL_OPTIONS: -Xmx2G -Djava.io.tmpdir=/tmp/genie.rdf4j
Running org.eclipse.rdf4j.sail.memory.PersistentMemoryStoreTest
Tests run: 36, Failures: 0, Errors: 0, Skipped: 1, Time elapsed: 0.764 sec - in org.eclipse.rdf4j.sail.memory.PersistentMemoryStoreTest
Picked up JAVA_TOOL_OPTIONS: -Xmx2G -Djava.io.tmpdir=/tmp/genie.rdf4j
Running org.eclipse.rdf4j.sail.memory.StoreSerializationTest
Tests run: 3, Failures: 0, Errors: 0, Skipped: 0, Time elapsed: 0.485 sec - in org.eclipse.rdf4j.sail.memory.StoreSerializationTest
Picked up JAVA_TOOL_OPTIONS: -Xmx2G -Djava.io.tmpdir=/tmp/genie.rdf4j
Running org.eclipse.rdf4j.sail.memory.SchemaCachingRDFSMemoryStoreConcurrencyTest
07:49:00.372 [main] INFO  executing two large concurrent transactions
07:49:03.264 [Thread-0] INFO  Uploaded 200000 statements
07:49:06.893 [Thread-1] INFO  Uploaded 200000 statements
07:49:07.513 [main] INFO  committed both txns in 7s
07:49:07.950 [main] INFO  Running concurrency test...
07:49:16.747 [MemoryStore snapshot cleanup] INFO  Thread MemoryStore snapshot cleanup is waiting on 9 active Read locks
07:49:27.560 [MemoryStore snapshot cleanup] INFO  Thread MemoryStore snapshot cleanup is waiting on 7 active Read locks
07:49:37.983 [main] INFO  Test succeeded
Tests run: 3, Failures: 0, Errors: 0, Skipped: 1, Time elapsed: 38.134 sec - in org.eclipse.rdf4j.sail.memory.SchemaCachingRDFSMemoryStoreConcurrencyTest
Picked up JAVA_TOOL_OPTIONS: -Xmx2G -Djava.io.tmpdir=/tmp/genie.rdf4j
Running org.eclipse.rdf4j.sail.memory.MemInferencingTest
Tests run: 21, Failures: 0, Errors: 0, Skipped: 0, Time elapsed: 1.844 sec - in org.eclipse.rdf4j.sail.memory.MemInferencingTest
Picked up JAVA_TOOL_OPTIONS: -Xmx2G -Djava.io.tmpdir=/tmp/genie.rdf4j
Running org.eclipse.rdf4j.sail.memory.MemCustomInferencingTest
Tests run: 6, Failures: 0, Errors: 0, Skipped: 0, Time elapsed: 0.634 sec - in org.eclipse.rdf4j.sail.memory.MemCustomInferencingTest
Picked up JAVA_TOOL_OPTIONS: -Xmx2G -Djava.io.tmpdir=/tmp/genie.rdf4j
Running org.eclipse.rdf4j.sail.memory.MemoryStoreTest
Tests run: 36, Failures: 0, Errors: 0, Skipped: 1, Time elapsed: 0.707 sec - in org.eclipse.rdf4j.sail.memory.MemoryStoreTest
Picked up JAVA_TOOL_OPTIONS: -Xmx2G -Djava.io.tmpdir=/tmp/genie.rdf4j
Running org.eclipse.rdf4j.sail.memory.PersistentMemoryStoreIsolationLevelTest
Tests run: 6, Failures: 0, Errors: 0, Skipped: 0, Time elapsed: 0.817 sec - in org.eclipse.rdf4j.sail.memory.PersistentMemoryStoreIsolationLevelTest
Picked up JAVA_TOOL_OPTIONS: -Xmx2G -Djava.io.tmpdir=/tmp/genie.rdf4j
Running org.eclipse.rdf4j.sail.memory.MemoryStoreConcurrencyTest
07:49:45.570 [main] INFO  executing two large concurrent transactions
07:49:47.157 [Thread-1] INFO  Uploaded 200000 statements
07:49:47.209 [Thread-0] INFO  Uploaded 200000 statements
07:49:47.619 [main] INFO  committed both txns in 2s
07:49:47.983 [main] INFO  executing two large concurrent transactions
07:49:49.725 [Thread-2] INFO  Uploaded 200000 statements
07:49:49.793 [Thread-3] INFO  Uploaded 200000 statements
07:49:49.994 [Thread-3] INFO  Testing rollback of 200000 statements
07:49:49.995 [main] INFO  completed both txns in 2s
07:49:50.141 [main] INFO  Running concurrency test...
07:49:55.255 [MemoryStore snapshot cleanup] INFO  Thread MemoryStore snapshot cleanup is waiting on 6 active Read locks
07:50:05.398 [MemoryStore snapshot cleanup] INFO  Thread MemoryStore snapshot cleanup is waiting on 6 active Read locks
07:50:20.145 [main] INFO  Test succeeded
Tests run: 3, Failures: 0, Errors: 0, Skipped: 0, Time elapsed: 34.797 sec - in org.eclipse.rdf4j.sail.memory.MemoryStoreConcurrencyTest
Picked up JAVA_TOOL_OPTIONS: -Xmx2G -Djava.io.tmpdir=/tmp/genie.rdf4j
Running org.eclipse.rdf4j.sail.nativerdf.NativeStoreDirLockTest
Tests run: 1, Failures: 0, Errors: 0, Skipped: 0, Time elapsed: 0.493 sec - in org.eclipse.rdf4j.sail.nativerdf.NativeStoreDirLockTest
Picked up JAVA_TOOL_OPTIONS: -Xmx2G -Djava.io.tmpdir=/tmp/genie.rdf4j
Running org.eclipse.rdf4j.sail.nativerdf.NativeStoreInferencingTest
Tests run: 21, Failures: 0, Errors: 0, Skipped: 0, Time elapsed: 14.046 sec - in org.eclipse.rdf4j.sail.nativerdf.NativeStoreInferencingTest
Picked up JAVA_TOOL_OPTIONS: -Xmx2G -Djava.io.tmpdir=/tmp/genie.rdf4j
Running org.eclipse.rdf4j.sail.nativerdf.NativeStoreIsolationLevelTest
Tests run: 6, Failures: 0, Errors: 0, Skipped: 0, Time elapsed: 7.668 sec - in org.eclipse.rdf4j.sail.nativerdf.NativeStoreIsolationLevelTest
Picked up JAVA_TOOL_OPTIONS: -Xmx2G -Djava.io.tmpdir=/tmp/genie.rdf4j
Running org.eclipse.rdf4j.sail.nativerdf.NativeStoreInterruptTest
Tests run: 1, Failures: 0, Errors: 0, Skipped: 0, Time elapsed: 0.84 sec - in org.eclipse.rdf4j.sail.nativerdf.NativeStoreInterruptTest
Picked up JAVA_TOOL_OPTIONS: -Xmx2G -Djava.io.tmpdir=/tmp/genie.rdf4j
Running org.eclipse.rdf4j.sail.nativerdf.NativeStoreTest
Tests run: 37, Failures: 0, Errors: 0, Skipped: 1, Time elapsed: 12.353 sec - in org.eclipse.rdf4j.sail.nativerdf.NativeStoreTest
Picked up JAVA_TOOL_OPTIONS: -Xmx2G -Djava.io.tmpdir=/tmp/genie.rdf4j
Running org.eclipse.rdf4j.sail.nativerdf.NativeStoreConcurrencyTest
07:51:00.227 [main] INFO  executing two large concurrent transactions
07:51:01.112 [Thread-1] INFO  Uploaded 200000 statements
07:51:01.176 [Thread-2] INFO  Uploaded 200000 statements
07:51:05.259 [main] INFO  committed both txns in 5s
07:51:07.027 [main] INFO  executing two large concurrent transactions
07:51:07.661 [Thread-5] INFO  Uploaded 200000 statements
07:51:07.731 [Thread-4] INFO  Uploaded 200000 statements
07:51:07.731 [Thread-5] INFO  Testing rollback of 200000 statements
07:51:09.987 [main] INFO  completed both txns in 2s
07:51:10.931 [main] INFO  Running concurrency test...
07:51:41.932 [main] INFO  Test succeeded
Tests run: 3, Failures: 0, Errors: 0, Skipped: 0, Time elapsed: 44.521 sec - in org.eclipse.rdf4j.sail.nativerdf.NativeStoreConcurrencyTest
Picked up JAVA_TOOL_OPTIONS: -Xmx2G -Djava.io.tmpdir=/tmp/genie.rdf4j
Running org.eclipse.rdf4j.sail.nativerdf.NativeStoreContextTest
Tests run: 36, Failures: 0, Errors: 0, Skipped: 1, Time elapsed: 10.794 sec - in org.eclipse.rdf4j.sail.nativerdf.NativeStoreContextTest
Picked up JAVA_TOOL_OPTIONS: -Xmx2G -Djava.io.tmpdir=/tmp/genie.rdf4j
Running org.eclipse.rdf4j.sail.nativerdf.NativeStoreConsistencyTest
07:51:56.883 [main] INFO  Preserving initial state ...
07:52:08.462 [main] INFO  Number of statements: 59991
07:52:08.462 [main] INFO  Removing old context
07:52:08.462 [main] INFO  Adding updated context
07:52:10.958 [main] INFO  Not deleted statements: 0
07:52:11.097 [main] INFO  Repository size with SPOC index only: 48607
07:52:11.545 [main] INFO  Repository size with PSOC index only: 48607
07:52:11.806 [main] INFO  Computing differences of sets...
07:52:48.652 [main] INFO  Difference SPOC MINUS PSOC: 0
07:52:48.653 [main] INFO  Difference PSOC MINUS SPOC: 0
07:52:48.653 [main] INFO  Different statements in SPOC MINUS PSOC (Mind the contexts):
07:52:48.653 [main] INFO  Different statements in PSOC MINUS SPOC (Mind the contexts):
Tests run: 1, Failures: 0, Errors: 0, Skipped: 0, Time elapsed: 52.203 sec - in org.eclipse.rdf4j.sail.nativerdf.NativeStoreConsistencyTest
Picked up JAVA_TOOL_OPTIONS: -Xmx2G -Djava.io.tmpdir=/tmp/genie.rdf4j
Running org.eclipse.rdf4j.sail.nativerdf.NativeStoreCustomInferencingTest
Tests run: 6, Failures: 0, Errors: 0, Skipped: 0, Time elapsed: 2.069 sec - in org.eclipse.rdf4j.sail.nativerdf.NativeStoreCustomInferencingTest
Picked up JAVA_TOOL_OPTIONS: -Xmx2G -Djava.io.tmpdir=/tmp/genie.rdf4j
Running org.eclipse.rdf4j.sail.federation.FederationConnectionTest
07:52:52.834 [Time-limited test] WARN  [Rio error] Illegal language tag char: '_' (6, -1)
07:52:52.860 [Time-limited test] WARN  [Rio error] Illegal language tag char: '_' (6, -1)
Tests run: 76, Failures: 0, Errors: 0, Skipped: 2, Time elapsed: 0.998 sec - in org.eclipse.rdf4j.sail.federation.FederationConnectionTest
Picked up JAVA_TOOL_OPTIONS: -Xmx2G -Djava.io.tmpdir=/tmp/genie.rdf4j
Running org.eclipse.rdf4j.sail.federation.FederationTest
Tests run: 35, Failures: 0, Errors: 0, Skipped: 1, Time elapsed: 0.685 sec - in org.eclipse.rdf4j.sail.federation.FederationTest
Picked up JAVA_TOOL_OPTIONS: -Xmx2G -Djava.io.tmpdir=/tmp/genie.rdf4j
Running org.eclipse.rdf4j.sail.helpers.NotifyingSailConnectionWrapperTest
Tests run: 1, Failures: 0, Errors: 0, Skipped: 0, Time elapsed: 0.395 sec - in org.eclipse.rdf4j.sail.helpers.NotifyingSailConnectionWrapperTest

Results :

Tests in error: 
org.eclipse.rdf4j.repository.sail.nativerdf.CustomGraphQueryInferencerNativeRepositoryConnectionTest.testDeleteDefaultGraph[READ_UNCOMMITTED](org.eclipse.rdf4j.repository.sail.nativerdf.CustomGraphQueryInferencerNativeRepositoryConnectionTest)
  Run 1: CustomGraphQueryInferencerNativeRepositoryConnectionTest>RepositoryConnectionTest.setUp:212->createRepository:38 Â FileAlreadyExists
  Run 2: CustomGraphQueryInferencerNativeRepositoryConnectionTest.tearDown:53 Â NullPointer

org.eclipse.rdf4j.repository.sail.nativerdf.CustomGraphQueryInferencerNativeRepositoryConnectionTest.testGetContextIDs[READ_COMMITTED](org.eclipse.rdf4j.repository.sail.nativerdf.CustomGraphQueryInferencerNativeRepositoryConnectionTest)
  Run 1: CustomGraphQueryInferencerNativeRepositoryConnectionTest>RepositoryConnectionTest.setUp:212->createRepository:38 Â IO
  Run 2: CustomGraphQueryInferencerNativeRepositoryConnectionTest.tearDown:53 Â NullPointer

org.eclipse.rdf4j.repository.sail.nativerdf.NativeStoreConnectionTest.testAddMalformedLiteralsStrictConfig[SNAPSHOT_READ](org.eclipse.rdf4j.repository.sail.nativerdf.NativeStoreConnectionTest)
  Run 1: NativeStoreConnectionTest>RepositoryConnectionTest.setUp:212->createRepository:38 Â FileAlreadyExists
  Run 2: NativeStoreConnectionTest.tearDown:50 Â NullPointer

org.eclipse.rdf4j.repository.sail.nativerdf.RDFSchemaNativeRepositoryConnectionTest.testPreparedTupleQuery[SNAPSHOT](org.eclipse.rdf4j.repository.sail.nativerdf.RDFSchemaNativeRepositoryConnectionTest)
  Run 1: RDFSchemaNativeRepositoryConnectionTest>RDFSchemaRepositoryConnectionTest.setUp:57->RepositoryConnectionTest.setUp:212->createRepository:33 Â FileAlreadyExists
  Run 2: RDFSchemaNativeRepositoryConnectionTest.tearDown:45 Â NullPointer

org.eclipse.rdf4j.repository.sail.nativerdf.SchemaCachingRDFSInferencerNativeRepositoryConnectionTest.testInferencerQueryDuringTransaction[SNAPSHOT_READ](org.eclipse.rdf4j.repository.sail.nativerdf.SchemaCachingRDFSInferencerNativeRepositoryConnectionTest)
  Run 1: SchemaCachingRDFSInferencerNativeRepositoryConnectionTest>RDFSchemaRepositoryConnectionTest.setUp:57->RepositoryConnectionTest.setUp:212->createRepository:35 Â FileAlreadyExists
  Run 2: SchemaCachingRDFSInferencerNativeRepositoryConnectionTest.tearDown:48 Â NullPointer


Tests run: 4821, Failures: 0, Errors: 5, Skipped: 150

[INFO] 
[INFO] --- maven-failsafe-plugin:2.19.1:verify (verify) @ rdf4j-store-compliance ---
[INFO] ------------------------------------------------------------------------
[INFO] Reactor Summary:
[INFO] 
[INFO] RDF4J Storage 2.4-SNAPSHOT ......................... SUCCESS [  2.429 s]
[INFO] RDF4J: Sail API .................................... SUCCESS [  3.055 s]
[INFO] RDF4J: Sail Model .................................. SUCCESS [  0.782 s]
[INFO] RDF4J: Inferencer Sails ............................ SUCCESS [  1.139 s]
[INFO] RDF4J: Query algebra - evaluation .................. SUCCESS [  9.195 s]
[INFO] RDF4J: Sail base implementations ................... SUCCESS [  0.871 s]
[INFO] RDF4J: MemoryStore ................................. SUCCESS [  5.139 s]
[INFO] RDF4J: SailRepository .............................. SUCCESS [  3.042 s]
[INFO] RDF4J Lucene Sail API .............................. SUCCESS [  2.493 s]
[INFO] RDF4J Elastic Search Sail Index .................... SUCCESS [  3.529 s]
[INFO] RDF4J: Federation SAIL ............................. SUCCESS [  3.382 s]
[INFO] RDF4J: Query algebra - GeoSPARQL ................... SUCCESS [  2.683 s]
[INFO] RDF4J Lucene Sail Index ............................ SUCCESS [  7.192 s]
[INFO] RDF4J: SPIN ........................................ SUCCESS [  5.200 s]
[INFO] RDF4J: SPIN SAIL ................................... SUCCESS [01:30 min]
[INFO] RDF4J: NativeStore ................................. SUCCESS [  3.900 s]
[INFO] RDF4J Lucene Sail Spin ............................. SUCCESS [ 21.740 s]
[INFO] RDF4J: DatasetRepository (wrapper) ................. SUCCESS [  0.719 s]
[INFO] RDF4J Solr Sail Index .............................. SUCCESS [  6.494 s]
[INFO] RDF4J: SHACL ....................................... SUCCESS [  6.069 s]
[INFO] RDF4J: Storage ..................................... SUCCESS [ 29.576 s]
[INFO] RDF4J compliance tests ............................. SUCCESS [  0.539 s]
[INFO] RDF4J Model compliance test ........................ SUCCESS [  6.983 s]
[INFO] RDF4J Lucene Sail Tests ............................ SUCCESS [  3.131 s]
[INFO] RDF4J Elasticsearch Sail Tests ..................... SUCCESS [01:11 min]
[INFO] RDF4J Solr Sail Tests .............................. SUCCESS [01:13 min]
[INFO] RDF4J SAIL and Repository compliance test .......... FAILURE [33:23 min]
[INFO] RDF4J SeRQL query parser compliance tests .......... SKIPPED
[INFO] RDF4J GeoSPARQL compliance tests ................... SKIPPED
[INFO] RDF4J SHACL compliance tests 2.4-SNAPSHOT .......... SKIPPED
[INFO] ------------------------------------------------------------------------
[INFO] BUILD FAILURE
[INFO] ------------------------------------------------------------------------
[INFO] Total time: 39:30 min
[INFO] Finished at: 2018-09-13T07:52:55-04:00
[INFO] ------------------------------------------------------------------------
[ERROR] Failed to execute goal org.apache.maven.plugins:maven-failsafe-plugin:2.19.1:verify (verify) on project rdf4j-store-compliance: There are test failures.
[ERROR] 
[ERROR] Please refer to /jobs/genie.rdf4j/rdf4j-storage-master-verify/workspace/compliance/store/target/failsafe-reports for the individual test results.
[ERROR] -> [Help 1]
[ERROR] 
[ERROR] To see the full stack trace of the errors, re-run Maven with the -e switch.
[ERROR] Re-run Maven using the -X switch to enable full debug logging.
[ERROR] 
[ERROR] For more information about the errors and possible solutions, please read the following articles:
[ERROR] [Help 1] http://cwiki.apache.org/confluence/display/MAVEN/MojoFailureException
[ERROR] 
[ERROR] After correcting the problems, you can resume the build with the command
[ERROR]   mvn <goals> -rf :rdf4j-store-compliance
Build step 'Invoke top-level Maven targets' marked build as failure