[Date Prev][Date Next][Thread Prev][Thread Next][Date Index][Thread Index] [List Home]
[rdf4j-dev] Build failed in Jenkins: rdf4j-storage-develop-verify #78

See <https://ci.eclipse.org/rdf4j/job/rdf4j-storage-develop-verify/78/display/redirect>

------------------------------------------
[...truncated 1.31 MB...]
	at org.eclipse.rdf4j.repository.TupleQueryResultTest.testNotClosingResult(TupleQueryResultTest.java:271) ~[rdf4j-store-testsuite-2.5-SNAPSHOT.jar:2.5-SNAPSHOT+c01a444]
	at sun.reflect.NativeMethodAccessorImpl.invoke0(Native Method) ~[na:1.8.0_162]
	at sun.reflect.NativeMethodAccessorImpl.invoke(NativeMethodAccessorImpl.java:62) ~[na:1.8.0_162]
	at sun.reflect.DelegatingMethodAccessorImpl.invoke(DelegatingMethodAccessorImpl.java:43) ~[na:1.8.0_162]
	at java.lang.reflect.Method.invoke(Method.java:498) ~[na:1.8.0_162]
	at org.junit.runners.model.FrameworkMethod$1.runReflectiveCall(FrameworkMethod.java:50) [junit-4.12.jar:4.12]
	at org.junit.internal.runners.model.ReflectiveCallable.run(ReflectiveCallable.java:12) [junit-4.12.jar:4.12]
	at org.junit.runners.model.FrameworkMethod.invokeExplosively(FrameworkMethod.java:47) [junit-4.12.jar:4.12]
	at org.junit.internal.runners.statements.InvokeMethod.evaluate(InvokeMethod.java:17) [junit-4.12.jar:4.12]
	at org.junit.internal.runners.statements.RunBefores.evaluate(RunBefores.java:26) [junit-4.12.jar:4.12]
	at org.junit.internal.runners.statements.RunAfters.evaluate(RunAfters.java:27) [junit-4.12.jar:4.12]
	at org.junit.runners.ParentRunner.runLeaf(ParentRunner.java:325) [junit-4.12.jar:4.12]
	at org.junit.runners.BlockJUnit4ClassRunner.runChild(BlockJUnit4ClassRunner.java:78) [junit-4.12.jar:4.12]
	at org.junit.runners.BlockJUnit4ClassRunner.runChild(BlockJUnit4ClassRunner.java:57) [junit-4.12.jar:4.12]
	at org.junit.runners.ParentRunner$3.run(ParentRunner.java:290) [junit-4.12.jar:4.12]
	at org.junit.runners.ParentRunner$1.schedule(ParentRunner.java:71) [junit-4.12.jar:4.12]
	at org.junit.runners.ParentRunner.runChildren(ParentRunner.java:288) [junit-4.12.jar:4.12]
	at org.junit.runners.ParentRunner.access$000(ParentRunner.java:58) [junit-4.12.jar:4.12]
	at org.junit.runners.ParentRunner$2.evaluate(ParentRunner.java:268) [junit-4.12.jar:4.12]
	at org.junit.internal.runners.statements.RunBefores.evaluate(RunBefores.java:26) [junit-4.12.jar:4.12]
	at org.junit.runners.ParentRunner.run(ParentRunner.java:363) [junit-4.12.jar:4.12]
	at org.apache.maven.surefire.junit4.JUnit4Provider.execute(JUnit4Provider.java:367) [surefire-junit4-2.19.1.jar:2.19.1]
	at org.apache.maven.surefire.junit4.JUnit4Provider.executeWithRerun(JUnit4Provider.java:274) [surefire-junit4-2.19.1.jar:2.19.1]
	at org.apache.maven.surefire.junit4.JUnit4Provider.executeTestSet(JUnit4Provider.java:238) [surefire-junit4-2.19.1.jar:2.19.1]
	at org.apache.maven.surefire.junit4.JUnit4Provider.invoke(JUnit4Provider.java:161) [surefire-junit4-2.19.1.jar:2.19.1]
	at org.apache.maven.surefire.booter.ForkedBooter.invokeProviderInSameClassLoader(ForkedBooter.java:290) [surefire-booter-2.19.1.jar:2.19.1]
	at org.apache.maven.surefire.booter.ForkedBooter.runSuitesInProcess(ForkedBooter.java:242) [surefire-booter-2.19.1.jar:2.19.1]
	at org.apache.maven.surefire.booter.ForkedBooter.main(ForkedBooter.java:121) [surefire-booter-2.19.1.jar:2.19.1]
06:26:04.502 [main] WARN  Forced closing of unclosed iteration that was created in:
java.lang.Throwable: null
	at org.eclipse.rdf4j.sail.helpers.AbstractSailConnection.registerIteration(AbstractSailConnection.java:802) ~[rdf4j-storage-2.5-SNAPSHOT.jar:2.5-SNAPSHOT+6fdd72c]
	at org.eclipse.rdf4j.sail.helpers.AbstractSailConnection.evaluate(AbstractSailConnection.java:268) ~[rdf4j-storage-2.5-SNAPSHOT.jar:2.5-SNAPSHOT+6fdd72c]
	at org.eclipse.rdf4j.repository.sail.SailTupleQuery.evaluate(SailTupleQuery.java:54) ~[rdf4j-storage-2.5-SNAPSHOT.jar:2.5-SNAPSHOT+6fdd72c]
	at org.eclipse.rdf4j.repository.TupleQueryResultTest.testNotClosingResult(TupleQueryResultTest.java:271) ~[rdf4j-store-testsuite-2.5-SNAPSHOT.jar:2.5-SNAPSHOT+c01a444]
	at sun.reflect.NativeMethodAccessorImpl.invoke0(Native Method) ~[na:1.8.0_162]
	at sun.reflect.NativeMethodAccessorImpl.invoke(NativeMethodAccessorImpl.java:62) ~[na:1.8.0_162]
	at sun.reflect.DelegatingMethodAccessorImpl.invoke(DelegatingMethodAccessorImpl.java:43) ~[na:1.8.0_162]
	at java.lang.reflect.Method.invoke(Method.java:498) ~[na:1.8.0_162]
	at org.junit.runners.model.FrameworkMethod$1.runReflectiveCall(FrameworkMethod.java:50) [junit-4.12.jar:4.12]
	at org.junit.internal.runners.model.ReflectiveCallable.run(ReflectiveCallable.java:12) [junit-4.12.jar:4.12]
	at org.junit.runners.model.FrameworkMethod.invokeExplosively(FrameworkMethod.java:47) [junit-4.12.jar:4.12]
	at org.junit.internal.runners.statements.InvokeMethod.evaluate(InvokeMethod.java:17) [junit-4.12.jar:4.12]
	at org.junit.internal.runners.statements.RunBefores.evaluate(RunBefores.java:26) [junit-4.12.jar:4.12]
	at org.junit.internal.runners.statements.RunAfters.evaluate(RunAfters.java:27) [junit-4.12.jar:4.12]
	at org.junit.runners.ParentRunner.runLeaf(ParentRunner.java:325) [junit-4.12.jar:4.12]
	at org.junit.runners.BlockJUnit4ClassRunner.runChild(BlockJUnit4ClassRunner.java:78) [junit-4.12.jar:4.12]
	at org.junit.runners.BlockJUnit4ClassRunner.runChild(BlockJUnit4ClassRunner.java:57) [junit-4.12.jar:4.12]
	at org.junit.runners.ParentRunner$3.run(ParentRunner.java:290) [junit-4.12.jar:4.12]
	at org.junit.runners.ParentRunner$1.schedule(ParentRunner.java:71) [junit-4.12.jar:4.12]
	at org.junit.runners.ParentRunner.runChildren(ParentRunner.java:288) [junit-4.12.jar:4.12]
	at org.junit.runners.ParentRunner.access$000(ParentRunner.java:58) [junit-4.12.jar:4.12]
	at org.junit.runners.ParentRunner$2.evaluate(ParentRunner.java:268) [junit-4.12.jar:4.12]
	at org.junit.internal.runners.statements.RunBefores.evaluate(RunBefores.java:26) [junit-4.12.jar:4.12]
	at org.junit.runners.ParentRunner.run(ParentRunner.java:363) [junit-4.12.jar:4.12]
	at org.apache.maven.surefire.junit4.JUnit4Provider.execute(JUnit4Provider.java:367) [surefire-junit4-2.19.1.jar:2.19.1]
	at org.apache.maven.surefire.junit4.JUnit4Provider.executeWithRerun(JUnit4Provider.java:274) [surefire-junit4-2.19.1.jar:2.19.1]
	at org.apache.maven.surefire.junit4.JUnit4Provider.executeTestSet(JUnit4Provider.java:238) [surefire-junit4-2.19.1.jar:2.19.1]
	at org.apache.maven.surefire.junit4.JUnit4Provider.invoke(JUnit4Provider.java:161) [surefire-junit4-2.19.1.jar:2.19.1]
	at org.apache.maven.surefire.booter.ForkedBooter.invokeProviderInSameClassLoader(ForkedBooter.java:290) [surefire-booter-2.19.1.jar:2.19.1]
	at org.apache.maven.surefire.booter.ForkedBooter.runSuitesInProcess(ForkedBooter.java:242) [surefire-booter-2.19.1.jar:2.19.1]
	at org.apache.maven.surefire.booter.ForkedBooter.main(ForkedBooter.java:121) [surefire-booter-2.19.1.jar:2.19.1]
06:26:04.503 [main] WARN  Forced closing of unclosed iteration that was created in:
java.lang.Throwable: null
	at org.eclipse.rdf4j.sail.helpers.AbstractSailConnection.registerIteration(AbstractSailConnection.java:802) ~[rdf4j-storage-2.5-SNAPSHOT.jar:2.5-SNAPSHOT+6fdd72c]
	at org.eclipse.rdf4j.sail.helpers.AbstractSailConnection.evaluate(AbstractSailConnection.java:268) ~[rdf4j-storage-2.5-SNAPSHOT.jar:2.5-SNAPSHOT+6fdd72c]
	at org.eclipse.rdf4j.repository.sail.SailTupleQuery.evaluate(SailTupleQuery.java:54) ~[rdf4j-storage-2.5-SNAPSHOT.jar:2.5-SNAPSHOT+6fdd72c]
	at org.eclipse.rdf4j.repository.TupleQueryResultTest.testNotClosingResult(TupleQueryResultTest.java:271) ~[rdf4j-store-testsuite-2.5-SNAPSHOT.jar:2.5-SNAPSHOT+c01a444]
	at sun.reflect.NativeMethodAccessorImpl.invoke0(Native Method) ~[na:1.8.0_162]
	at sun.reflect.NativeMethodAccessorImpl.invoke(NativeMethodAccessorImpl.java:62) ~[na:1.8.0_162]
	at sun.reflect.DelegatingMethodAccessorImpl.invoke(DelegatingMethodAccessorImpl.java:43) ~[na:1.8.0_162]
	at java.lang.reflect.Method.invoke(Method.java:498) ~[na:1.8.0_162]
	at org.junit.runners.model.FrameworkMethod$1.runReflectiveCall(FrameworkMethod.java:50) [junit-4.12.jar:4.12]
	at org.junit.internal.runners.model.ReflectiveCallable.run(ReflectiveCallable.java:12) [junit-4.12.jar:4.12]
	at org.junit.runners.model.FrameworkMethod.invokeExplosively(FrameworkMethod.java:47) [junit-4.12.jar:4.12]
	at org.junit.internal.runners.statements.InvokeMethod.evaluate(InvokeMethod.java:17) [junit-4.12.jar:4.12]
	at org.junit.internal.runners.statements.RunBefores.evaluate(RunBefores.java:26) [junit-4.12.jar:4.12]
	at org.junit.internal.runners.statements.RunAfters.evaluate(RunAfters.java:27) [junit-4.12.jar:4.12]
	at org.junit.runners.ParentRunner.runLeaf(ParentRunner.java:325) [junit-4.12.jar:4.12]
	at org.junit.runners.BlockJUnit4ClassRunner.runChild(BlockJUnit4ClassRunner.java:78) [junit-4.12.jar:4.12]
	at org.junit.runners.BlockJUnit4ClassRunner.runChild(BlockJUnit4ClassRunner.java:57) [junit-4.12.jar:4.12]
	at org.junit.runners.ParentRunner$3.run(ParentRunner.java:290) [junit-4.12.jar:4.12]
	at org.junit.runners.ParentRunner$1.schedule(ParentRunner.java:71) [junit-4.12.jar:4.12]
	at org.junit.runners.ParentRunner.runChildren(ParentRunner.java:288) [junit-4.12.jar:4.12]
	at org.junit.runners.ParentRunner.access$000(ParentRunner.java:58) [junit-4.12.jar:4.12]
	at org.junit.runners.ParentRunner$2.evaluate(ParentRunner.java:268) [junit-4.12.jar:4.12]
	at org.junit.internal.runners.statements.RunBefores.evaluate(RunBefores.java:26) [junit-4.12.jar:4.12]
	at org.junit.runners.ParentRunner.run(ParentRunner.java:363) [junit-4.12.jar:4.12]
	at org.apache.maven.surefire.junit4.JUnit4Provider.execute(JUnit4Provider.java:367) [surefire-junit4-2.19.1.jar:2.19.1]
	at org.apache.maven.surefire.junit4.JUnit4Provider.executeWithRerun(JUnit4Provider.java:274) [surefire-junit4-2.19.1.jar:2.19.1]
	at org.apache.maven.surefire.junit4.JUnit4Provider.executeTestSet(JUnit4Provider.java:238) [surefire-junit4-2.19.1.jar:2.19.1]
	at org.apache.maven.surefire.junit4.JUnit4Provider.invoke(JUnit4Provider.java:161) [surefire-junit4-2.19.1.jar:2.19.1]
	at org.apache.maven.surefire.booter.ForkedBooter.invokeProviderInSameClassLoader(ForkedBooter.java:290) [surefire-booter-2.19.1.jar:2.19.1]
	at org.apache.maven.surefire.booter.ForkedBooter.runSuitesInProcess(ForkedBooter.java:242) [surefire-booter-2.19.1.jar:2.19.1]
	at org.apache.maven.surefire.booter.ForkedBooter.main(ForkedBooter.java:121) [surefire-booter-2.19.1.jar:2.19.1]
06:26:04.503 [main] WARN  Forced closing of unclosed iteration that was created in:
java.lang.Throwable: null
	at org.eclipse.rdf4j.sail.helpers.AbstractSailConnection.registerIteration(AbstractSailConnection.java:802) ~[rdf4j-storage-2.5-SNAPSHOT.jar:2.5-SNAPSHOT+6fdd72c]
	at org.eclipse.rdf4j.sail.helpers.AbstractSailConnection.evaluate(AbstractSailConnection.java:268) ~[rdf4j-storage-2.5-SNAPSHOT.jar:2.5-SNAPSHOT+6fdd72c]
	at org.eclipse.rdf4j.repository.sail.SailTupleQuery.evaluate(SailTupleQuery.java:54) ~[rdf4j-storage-2.5-SNAPSHOT.jar:2.5-SNAPSHOT+6fdd72c]
	at org.eclipse.rdf4j.repository.TupleQueryResultTest.testNotClosingResult(TupleQueryResultTest.java:271) ~[rdf4j-store-testsuite-2.5-SNAPSHOT.jar:2.5-SNAPSHOT+c01a444]
	at sun.reflect.NativeMethodAccessorImpl.invoke0(Native Method) ~[na:1.8.0_162]
	at sun.reflect.NativeMethodAccessorImpl.invoke(NativeMethodAccessorImpl.java:62) ~[na:1.8.0_162]
	at sun.reflect.DelegatingMethodAccessorImpl.invoke(DelegatingMethodAccessorImpl.java:43) ~[na:1.8.0_162]
	at java.lang.reflect.Method.invoke(Method.java:498) ~[na:1.8.0_162]
	at org.junit.runners.model.FrameworkMethod$1.runReflectiveCall(FrameworkMethod.java:50) [junit-4.12.jar:4.12]
	at org.junit.internal.runners.model.ReflectiveCallable.run(ReflectiveCallable.java:12) [junit-4.12.jar:4.12]
	at org.junit.runners.model.FrameworkMethod.invokeExplosively(FrameworkMethod.java:47) [junit-4.12.jar:4.12]
	at org.junit.internal.runners.statements.InvokeMethod.evaluate(InvokeMethod.java:17) [junit-4.12.jar:4.12]
	at org.junit.internal.runners.statements.RunBefores.evaluate(RunBefores.java:26) [junit-4.12.jar:4.12]
	at org.junit.internal.runners.statements.RunAfters.evaluate(RunAfters.java:27) [junit-4.12.jar:4.12]
	at org.junit.runners.ParentRunner.runLeaf(ParentRunner.java:325) [junit-4.12.jar:4.12]
	at org.junit.runners.BlockJUnit4ClassRunner.runChild(BlockJUnit4ClassRunner.java:78) [junit-4.12.jar:4.12]
	at org.junit.runners.BlockJUnit4ClassRunner.runChild(BlockJUnit4ClassRunner.java:57) [junit-4.12.jar:4.12]
	at org.junit.runners.ParentRunner$3.run(ParentRunner.java:290) [junit-4.12.jar:4.12]
	at org.junit.runners.ParentRunner$1.schedule(ParentRunner.java:71) [junit-4.12.jar:4.12]
	at org.junit.runners.ParentRunner.runChildren(ParentRunner.java:288) [junit-4.12.jar:4.12]
	at org.junit.runners.ParentRunner.access$000(ParentRunner.java:58) [junit-4.12.jar:4.12]
	at org.junit.runners.ParentRunner$2.evaluate(ParentRunner.java:268) [junit-4.12.jar:4.12]
	at org.junit.internal.runners.statements.RunBefores.evaluate(RunBefores.java:26) [junit-4.12.jar:4.12]
	at org.junit.runners.ParentRunner.run(ParentRunner.java:363) [junit-4.12.jar:4.12]
	at org.apache.maven.surefire.junit4.JUnit4Provider.execute(JUnit4Provider.java:367) [surefire-junit4-2.19.1.jar:2.19.1]
	at org.apache.maven.surefire.junit4.JUnit4Provider.executeWithRerun(JUnit4Provider.java:274) [surefire-junit4-2.19.1.jar:2.19.1]
	at org.apache.maven.surefire.junit4.JUnit4Provider.executeTestSet(JUnit4Provider.java:238) [surefire-junit4-2.19.1.jar:2.19.1]
	at org.apache.maven.surefire.junit4.JUnit4Provider.invoke(JUnit4Provider.java:161) [surefire-junit4-2.19.1.jar:2.19.1]
	at org.apache.maven.surefire.booter.ForkedBooter.invokeProviderInSameClassLoader(ForkedBooter.java:290) [surefire-booter-2.19.1.jar:2.19.1]
	at org.apache.maven.surefire.booter.ForkedBooter.runSuitesInProcess(ForkedBooter.java:242) [surefire-booter-2.19.1.jar:2.19.1]
	at org.apache.maven.surefire.booter.ForkedBooter.main(ForkedBooter.java:121) [surefire-booter-2.19.1.jar:2.19.1]
06:26:04.503 [main] WARN  Forced closing of unclosed iteration that was created in:
java.lang.Throwable: null
	at org.eclipse.rdf4j.sail.helpers.AbstractSailConnection.registerIteration(AbstractSailConnection.java:802) ~[rdf4j-storage-2.5-SNAPSHOT.jar:2.5-SNAPSHOT+6fdd72c]
	at org.eclipse.rdf4j.sail.helpers.AbstractSailConnection.evaluate(AbstractSailConnection.java:268) ~[rdf4j-storage-2.5-SNAPSHOT.jar:2.5-SNAPSHOT+6fdd72c]
	at org.eclipse.rdf4j.repository.sail.SailTupleQuery.evaluate(SailTupleQuery.java:54) ~[rdf4j-storage-2.5-SNAPSHOT.jar:2.5-SNAPSHOT+6fdd72c]
	at org.eclipse.rdf4j.repository.TupleQueryResultTest.testNotClosingResult(TupleQueryResultTest.java:271) ~[rdf4j-store-testsuite-2.5-SNAPSHOT.jar:2.5-SNAPSHOT+c01a444]
	at sun.reflect.NativeMethodAccessorImpl.invoke0(Native Method) ~[na:1.8.0_162]
	at sun.reflect.NativeMethodAccessorImpl.invoke(NativeMethodAccessorImpl.java:62) ~[na:1.8.0_162]
	at sun.reflect.DelegatingMethodAccessorImpl.invoke(DelegatingMethodAccessorImpl.java:43) ~[na:1.8.0_162]
	at java.lang.reflect.Method.invoke(Method.java:498) ~[na:1.8.0_162]
	at org.junit.runners.model.FrameworkMethod$1.runReflectiveCall(FrameworkMethod.java:50) [junit-4.12.jar:4.12]
	at org.junit.internal.runners.model.ReflectiveCallable.run(ReflectiveCallable.java:12) [junit-4.12.jar:4.12]
	at org.junit.runners.model.FrameworkMethod.invokeExplosively(FrameworkMethod.java:47) [junit-4.12.jar:4.12]
	at org.junit.internal.runners.statements.InvokeMethod.evaluate(InvokeMethod.java:17) [junit-4.12.jar:4.12]
	at org.junit.internal.runners.statements.RunBefores.evaluate(RunBefores.java:26) [junit-4.12.jar:4.12]
	at org.junit.internal.runners.statements.RunAfters.evaluate(RunAfters.java:27) [junit-4.12.jar:4.12]
	at org.junit.runners.ParentRunner.runLeaf(ParentRunner.java:325) [junit-4.12.jar:4.12]
	at org.junit.runners.BlockJUnit4ClassRunner.runChild(BlockJUnit4ClassRunner.java:78) [junit-4.12.jar:4.12]
	at org.junit.runners.BlockJUnit4ClassRunner.runChild(BlockJUnit4ClassRunner.java:57) [junit-4.12.jar:4.12]
	at org.junit.runners.ParentRunner$3.run(ParentRunner.java:290) [junit-4.12.jar:4.12]
	at org.junit.runners.ParentRunner$1.schedule(ParentRunner.java:71) [junit-4.12.jar:4.12]
	at org.junit.runners.ParentRunner.runChildren(ParentRunner.java:288) [junit-4.12.jar:4.12]
	at org.junit.runners.ParentRunner.access$000(ParentRunner.java:58) [junit-4.12.jar:4.12]
	at org.junit.runners.ParentRunner$2.evaluate(ParentRunner.java:268) [junit-4.12.jar:4.12]
	at org.junit.internal.runners.statements.RunBefores.evaluate(RunBefores.java:26) [junit-4.12.jar:4.12]
	at org.junit.runners.ParentRunner.run(ParentRunner.java:363) [junit-4.12.jar:4.12]
	at org.apache.maven.surefire.junit4.JUnit4Provider.execute(JUnit4Provider.java:367) [surefire-junit4-2.19.1.jar:2.19.1]
	at org.apache.maven.surefire.junit4.JUnit4Provider.executeWithRerun(JUnit4Provider.java:274) [surefire-junit4-2.19.1.jar:2.19.1]
	at org.apache.maven.surefire.junit4.JUnit4Provider.executeTestSet(JUnit4Provider.java:238) [surefire-junit4-2.19.1.jar:2.19.1]
	at org.apache.maven.surefire.junit4.JUnit4Provider.invoke(JUnit4Provider.java:161) [surefire-junit4-2.19.1.jar:2.19.1]
	at org.apache.maven.surefire.booter.ForkedBooter.invokeProviderInSameClassLoader(ForkedBooter.java:290) [surefire-booter-2.19.1.jar:2.19.1]
	at org.apache.maven.surefire.booter.ForkedBooter.runSuitesInProcess(ForkedBooter.java:242) [surefire-booter-2.19.1.jar:2.19.1]
	at org.apache.maven.surefire.booter.ForkedBooter.main(ForkedBooter.java:121) [surefire-booter-2.19.1.jar:2.19.1]
Tests run: 5, Failures: 0, Errors: 0, Skipped: 0, Time elapsed: 6.386 sec - in org.eclipse.rdf4j.repository.sail.memory.MemoryTupleQueryResultTest

Results :

Failed tests: 
  MemCustomInferencingTest>CustomGraphQueryInferencerTest.testCustomQueryInferenceImplicitMatcher:186->CustomGraphQueryInferencerTest.runTest:106 
Expecting an array but was:<org.eclipse.rdf4j.sail.CustomGraphQueryInferencerTest$Expectation@397fbdb>
  MemCustomInferencingTest>CustomGraphQueryInferencerTest.testCustomQueryInferenceImplicitMatcher:186->CustomGraphQueryInferencerTest.runTest:106 
Expecting an array but was:<org.eclipse.rdf4j.sail.CustomGraphQueryInferencerTest$Expectation@397fbdb>
  MemCustomInferencingTest>CustomGraphQueryInferencerTest.testCustomQueryInferenceImplicitMatcher:186->CustomGraphQueryInferencerTest.runTest:106 
Expecting an array but was:<org.eclipse.rdf4j.sail.CustomGraphQueryInferencerTest$Expectation@1a677343>
  MemCustomInferencingTest>CustomGraphQueryInferencerTest.testCustomQueryInference:178->CustomGraphQueryInferencerTest.runTest:106 
Expecting an array but was:<org.eclipse.rdf4j.sail.CustomGraphQueryInferencerTest$Expectation@397fbdb>
  MemCustomInferencingTest>CustomGraphQueryInferencerTest.testCustomQueryInference:178->CustomGraphQueryInferencerTest.runTest:106 
Expecting an array but was:<org.eclipse.rdf4j.sail.CustomGraphQueryInferencerTest$Expectation@397fbdb>
  MemCustomInferencingTest>CustomGraphQueryInferencerTest.testCustomQueryInference:178->CustomGraphQueryInferencerTest.runTest:106 
Expecting an array but was:<org.eclipse.rdf4j.sail.CustomGraphQueryInferencerTest$Expectation@1a677343>
  NativeStoreCustomInferencingTest>CustomGraphQueryInferencerTest.testCustomQueryInferenceImplicitMatcher:186->CustomGraphQueryInferencerTest.runTest:106 
Expecting an array but was:<org.eclipse.rdf4j.sail.CustomGraphQueryInferencerTest$Expectation@3eb738bb>
  NativeStoreCustomInferencingTest>CustomGraphQueryInferencerTest.testCustomQueryInferenceImplicitMatcher:186->CustomGraphQueryInferencerTest.runTest:106 
Expecting an array but was:<org.eclipse.rdf4j.sail.CustomGraphQueryInferencerTest$Expectation@3eb738bb>
  NativeStoreCustomInferencingTest>CustomGraphQueryInferencerTest.testCustomQueryInferenceImplicitMatcher:186->CustomGraphQueryInferencerTest.runTest:106 
Expecting an array but was:<org.eclipse.rdf4j.sail.CustomGraphQueryInferencerTest$Expectation@22fcf7ab>
  NativeStoreCustomInferencingTest>CustomGraphQueryInferencerTest.testCustomQueryInference:178->CustomGraphQueryInferencerTest.runTest:106 
Expecting an array but was:<org.eclipse.rdf4j.sail.CustomGraphQueryInferencerTest$Expectation@3eb738bb>
  NativeStoreCustomInferencingTest>CustomGraphQueryInferencerTest.testCustomQueryInference:178->CustomGraphQueryInferencerTest.runTest:106 
Expecting an array but was:<org.eclipse.rdf4j.sail.CustomGraphQueryInferencerTest$Expectation@3eb738bb>
  NativeStoreCustomInferencingTest>CustomGraphQueryInferencerTest.testCustomQueryInference:178->CustomGraphQueryInferencerTest.runTest:106 
Expecting an array but was:<org.eclipse.rdf4j.sail.CustomGraphQueryInferencerTest$Expectation@22fcf7ab>

Tests run: 4820, Failures: 12, Errors: 0, Skipped: 150

[INFO] 
[INFO] --- maven-failsafe-plugin:2.19.1:verify (verify) @ rdf4j-store-compliance ---
[INFO] ------------------------------------------------------------------------
[INFO] Reactor Summary:
[INFO] 
[INFO] RDF4J Storage 2.5-SNAPSHOT ......................... SUCCESS [  1.353 s]
[INFO] RDF4J: Sail API .................................... SUCCESS [  3.020 s]
[INFO] RDF4J: Sail Model .................................. SUCCESS [  0.838 s]
[INFO] RDF4J: Inferencer Sails ............................ SUCCESS [  1.710 s]
[INFO] RDF4J: Query algebra - evaluation .................. SUCCESS [  9.808 s]
[INFO] RDF4J: Sail base implementations ................... SUCCESS [  0.923 s]
[INFO] RDF4J: MemoryStore ................................. SUCCESS [  3.306 s]
[INFO] RDF4J: SailRepository .............................. SUCCESS [  3.584 s]
[INFO] RDF4J Lucene Sail API .............................. SUCCESS [  2.294 s]
[INFO] RDF4J Elastic Search Sail Index .................... SUCCESS [  3.861 s]
[INFO] RDF4J: Federation SAIL ............................. SUCCESS [  4.088 s]
[INFO] RDF4J: Query algebra - GeoSPARQL ................... SUCCESS [  0.930 s]
[INFO] RDF4J Lucene Sail Index ............................ SUCCESS [  6.139 s]
[INFO] RDF4J: SPIN ........................................ SUCCESS [  7.299 s]
[INFO] RDF4J: SPIN SAIL ................................... SUCCESS [01:42 min]
[INFO] RDF4J: NativeStore ................................. SUCCESS [  4.578 s]
[INFO] RDF4J Lucene Sail Spin ............................. SUCCESS [ 26.481 s]
[INFO] RDF4J: DatasetRepository (wrapper) ................. SUCCESS [  0.846 s]
[INFO] RDF4J Solr Sail Index .............................. SUCCESS [  6.602 s]
[INFO] RDF4J: SHACL ....................................... SUCCESS [  7.218 s]
[INFO] RDF4J: Storage ..................................... SUCCESS [ 21.348 s]
[INFO] RDF4J compliance tests ............................. SUCCESS [  0.513 s]
[INFO] RDF4J Model compliance test ........................ SUCCESS [  6.075 s]
[INFO] RDF4J Elasticsearch Sail Tests ..................... SUCCESS [01:12 min]
[INFO] RDF4J Solr Sail Tests .............................. SUCCESS [01:08 min]
[INFO] RDF4J SAIL and Repository compliance test .......... FAILURE [24:45 min]
[INFO] RDF4J SeRQL query parser compliance tests .......... SKIPPED
[INFO] RDF4J GeoSPARQL compliance tests ................... SKIPPED
[INFO] RDF4J SHACL compliance tests 2.5-SNAPSHOT .......... SKIPPED
[INFO] ------------------------------------------------------------------------
[INFO] BUILD FAILURE
[INFO] ------------------------------------------------------------------------
[INFO] Total time: 30:51 min
[INFO] Finished at: 2018-07-03T06:26:04-04:00
[INFO] ------------------------------------------------------------------------
[ERROR] Failed to execute goal org.apache.maven.plugins:maven-failsafe-plugin:2.19.1:verify (verify) on project rdf4j-store-compliance: There are test failures.
[ERROR] 
[ERROR] Please refer to /jobs/genie.rdf4j/rdf4j-storage-develop-verify/workspace/compliance/store/target/failsafe-reports for the individual test results.
[ERROR] -> [Help 1]
[ERROR] 
[ERROR] To see the full stack trace of the errors, re-run Maven with the -e switch.
[ERROR] Re-run Maven using the -X switch to enable full debug logging.
[ERROR] 
[ERROR] For more information about the errors and possible solutions, please read the following articles:
[ERROR] [Help 1] http://cwiki.apache.org/confluence/display/MAVEN/MojoFailureException
[ERROR] 
[ERROR] After correcting the problems, you can resume the build with the command
[ERROR]   mvn <goals> -rf :rdf4j-store-compliance
Build step 'Invoke top-level Maven targets' marked build as failure
Not sending mail to unregistered user james.leigh@xxxxxxxxxxxx
Not sending mail to unregistered user jeen.broekstra@xxxxxxxxx
Not sending mail to unregistered user joe@xxxxxxxxxxx