Skip to main content

[Date Prev][Date Next][Thread Prev][Thread Next][Date Index][Thread Index] [List Home]
[rdf4j-dev] [Hudson] Build failed in Hudson: rdf4j-2.0-verify #12

See <https://hudson.eclipse.org/rdf4j/job/rdf4j-2.0-verify/12/>

------------------------------------------
[...truncated 10054 lines...]
Test statements size: 98037 (TriG (mimeTypes=application/trig, application/x-trig; ext=trig))
Write took: 429 ms (TriG (mimeTypes=application/trig, application/x-trig; ext=trig))
File size (bytes): 13766360
Parse took: 828 ms (TriG (mimeTypes=application/trig, application/x-trig; ext=trig))
Tests run: 10, Failures: 0, Errors: 0, Skipped: 0, Time elapsed: 27.65 sec - in org.eclipse.rdf4j.rio.trig.TriGWriterTest
Java HotSpot(TM) 64-Bit Server VM warning: ignoring option MaxPermSize=256M; support was removed in 8.0
Running org.eclipse.rdf4j.rio.helpers.RDFParserHelperTest
22:07:06.158 [main] DEBUG Registered service class org.eclipse.rdf4j.rio.datatypes.XMLSchemaDatatypeHandler
22:07:06.163 [main] DEBUG Registered service class org.eclipse.rdf4j.rio.datatypes.RDFDatatypeHandler
22:07:06.164 [main] DEBUG Registered service class org.eclipse.rdf4j.rio.datatypes.DBPediaDatatypeHandler
22:07:06.170 [main] DEBUG Registered service class org.eclipse.rdf4j.rio.datatypes.VirtuosoGeometryDatatypeHandler
22:07:06.171 [main] DEBUG Registered service class org.eclipse.rdf4j.rio.datatypes.GeoSPARQLDatatypeHandler
22:07:06.173 [main] DEBUG Registered service class org.eclipse.rdf4j.rio.languages.RFC3066LanguageHandler
Tests run: 19, Failures: 0, Errors: 0, Skipped: 5, Time elapsed: 0.265 sec - in org.eclipse.rdf4j.rio.helpers.RDFParserHelperTest

Results :

Tests run: 1566, Failures: 0, Errors: 0, Skipped: 12

[INFO] 
[INFO] --- maven-failsafe-plugin:2.17:verify (verify) @ rdf4j-rio-compliance ---
[INFO] Failsafe report directory: /jobs/genie.rdf4j/rdf4j-2.0-verify/workspace/compliance/rio/target/failsafe-reports
[INFO]                                                                         
[INFO] ------------------------------------------------------------------------
[INFO] Building RDF4J HTTP server compliance tests 2.0-SNAPSHOT
[INFO] ------------------------------------------------------------------------
[INFO] 
[INFO] --- maven-clean-plugin:2.4.1:clean (default-clean) @ rdf4j-http-compliance ---
[INFO] Deleting /jobs/genie.rdf4j/rdf4j-2.0-verify/workspace/compliance/http/target
[INFO] 
[INFO] --- maven-enforcer-plugin:1.3.1:enforce (enforce-bytecode-version) @ rdf4j-http-compliance ---
[INFO] 
[INFO] --- maven-resources-plugin:2.5:resources (default-resources) @ rdf4j-http-compliance ---
[debug] execute contextualize
[INFO] Using 'UTF-8' encoding to copy filtered resources.
[INFO] skip non existing resourceDirectory /jobs/genie.rdf4j/rdf4j-2.0-verify/workspace/compliance/http/src/main/resources
[INFO] 
[INFO] --- maven-compiler-plugin:2.3.2:compile (default-compile) @ rdf4j-http-compliance ---
[INFO] No sources to compile
[INFO] 
[INFO] --- maven-resources-plugin:2.5:testResources (default-testResources) @ rdf4j-http-compliance ---
[debug] execute contextualize
[INFO] Using 'UTF-8' encoding to copy filtered resources.
[INFO] Copying 4 resources
[INFO] 
[INFO] --- maven-compiler-plugin:2.3.2:testCompile (default-testCompile) @ rdf4j-http-compliance ---
[INFO] Compiling 2 source files to /jobs/genie.rdf4j/rdf4j-2.0-verify/workspace/compliance/http/target/test-classes
[INFO] 
[INFO] --- maven-surefire-plugin:2.17:test (default-test) @ rdf4j-http-compliance ---
[INFO] Tests are skipped.
[INFO] 
[INFO] --- maven-war-plugin:2.1.1:war (default-war) @ rdf4j-http-compliance ---
[INFO] Packaging webapp
[INFO] Assembling webapp [rdf4j-http-compliance] in [/jobs/genie.rdf4j/rdf4j-2.0-verify/workspace/compliance/http/target/openrdf-sesame]
[INFO] Processing war project
[INFO] Processing overlay [ id org.eclipse.rdf4j:rdf4j-http-server]
[INFO] Webapp assembled in [332 msecs]
[INFO] Building war: /jobs/genie.rdf4j/rdf4j-2.0-verify/workspace/compliance/http/target/rdf4j-http-compliance-2.0-SNAPSHOT.war
[INFO] WEB-INF/web.xml already added, skipping
[INFO] 
[INFO] --- maven-failsafe-plugin:2.17:integration-test (integration-tests) @ rdf4j-http-compliance ---
[INFO] Failsafe report directory: /jobs/genie.rdf4j/rdf4j-2.0-verify/workspace/compliance/http/target/failsafe-reports

-------------------------------------------------------
 T E S T S
-------------------------------------------------------

-------------------------------------------------------
 T E S T S
-------------------------------------------------------
Java HotSpot(TM) 64-Bit Server VM warning: ignoring option MaxPermSize=256M; support was removed in 8.0
Running org.eclipse.rdf4j.http.server.ProtocolTest
Tests run: 1, Failures: 0, Errors: 1, Skipped: 0, Time elapsed: 6.418 sec <<< FAILURE! - in org.eclipse.rdf4j.http.server.ProtocolTest
org.eclipse.rdf4j.http.server.ProtocolTest  Time elapsed: 6.418 sec  <<< ERROR!
java.net.BindException: Address already in use
	at sun.nio.ch.Net.bind0(Native Method)
	at sun.nio.ch.Net.bind(Net.java:437)
	at sun.nio.ch.Net.bind(Net.java:429)
	at sun.nio.ch.ServerSocketChannelImpl.bind(ServerSocketChannelImpl.java:223)
	at sun.nio.ch.ServerSocketAdaptor.bind(ServerSocketAdaptor.java:74)
	at org.eclipse.jetty.server.nio.BlockingChannelConnector.open(BlockingChannelConnector.java:73)
	at org.eclipse.jetty.server.AbstractConnector.doStart(AbstractConnector.java:415)
	at org.eclipse.jetty.util.component.AbstractLifeCycle.start(AbstractLifeCycle.java:55)
	at org.eclipse.jetty.server.Server.doStart(Server.java:241)
	at org.eclipse.jetty.util.component.AbstractLifeCycle.start(AbstractLifeCycle.java:55)
	at org.eclipse.rdf4j.http.server.TestServer.start(TestServer.java:76)
	at org.eclipse.rdf4j.http.server.ProtocolTest.startServer(ProtocolTest.java:58)


Results :

Tests in error: 
  ProtocolTest.startServer:58 ยป Bind Address already in use

Tests run: 1, Failures: 0, Errors: 1, Skipped: 0

[INFO] 
[INFO] --- maven-failsafe-plugin:2.17:verify (verify) @ rdf4j-http-compliance ---
[INFO] Failsafe report directory: /jobs/genie.rdf4j/rdf4j-2.0-verify/workspace/compliance/http/target/failsafe-reports
[INFO] ------------------------------------------------------------------------
[INFO] Reactor Summary:
[INFO] 
[INFO] RDF4J .............................................. SUCCESS [  0.276 s]
[INFO] RDF4J Core ......................................... SUCCESS [  0.045 s]
[INFO] RDF4J: util ........................................ SUCCESS [  3.120 s]
[INFO] RDF4J: Model ....................................... SUCCESS [  3.952 s]
[INFO] RDF4J: Rio ......................................... SUCCESS [  0.044 s]
[INFO] RDF4J: Rio - API ................................... SUCCESS [  2.038 s]
[INFO] RDF4J: Rio - Languages ............................. SUCCESS [  0.686 s]
[INFO] RDF4J: Rio - Datatypes ............................. SUCCESS [  1.564 s]
[INFO] RDF4J: Rio - Binary ................................ SUCCESS [  0.931 s]
[INFO] RDF4J: Rio - JSON-LD ............................... SUCCESS [  2.294 s]
[INFO] RDF4J: Rio - Turtle ................................ SUCCESS [  1.879 s]
[INFO] RDF4J: Rio - N3 (writer-only) ...................... SUCCESS [  0.693 s]
[INFO] RDF4J: Rio - N-Triples ............................. SUCCESS [  0.970 s]
[INFO] RDF4J: Rio - N-Quads ............................... SUCCESS [  0.873 s]
[INFO] RDF4J: Rio - RDF/JSON .............................. SUCCESS [  1.293 s]
[INFO] RDF4J: Rio - RDF/XML ............................... SUCCESS [  1.890 s]
[INFO] RDF4J: Rio - TriX .................................. SUCCESS [  0.790 s]
[INFO] RDF4J: Rio - TriG .................................. SUCCESS [  0.689 s]
[INFO] RDF4J: Query ....................................... SUCCESS [  2.375 s]
[INFO] RDF4J: Query result IO ............................. SUCCESS [  0.046 s]
[INFO] RDF4J: Query result IO - API ....................... SUCCESS [  0.852 s]
[INFO] RDF4J: Query result IO - binary .................... SUCCESS [  0.815 s]
[INFO] RDF4J: Query result IO - SPARQL/JSON ............... SUCCESS [  1.040 s]
[INFO] RDF4J: Query result IO - SPARQL/XML ................ SUCCESS [  0.994 s]
[INFO] RDF4J: Query result IO - plain text booleans ....... SUCCESS [  0.890 s]
[INFO] RDF4J: Query algebra ............................... SUCCESS [  0.042 s]
[INFO] RDF4J: Query algebra - model ....................... SUCCESS [  1.761 s]
[INFO] RDF4J: Repository .................................. SUCCESS [  0.044 s]
[INFO] RDF4J: Repository - API ............................ SUCCESS [  2.410 s]
[INFO] RDF4J: HTTP ........................................ SUCCESS [  0.041 s]
[INFO] RDF4J: HTTP protocol ............................... SUCCESS [  1.806 s]
[INFO] RDF4J: HTTP client ................................. SUCCESS [  2.410 s]
[INFO] RDF4J: Query parser ................................ SUCCESS [  0.042 s]
[INFO] RDF4J: Query parser - API .......................... SUCCESS [  1.626 s]
[INFO] RDF4J: Query parser - SPARQL ....................... SUCCESS [  4.028 s]
[INFO] RDF4J: SPARQL Repository ........................... SUCCESS [  1.173 s]
[INFO] RDF4J: Query algebra - evaluation .................. SUCCESS [  4.535 s]
[INFO] RDF4J: Query algebra - GeoSPARQL ................... SUCCESS [  1.072 s]
[INFO] RDF4J: Query parser - SeRQL ........................ SUCCESS [  2.604 s]
[INFO] RDF4J: Query Rendering ............................. SUCCESS [  1.547 s]
[INFO] RDF4J: Sail ........................................ SUCCESS [  0.041 s]
[INFO] RDF4J: Sail API .................................... SUCCESS [  1.102 s]
[INFO] RDF4J: Sail Model .................................. SUCCESS [  0.852 s]
[INFO] RDF4J: Inferencer Sails ............................ SUCCESS [  1.248 s]
[INFO] RDF4J: Sail base implementations ................... SUCCESS [  1.384 s]
[INFO] RDF4J: MemoryStore ................................. SUCCESS [  3.452 s]
[INFO] RDF4J: SailRepository .............................. SUCCESS [  2.487 s]
[INFO] RDF4J: Federation SAIL ............................. SUCCESS [  3.386 s]
[INFO] RDF4J: NativeStore ................................. SUCCESS [  4.074 s]
[INFO] RDF4J Full Text Search (FTS) Sails ................. SUCCESS [  0.043 s]
[INFO] RDF4J Lucene Sail API .............................. SUCCESS [  2.697 s]
[INFO] RDF4J test suites .................................. SUCCESS [  0.041 s]
[INFO] RDF4J Lucene Sail Tests ............................ SUCCESS [  1.077 s]
[INFO] RDF4J Lucene Sail Index ............................ SUCCESS [  3.986 s]
[INFO] RDF4J Elastic Search Sail Index .................... SUCCESS [ 10.132 s]
[INFO] RDF4J Solr Sail Index .............................. SUCCESS [ 29.609 s]
[INFO] RDF4J: SPIN ........................................ SUCCESS [  3.654 s]
[INFO] RDF4J: SPIN SAIL ................................... SUCCESS [02:42 min]
[INFO] RDF4J: Repository - event (wrapper) ................ SUCCESS [  1.777 s]
[INFO] RDF4J: HTTPRepository .............................. SUCCESS [  1.076 s]
[INFO] RDF4J: Repository manager .......................... SUCCESS [  2.261 s]
[INFO] RDF4J: DatasetRepository (wrapper) ................. SUCCESS [  0.927 s]
[INFO] RDF4J: Repository - context aware (wrapper) ........ SUCCESS [  1.931 s]
[INFO] RDF4J: application configuration ................... SUCCESS [  2.144 s]
[INFO] RDF4J: Runtime ..................................... SUCCESS [  3.398 s]
[INFO] RDF4J: Console ..................................... SUCCESS [  3.573 s]
[INFO] RDF4J: HTTP server - core .......................... SUCCESS [  2.947 s]
[INFO] RDF4J: HTTP server ................................. SUCCESS [  3.285 s]
[INFO] RDF4J Workbench .................................... SUCCESS [  5.525 s]
[INFO] RDF4J: Runtime - OSGi .............................. SUCCESS [  3.683 s]
[INFO] RDF4J: Assembly .................................... SUCCESS [  0.603 s]
[INFO] RDF4J Model API compliance test suite .............. SUCCESS [  1.060 s]
[INFO] RDF4J Query Result IO compliance test suite ........ SUCCESS [  1.182 s]
[INFO] RDF4J Rio compliance test suite .................... SUCCESS [  2.657 s]
[INFO] RDF4J SeRQL test suite ............................. SUCCESS [  1.133 s]
[INFO] RDF4J SPARQL compliance test suite ................. SUCCESS [  2.359 s]
[INFO] RDF4J GeoSPARQL compliance test suite .............. SUCCESS [  3.304 s]
[INFO] RDF4J SAIL and Repository API compliance test suite  SUCCESS [  5.719 s]
[INFO] RDF4J compliance tests ............................. SUCCESS [  0.042 s]
[INFO] RDF4J Model compliance test ........................ SUCCESS [  5.112 s]
[INFO] RDF4J Query Result IO compliance tests ............. SUCCESS [  5.484 s]
[INFO] RDF4J Rio compliance tests ......................... SUCCESS [04:13 min]
[INFO] RDF4J HTTP server compliance tests ................. FAILURE [  9.283 s]
[INFO] RDF4J SAIL and Repository compliance test .......... SKIPPED
[INFO] RDF4J SeRQL query parser compliance tests .......... SKIPPED
[INFO] RDF4J SPARQL query parser compliance tests ......... SKIPPED
[INFO] RDF4J GeoSPARQL compliance tests ................... SKIPPED
[INFO] RDF4J BOM .......................................... SKIPPED
[INFO] ------------------------------------------------------------------------
[INFO] BUILD FAILURE
[INFO] ------------------------------------------------------------------------
[INFO] Total time: 10:19 min
[INFO] Finished at: 2016-05-31T22:07:15-04:00
[INFO] Final Memory: 95M/3989M
[INFO] ------------------------------------------------------------------------
[INFO] o.h.m.e.h.MavenExecutionResultHandler - Build failed with exception(s)
[INFO] o.h.m.e.h.MavenExecutionResultHandler - [1] org.apache.maven.lifecycle.LifecycleExecutionException: Failed to execute goal org.apache.maven.plugins:maven-failsafe-plugin:2.17:verify (verify) on project rdf4j-http-compliance: There are test failures.

Please refer to /jobs/genie.rdf4j/rdf4j-2.0-verify/workspace/compliance/http/target/failsafe-reports for the individual test results.
[DEBUG] Closing connection to remote
[ERROR] Failed to execute goal org.apache.maven.plugins:maven-failsafe-plugin:2.17:verify (verify) on project rdf4j-http-compliance: There are test failures.
[ERROR] 
[ERROR] Please refer to /jobs/genie.rdf4j/rdf4j-2.0-verify/workspace/compliance/http/target/failsafe-reports for the individual test results.
[ERROR] -> [Help 1]
org.apache.maven.lifecycle.LifecycleExecutionException: Failed to execute goal org.apache.maven.plugins:maven-failsafe-plugin:2.17:verify (verify) on project rdf4j-http-compliance: There are test failures.

Please refer to /jobs/genie.rdf4j/rdf4j-2.0-verify/workspace/compliance/http/target/failsafe-reports for the individual test results.
	at org.apache.maven.lifecycle.internal.MojoExecutor.execute(MojoExecutor.java:212)
	at org.apache.maven.lifecycle.internal.MojoExecutor.execute(MojoExecutor.java:153)
	at org.apache.maven.lifecycle.internal.MojoExecutor.execute(MojoExecutor.java:145)
	at org.apache.maven.lifecycle.internal.LifecycleModuleBuilder.buildProject(LifecycleModuleBuilder.java:116)
	at org.apache.maven.lifecycle.internal.LifecycleModuleBuilder.buildProject(LifecycleModuleBuilder.java:80)
	at org.apache.maven.lifecycle.internal.builder.singlethreaded.SingleThreadedBuilder.build(SingleThreadedBuilder.java:51)
	at org.apache.maven.lifecycle.internal.LifecycleStarter.execute(LifecycleStarter.java:128)
	at org.apache.maven.DefaultMaven.doExecute(DefaultMaven.java:307)
	at org.apache.maven.DefaultMaven.doExecute(DefaultMaven.java:193)
	at org.apache.maven.DefaultMaven.execute(DefaultMaven.java:106)
	at org.apache.maven.cli.MavenCli.execute(MavenCli.java:863)
	at org.apache.maven.cli.MavenCli.doMain(MavenCli.java:288)
	at org.apache.maven.cli.MavenCli.main(MavenCli.java:199)
	at sun.reflect.NativeMethodAccessorImpl.invoke0(Native Method)
	at sun.reflect.NativeMethodAccessorImpl.invoke(NativeMethodAccessorImpl.java:62)
	at sun.reflect.DelegatingMethodAccessorImpl.invoke(DelegatingMethodAccessorImpl.java:43)
	at java.lang.reflect.Method.invoke(Method.java:497)
	at org.codehaus.plexus.classworlds.launcher.Launcher.launchEnhanced(Launcher.java:289)
	at org.codehaus.plexus.classworlds.launcher.Launcher.launch(Launcher.java:229)
	at org.codehaus.plexus.classworlds.launcher.Launcher.mainWithExitCode(Launcher.java:415)
	at org.codehaus.plexus.classworlds.launcher.Launcher.main(Launcher.java:356)
Caused by: org.apache.maven.plugin.MojoFailureException: There are test failures.

Please refer to /jobs/genie.rdf4j/rdf4j-2.0-verify/workspace/compliance/http/target/failsafe-reports for the individual test results.
	at org.apache.maven.plugin.surefire.SurefireHelper.reportExecution(SurefireHelper.java:82)
	at org.apache.maven.plugin.failsafe.VerifyMojo.execute(VerifyMojo.java:194)
	at org.apache.maven.plugin.DefaultBuildPluginManager.executeMojo(DefaultBuildPluginManager.java:134)
	at org.apache.maven.lifecycle.internal.MojoExecutor.execute(MojoExecutor.java:207)
	... 20 more
[ERROR] 
[ERROR] Re-run Maven using the -X switch to enable full debug logging.
[ERROR] 
[ERROR] For more information about the errors and possible solutions, please read the following articles:
[ERROR] [Help 1] http://cwiki.apache.org/confluence/display/MAVEN/MojoFailureException
[ERROR] 
[ERROR] After correcting the problems, you can resume the build with the command
[ERROR]   mvn <goals> -rf :rdf4j-http-compliance
[DEBUG] Waiting for process to finish
[DEBUG] Result: 1
Recording test results

--
This message is automatically generated by Hudson. 
For more information on Hudson, see: http://hudson-ci.org/


Back to the top