[Date Prev][Date Next][Thread Prev][Thread Next][Date Index][Thread Index] [List Home]
[ptp-dev] Build failed in Hudson: ptp-nightly #557

See <https://hudson.eclipse.org/hudson/job/ptp-nightly/557/>

------------------------------------------
Started by upstream project "ptp-photran-nightly" build number 83
Building remotely on hudson-slave1
Checkout:ptp-nightly / <https://hudson.eclipse.org/hudson/job/ptp-nightly/ws/> - hudson.remoting.Channel@73f4c5ce:hudson-slave1
Using strategy: Default
Last Built Revision: Revision 66180cd01a132e6d99bf2e86eb31cddd89d8895a (origin1/master)
Checkout:ptp-nightly / <https://hudson.eclipse.org/hudson/job/ptp-nightly/ws/> - hudson.remoting.LocalChannel@6c5b51a7
Fetching changes from the remote Git repository
Fetching upstream changes from git://git.eclipse.org/gitroot/ptp/org.eclipse.ptp.git
Commencing build of Revision 66180cd01a132e6d99bf2e86eb31cddd89d8895a (origin1/master)
Checking out Revision 66180cd01a132e6d99bf2e86eb31cddd89d8895a (origin1/master)
[ptp-nightly] $ /shared/common/apache-maven-3.0.3/bin/mvn -Dmaven.repo.local=<https://hudson.eclipse.org/hudson/job/ptp-nightly/ws/.repository> -P production clean install
[INFO] Scanning for projects...
[WARNING] The POM for org.apache.maven.plugins:tycho-packaging-plugin:jar:0.15.0 is missing, no dependency information available
[ERROR] Internal error: java.lang.RuntimeException: org.apache.maven.MavenExecutionException: Could not setup plugin ClassRealm: Plugin org.apache.maven.plugins:tycho-packaging-plugin:0.15.0 or one of its dependencies could not be resolved: Failed to read artifact descriptor for org.apache.maven.plugins:tycho-packaging-plugin:jar:0.15.0: Failure to find org.apache.maven.plugins:tycho-packaging-plugin:pom:0.15.0 in https://repository.sonatype.org/content/repositories/public was cached in the local repository, resolution will not be reattempted until the update interval of sonatype has elapsed or updates are forced -> [Help 1]
org.apache.maven.InternalErrorException: Internal error: java.lang.RuntimeException: org.apache.maven.MavenExecutionException: Could not setup plugin ClassRealm
	at org.apache.maven.DefaultMaven.execute(DefaultMaven.java:168)
	at org.apache.maven.cli.MavenCli.execute(MavenCli.java:537)
	at org.apache.maven.cli.MavenCli.doMain(MavenCli.java:196)
	at org.apache.maven.cli.MavenCli.main(MavenCli.java:141)
	at sun.reflect.NativeMethodAccessorImpl.invoke0(Native Method)
	at sun.reflect.NativeMethodAccessorImpl.invoke(NativeMethodAccessorImpl.java:39)
	at sun.reflect.DelegatingMethodAccessorImpl.invoke(DelegatingMethodAccessorImpl.java:25)
	at java.lang.reflect.Method.invoke(Method.java:597)
	at org.codehaus.plexus.classworlds.launcher.Launcher.launchEnhanced(Launcher.java:290)
	at org.codehaus.plexus.classworlds.launcher.Launcher.launch(Launcher.java:230)
	at org.codehaus.plexus.classworlds.launcher.Launcher.mainWithExitCode(Launcher.java:409)
	at org.codehaus.plexus.classworlds.launcher.Launcher.main(Launcher.java:352)
Caused by: java.lang.RuntimeException: org.apache.maven.MavenExecutionException: Could not setup plugin ClassRealm
	at org.eclipse.tycho.p2.resolver.P2TargetPlatformResolver.getDependencyMetadata(P2TargetPlatformResolver.java:179)
	at org.eclipse.tycho.p2.resolver.P2TargetPlatformResolver.setupProjects(P2TargetPlatformResolver.java:141)
	at org.eclipse.tycho.core.resolver.DefaultTychoDependencyResolver.setupProject(DefaultTychoDependencyResolver.java:76)
	at org.eclipse.tycho.core.maven.TychoMavenLifecycleParticipant.afterProjectsRead(TychoMavenLifecycleParticipant.java:59)
	at org.apache.maven.DefaultMaven.doExecute(DefaultMaven.java:273)
	at org.apache.maven.DefaultMaven.execute(DefaultMaven.java:156)
	... 11 more
Caused by: org.apache.maven.MavenExecutionException: Could not setup plugin ClassRealm
	at org.eclipse.tycho.core.maven.utils.PluginRealmHelper.newMavenExecutionException(PluginRealmHelper.java:134)
	at org.eclipse.tycho.core.maven.utils.PluginRealmHelper.execute(PluginRealmHelper.java:123)
	at org.eclipse.tycho.p2.resolver.P2TargetPlatformResolver.getDependencyMetadata(P2TargetPlatformResolver.java:159)
	... 16 more
Caused by: org.apache.maven.plugin.PluginResolutionException: Plugin org.apache.maven.plugins:tycho-packaging-plugin:0.15.0 or one of its dependencies could not be resolved: Failed to read artifact descriptor for org.apache.maven.plugins:tycho-packaging-plugin:jar:0.15.0
	at org.apache.maven.plugin.internal.DefaultPluginDependenciesResolver.resolve(DefaultPluginDependenciesResolver.java:129)
	at org.apache.maven.plugin.internal.DefaultMavenPluginManager.getPluginDescriptor(DefaultMavenPluginManager.java:142)
	at org.eclipse.tycho.core.maven.utils.PluginRealmHelper.execute(PluginRealmHelper.java:86)
	... 17 more
Caused by: org.sonatype.aether.resolution.ArtifactDescriptorException: Failed to read artifact descriptor for org.apache.maven.plugins:tycho-packaging-plugin:jar:0.15.0
	at org.apache.maven.repository.internal.DefaultArtifactDescriptorReader.loadPom(DefaultArtifactDescriptorReader.java:282)
	at org.apache.maven.repository.internal.DefaultArtifactDescriptorReader.readArtifactDescriptor(DefaultArtifactDescriptorReader.java:172)
	at org.sonatype.aether.impl.internal.DefaultRepositorySystem.readArtifactDescriptor(DefaultRepositorySystem.java:316)
	at org.apache.maven.plugin.internal.DefaultPluginDependenciesResolver.resolve(DefaultPluginDependenciesResolver.java:115)
	... 19 more
Caused by: org.sonatype.aether.resolution.ArtifactResolutionException: Failure to find org.apache.maven.plugins:tycho-packaging-plugin:pom:0.15.0 in https://repository.sonatype.org/content/repositories/public was cached in the local repository, resolution will not be reattempted until the update interval of sonatype has elapsed or updates are forced
	at org.sonatype.aether.impl.internal.DefaultArtifactResolver.resolve(DefaultArtifactResolver.java:541)
	at org.sonatype.aether.impl.internal.DefaultArtifactResolver.resolveArtifacts(DefaultArtifactResolver.java:220)
	at org.sonatype.aether.impl.internal.DefaultArtifactResolver.resolveArtifact(DefaultArtifactResolver.java:197)
	at org.apache.maven.repository.internal.DefaultArtifactDescriptorReader.loadPom(DefaultArtifactDescriptorReader.java:267)
	... 22 more
Caused by: org.sonatype.aether.transfer.ArtifactNotFoundException: Failure to find org.apache.maven.plugins:tycho-packaging-plugin:pom:0.15.0 in https://repository.sonatype.org/content/repositories/public was cached in the local repository, resolution will not be reattempted until the update interval of sonatype has elapsed or updates are forced
	at org.sonatype.aether.impl.internal.DefaultUpdateCheckManager.checkArtifact(DefaultUpdateCheckManager.java:190)
	at org.sonatype.aether.impl.internal.DefaultArtifactResolver.resolve(DefaultArtifactResolver.java:430)
	... 25 more
[ERROR] 
[ERROR] To see the full stack trace of the errors, re-run Maven with the -e switch.
[ERROR] Re-run Maven using the -X switch to enable full debug logging.
[ERROR] 
[ERROR] For more information about the errors and possible solutions, please read the following articles:
[ERROR] [Help 1] http://cwiki.apache.org/confluence/display/MAVEN/InternalErrorException
Archiving artifacts