[Date Prev][Date Next][Thread Prev][Thread Next][Date Index][Thread Index] [List Home]
[pdt-dev] Build failed in Hudson: cbi-pdt-3.0-juno #93

See <https://hudson.eclipse.org/hudson/job/cbi-pdt-3.0-juno/93/changes>

Changes:

[zzhongwei] add more contexts to php template CA

------------------------------------------
[...truncated 209 lines...]

create.label.properties:
     [echo] subprojectName = pdt
     [echo] Base OS: linux; Base Window System: gtk

collectMaps:

run:

get.pde.build.svn:

get.ant4eclipse:

get.SWTBot.junit4:
     [echo] buildAll.xml#run :: build.step :: buildUpdate

buildUpdate:

buildMasterZip:

-timestamp:
     [echo] 03:11:55

main-init:

main:

main:

preBuild:

preSetup:
    [mkdir] Created dir: <https://hudson.eclipse.org/hudson/job/cbi-pdt-3.0-juno/93/artifact/build/N201206191511/eclipse/N201206191511>

getMapFiles:
     [copy] Copying 1 file to <https://hudson.eclipse.org/hudson/job/cbi-pdt-3.0-juno/93/artifact/build/N201206191511/eclipse>

init:

postSetup:

provision.eclipse.build.base:

provision.eclipse.base:
     [echo] Provision Eclipse base from eclipse-SDK-3.7.2-linux-gtk-x86_64.tar.gz into <https://hudson.eclipse.org/hudson/job/cbi-pdt-3.0-juno/93/artifact/build/N201206191511...>

init:

getDep:

getBundle:

downloadFile:

unpackBundle:

unzipFile:

untarFile:
    [untar] Expanding: <https://hudson.eclipse.org/hudson/job/cbi-pdt-3.0-juno/ws/build/downloads/eclipse-SDK-3.7.2-linux-gtk-x86_64.tar.gz> into <https://hudson.eclipse.org/hudson/job/cbi-pdt-3.0-juno/93/artifact/build/N201206191511>
     [echo] Install org.eclipse.test+org.eclipse.wst.web_ui.feature+org.eclipse.dltk.core+org.eclipse.dltk.mylyn+org.eclipse.dltk.core.index+org.eclipse.wst.common.fproj to <https://hudson.eclipse.org/hudson/job/cbi-pdt-3.0-juno/93/artifact/build/N201206191511/eclipse>

run.director:

-timestamp:
     [echo] 03:12:04
    [mkdir] Created dir: <https://hudson.eclipse.org/hudson/job/cbi-pdt-3.0-juno/93/artifact/build/N201206191511/eclipse/p2repoZipsTmp>

init:

getDep:

getBundle:

downloadFile:
      [get] Getting: http://download.eclipse.org/eclipse/downloads/drops/R-3.7.2-201202080800/eclipse-test-framework-3.7.2.zip
      [get] To: <https://hudson.eclipse.org/hudson/job/cbi-pdt-3.0-juno/ws/build/downloads/eclipse-test-framework-3.7.2.zip>

unpackBundle:

unzipFile:
    [unzip] Expanding: <https://hudson.eclipse.org/hudson/job/cbi-pdt-3.0-juno/ws/build/downloads/eclipse-test-framework-3.7.2.zip> into <https://hudson.eclipse.org/hudson/job/cbi-pdt-3.0-juno/93/artifact/build/N201206191511/eclipse/p2repoZipsTmp/eclipse-test-framework-3.7.2.zip_>

untarFile:
      [zip] Building zip: <https://hudson.eclipse.org/hudson/job/cbi-pdt-3.0-juno/93/artifact/build/N201206191511/eclipse/p2repoZipsTmp/eclipse-test-framework-3.7.2.zip>
   [delete] Deleting directory <https://hudson.eclipse.org/hudson/job/cbi-pdt-3.0-juno/93/artifact/build/N201206191511/eclipse/p2repoZipsTmp/eclipse-test-framework-3.7.2.zip_>

init:

getDep:

getBundle:

downloadFile:
      [get] Getting: http://download.eclipse.org/modeling/emf/emf/downloads/drops/2.7.0/R201106060949/emf-xsd-Update-2.7.0.zip
      [get] To: <https://hudson.eclipse.org/hudson/job/cbi-pdt-3.0-juno/ws/build/downloads/emf-xsd-Update-2.7.0.zip>

unpackBundle:

unzipFile:
    [unzip] Expanding: <https://hudson.eclipse.org/hudson/job/cbi-pdt-3.0-juno/ws/build/downloads/emf-xsd-Update-2.7.0.zip> into <https://hudson.eclipse.org/hudson/job/cbi-pdt-3.0-juno/93/artifact/build/N201206191511/eclipse/p2repoZipsTmp/emf-xsd-Update-2.7.0.zip_>

untarFile:
      [zip] Building zip: <https://hudson.eclipse.org/hudson/job/cbi-pdt-3.0-juno/93/artifact/build/N201206191511/eclipse/p2repoZipsTmp/emf-xsd-Update-2.7.0.zip>
   [delete] Deleting directory <https://hudson.eclipse.org/hudson/job/cbi-pdt-3.0-juno/93/artifact/build/N201206191511/eclipse/p2repoZipsTmp/emf-xsd-Update-2.7.0.zip_>

init:

getDep:

getBundle:

downloadFile:
      [get] Getting: http://download.eclipse.org/webtools/downloads/drops/R3.3.0/R-3.3.0-20110607160810/wtp-repo-R-3.3.0-20110607160810.zip
      [get] To: <https://hudson.eclipse.org/hudson/job/cbi-pdt-3.0-juno/ws/build/downloads/wtp-repo-R-3.3.0-20110607160810.zip>

unpackBundle:

unzipFile:
    [unzip] Expanding: <https://hudson.eclipse.org/hudson/job/cbi-pdt-3.0-juno/ws/build/downloads/wtp-repo-R-3.3.0-20110607160810.zip> into <https://hudson.eclipse.org/hudson/job/cbi-pdt-3.0-juno/93/artifact/build/N201206191511/eclipse/p2repoZipsTmp/wtp-repo-R-3.3.0-20110607160810.zip_>

untarFile:
      [zip] Building zip: <https://hudson.eclipse.org/hudson/job/cbi-pdt-3.0-juno/93/artifact/build/N201206191511/eclipse/p2repoZipsTmp/wtp-repo-R-3.3.0-20110607160810.zip>
   [delete] Deleting directory <https://hudson.eclipse.org/hudson/job/cbi-pdt-3.0-juno/93/artifact/build/N201206191511/eclipse/p2repoZipsTmp/wtp-repo-R-3.3.0-20110607160810.zip_>

init:

getDep:

getBundle:

downloadFile:
      [get] Getting: http://download.eclipse.org/tools/gef/downloads/drops/3.7.0/R201106220958/GEF-Update-3.7.0.zip
      [get] To: <https://hudson.eclipse.org/hudson/job/cbi-pdt-3.0-juno/ws/build/downloads/GEF-Update-3.7.0.zip>
      [get] Error opening connection java.io.FileNotFoundException: http://download.eclipse.org/tools/gef/downloads/drops/3.7.0/R201106220958/GEF-Update-3.7.0.zip
      [get] Error opening connection java.io.FileNotFoundException: http://download.eclipse.org/tools/gef/downloads/drops/3.7.0/R201106220958/GEF-Update-3.7.0.zip
      [get] Error opening connection java.io.FileNotFoundException: http://download.eclipse.org/tools/gef/downloads/drops/3.7.0/R201106220958/GEF-Update-3.7.0.zip
      [get] Can't get http://download.eclipse.org/tools/gef/downloads/drops/3.7.0/R201106220958/GEF-Update-3.7.0.zip to <https://hudson.eclipse.org/hudson/job/cbi-pdt-3.0-juno/ws/build/downloads/GEF-Update-3.7.0.zip>
      [for] org.eclipse.test+org.eclipse.wst.web_ui.feature+org.eclipse.dltk.core+org.eclipse.dltk.mylyn+org.eclipse.dltk.core.index+org.eclipse.wst.common.fproj: The following error occurred while executing this line:
      [for] <https://hudson.eclipse.org/hudson/job/cbi-pdt-3.0-juno/ws/build/org.eclipse.dash.common.releng/builder/all/customTargets.xml>:257: The following error occurred while executing this line:
      [for] <https://hudson.eclipse.org/hudson/job/cbi-pdt-3.0-juno/ws/build/org.eclipse.dash.common.releng/tools/scripts/buildAllHelper.xml>:1377: The following error occurred while executing this line:
      [for] <https://hudson.eclipse.org/hudson/job/cbi-pdt-3.0-juno/ws/build/org.eclipse.dash.common.releng/tools/scripts/buildAllHelper.xml>:1398: The following error occurred while executing this line:
      [for] <https://hudson.eclipse.org/hudson/job/cbi-pdt-3.0-juno/ws/build/org.eclipse.dash.common.releng/tools/scripts/getDependencies.xml>:41: The following error occurred while executing this line:
      [for] <https://hudson.eclipse.org/hudson/job/cbi-pdt-3.0-juno/ws/build/org.eclipse.dash.common.releng/tools/scripts/getDependenciesHelper.xml>:13: The following error occurred while executing this line:
      [for] <https://hudson.eclipse.org/hudson/job/cbi-pdt-3.0-juno/ws/build/org.eclipse.dash.common.releng/tools/scripts/getDependenciesHelper.xml>:78: Can't get http://download.eclipse.org/tools/gef/downloads/drops/3.7.0/R201106220958/GEF-Update-3.7.0.zip to <https://hudson.eclipse.org/hudson/job/cbi-pdt-3.0-juno/ws/build/downloads/GEF-Update-3.7.0.zip>
      [for] featureIDsToInstall: The following error occurred while executing this line:
      [for] <https://hudson.eclipse.org/hudson/job/cbi-pdt-3.0-juno/ws/build/org.eclipse.dash.common.releng/builder/all/customTargets.xml>:230: Keepgoing execution: 1 of 1 iterations failed.
     [echo] Install org.apache.commons.lang+org.h2 to <https://hudson.eclipse.org/hudson/job/cbi-pdt-3.0-juno/93/artifact/build/N201206191511/eclipse>

run.director:

-timestamp:
     [echo] 03:12:51

init:

getDep:

getBundle:

downloadFile:

unpackBundle:

unzipFile:
    [unzip] Expanding: <https://hudson.eclipse.org/hudson/job/cbi-pdt-3.0-juno/ws/build/downloads/eclipse-test-framework-3.7.2.zip> into <https://hudson.eclipse.org/hudson/job/cbi-pdt-3.0-juno/93/artifact/build/N201206191511/eclipse/p2repoZipsTmp/eclipse-test-framework-3.7.2.zip_>

untarFile:
      [zip] Building zip: <https://hudson.eclipse.org/hudson/job/cbi-pdt-3.0-juno/93/artifact/build/N201206191511/eclipse/p2repoZipsTmp/eclipse-test-framework-3.7.2.zip>
   [delete] Deleting directory <https://hudson.eclipse.org/hudson/job/cbi-pdt-3.0-juno/93/artifact/build/N201206191511/eclipse/p2repoZipsTmp/eclipse-test-framework-3.7.2.zip_>

init:

getDep:

getBundle:

downloadFile:

unpackBundle:

unzipFile:
    [unzip] Expanding: <https://hudson.eclipse.org/hudson/job/cbi-pdt-3.0-juno/ws/build/downloads/emf-xsd-Update-2.7.0.zip> into <https://hudson.eclipse.org/hudson/job/cbi-pdt-3.0-juno/93/artifact/build/N201206191511/eclipse/p2repoZipsTmp/emf-xsd-Update-2.7.0.zip_>

untarFile:
      [zip] Building zip: <https://hudson.eclipse.org/hudson/job/cbi-pdt-3.0-juno/93/artifact/build/N201206191511/eclipse/p2repoZipsTmp/emf-xsd-Update-2.7.0.zip>
   [delete] Deleting directory <https://hudson.eclipse.org/hudson/job/cbi-pdt-3.0-juno/93/artifact/build/N201206191511/eclipse/p2repoZipsTmp/emf-xsd-Update-2.7.0.zip_>

init:

getDep:

getBundle:

downloadFile:

unpackBundle:

unzipFile:
    [unzip] Expanding: <https://hudson.eclipse.org/hudson/job/cbi-pdt-3.0-juno/ws/build/downloads/wtp-repo-R-3.3.0-20110607160810.zip> into <https://hudson.eclipse.org/hudson/job/cbi-pdt-3.0-juno/93/artifact/build/N201206191511/eclipse/p2repoZipsTmp/wtp-repo-R-3.3.0-20110607160810.zip_>

untarFile:
      [zip] Building zip: <https://hudson.eclipse.org/hudson/job/cbi-pdt-3.0-juno/93/artifact/build/N201206191511/eclipse/p2repoZipsTmp/wtp-repo-R-3.3.0-20110607160810.zip>
   [delete] Deleting directory <https://hudson.eclipse.org/hudson/job/cbi-pdt-3.0-juno/93/artifact/build/N201206191511/eclipse/p2repoZipsTmp/wtp-repo-R-3.3.0-20110607160810.zip_>

init:

getDep:

getBundle:

downloadFile:
      [get] Getting: http://download.eclipse.org/tools/gef/downloads/drops/3.7.0/R201106220958/GEF-Update-3.7.0.zip
      [get] To: <https://hudson.eclipse.org/hudson/job/cbi-pdt-3.0-juno/ws/build/downloads/GEF-Update-3.7.0.zip>
      [get] Error opening connection java.io.FileNotFoundException: http://download.eclipse.org/tools/gef/downloads/drops/3.7.0/R201106220958/GEF-Update-3.7.0.zip
      [get] Error opening connection java.io.FileNotFoundException: http://download.eclipse.org/tools/gef/downloads/drops/3.7.0/R201106220958/GEF-Update-3.7.0.zip
      [get] Error opening connection java.io.FileNotFoundException: http://download.eclipse.org/tools/gef/downloads/drops/3.7.0/R201106220958/GEF-Update-3.7.0.zip
      [get] Can't get http://download.eclipse.org/tools/gef/downloads/drops/3.7.0/R201106220958/GEF-Update-3.7.0.zip to <https://hudson.eclipse.org/hudson/job/cbi-pdt-3.0-juno/ws/build/downloads/GEF-Update-3.7.0.zip>
      [for] org.apache.commons.lang+org.h2: The following error occurred while executing this line:
      [for] <https://hudson.eclipse.org/hudson/job/cbi-pdt-3.0-juno/ws/build/org.eclipse.dash.common.releng/builder/all/customTargets.xml>:257: The following error occurred while executing this line:
      [for] <https://hudson.eclipse.org/hudson/job/cbi-pdt-3.0-juno/ws/build/org.eclipse.dash.common.releng/tools/scripts/buildAllHelper.xml>:1377: The following error occurred while executing this line:
      [for] <https://hudson.eclipse.org/hudson/job/cbi-pdt-3.0-juno/ws/build/org.eclipse.dash.common.releng/tools/scripts/buildAllHelper.xml>:1398: The following error occurred while executing this line:
      [for] <https://hudson.eclipse.org/hudson/job/cbi-pdt-3.0-juno/ws/build/org.eclipse.dash.common.releng/tools/scripts/getDependencies.xml>:41: The following error occurred while executing this line:
      [for] <https://hudson.eclipse.org/hudson/job/cbi-pdt-3.0-juno/ws/build/org.eclipse.dash.common.releng/tools/scripts/getDependenciesHelper.xml>:13: The following error occurred while executing this line:
      [for] <https://hudson.eclipse.org/hudson/job/cbi-pdt-3.0-juno/ws/build/org.eclipse.dash.common.releng/tools/scripts/getDependenciesHelper.xml>:78: Can't get http://download.eclipse.org/tools/gef/downloads/drops/3.7.0/R201106220958/GEF-Update-3.7.0.zip to <https://hudson.eclipse.org/hudson/job/cbi-pdt-3.0-juno/ws/build/downloads/GEF-Update-3.7.0.zip>
      [for] pluginIDsToInstall: The following error occurred while executing this line:
      [for] <https://hudson.eclipse.org/hudson/job/cbi-pdt-3.0-juno/ws/build/org.eclipse.dash.common.releng/builder/all/customTargets.xml>:230: Keepgoing execution: 1 of 1 iterations failed.

BUILD FAILED
<https://hudson.eclipse.org/hudson/job/cbi-pdt-3.0-juno/ws/build/org.eclipse.dash.common.releng/buildAll.xml>:378: The following error occurred while executing this line:
<https://hudson.eclipse.org/hudson/job/cbi-pdt-3.0-juno/ws/build/org.eclipse.dash.common.releng/buildAll.xml>:419: The following error occurred while executing this line:
<https://hudson.eclipse.org/hudson/job/cbi-pdt-3.0-juno/ws/build/org.eclipse.dash.common.releng/tools/scripts/buildAllHelper.xml>:833: The following error occurred while executing this line:
<https://hudson.eclipse.org/hudson/job/cbi-pdt-3.0-juno/ws/build/org.eclipse.dash.common.releng/tools/scripts/buildAllHelper.xml>:1242: The following error occurred while executing this line:
<https://hudson.eclipse.org/hudson/job/cbi-pdt-3.0-juno/ws/build/org.eclipse.dash.common.releng/build.xml>:199: The following error occurred while executing this line:
/opt/public/cbi/build/org.eclipse.releng.basebuilder_r35x_v20090811/plugins/org.eclipse.pde.build_3.5.0.v20090527-1800/scripts/build.xml:32: The following error occurred while executing this line:
/opt/public/cbi/build/org.eclipse.releng.basebuilder_r35x_v20090811/plugins/org.eclipse.pde.build_3.5.0.v20090527-1800/scripts/build.xml:53: The following error occurred while executing this line:
<https://hudson.eclipse.org/hudson/job/cbi-pdt-3.0-juno/ws/build/org.eclipse.dash.common.releng/builder/all/customTargets.xml>:208: Keepgoing execution: 2 of 3 iterations failed.

Total time: 1 minute 31 seconds
[start] [15:13:21] start.sh finished.

++ rm -f <https://hudson.eclipse.org/hudson/job/cbi-pdt-3.0-juno/ws/build/.cvspass>
+++ date '+%Y/%m/%d %H:%M'
++ echo '[2012/06/19 15:13] Hudson job  build #93 (2012-06-19_15-11-02) done.'
[2012/06/19 15:13] Hudson job  build #93 (2012-06-19_15-11-02) done.
Terminating xvnc.
Recording test results
No test report files were found. Configuration error?
Archiving artifacts