[Date Prev][Date Next][Thread Prev][Thread Next][Date Index][Thread Index] [List Home]
[pdt-dev] Build failed in Hudson: cbi-pdt-3.0-juno #75

See <https://hudson.eclipse.org/hudson/job/cbi-pdt-3.0-juno/75/changes>

Changes:

[zzhongwei] *** empty log message ***

------------------------------------------
Started by an SCM change
Building on master
[workspace] $ cvs -q -z3 update -PdC -D "Monday, May 21, 2012 7:13:09 PM UTC"
? build
P plugins/org.eclipse.php.ui/src/org/eclipse/php/internal/ui/PHPUIMessages.java
P plugins/org.eclipse.php.ui/src/org/eclipse/php/internal/ui/PHPUIMessages.properties
$ computing changelog
Starting xvnc
[workspace] $ Xvnc :14 -geometry 1024x768 -depth 24 -ac
[workspace] $ /bin/sh -xe /tmp/hudson6186725327360870952.sh
21/05/2012 15:13:47 Xvnc version X.org/xf4vnc custom version
21/05/2012 15:13:47 Copyright (C) 2001-2004 Alan Hourihane.
21/05/2012 15:13:47 Copyright (C) 2000-2004 Constantin Kaplinsky
21/05/2012 15:13:47 Copyright (C) 1999 AT&T Laboratories Cambridge
21/05/2012 15:13:47 All Rights Reserved.
21/05/2012 15:13:47 See http://www.tightvnc.com/ for information on TightVNC
21/05/2012 15:13:47 See http://xf4vnc.sf.net for xf4vnc-specific information
21/05/2012 15:13:47 Desktop name 'x11' (hudson:14)
21/05/2012 15:13:47 Protocol versions supported: 3.7, 3.3
21/05/2012 15:13:47 RGB format 8 8 8
21/05/2012 15:13:47 Listening for VNC connections on TCP port 5914
[dix] Could not init font path element /usr/share/fonts/TTF/, removing from list!
[dix] Could not init font path element /usr/share/fonts/OTF, removing from list!
(EE) config/hal: NewInputDeviceRequest failed (2)
(EE) config/hal: NewInputDeviceRequest failed (2)
+ export 'PROJRELENGROOT=-projRelengRoot :pserver:anonymous@xxxxxxxxxxxxxxx:/cvsroot/tools'
+ PROJRELENGROOT='-projRelengRoot :pserver:anonymous@xxxxxxxxxxxxxxx:/cvsroot/tools'
+ export 'PROJRELENGPATH=-projRelengPath org.eclipse.pdt/org.eclipse.pdt.releng'
+ PROJRELENGPATH='-projRelengPath org.eclipse.pdt/org.eclipse.pdt.releng'
+ . /opt/public/cbi/build/org.eclipse.dash.common.releng/hudson/run.sh
+++ date '+%Y/%m/%d %H:%M'
++ echo '[2012/05/21 15:13] Hudson job  build #75 (2012-05-21_15-13-09) started.'
[2012/05/21 15:13] Hudson job  build #75 (2012-05-21_15-13-09) started.
+++ date +%Y%m%d%H%M
++ buildTimestamp=201205211513
++ cvsProjectBaseDir=/opt/public/cbi/build
++ [[ ! -d /opt/public/cbi/build ]]
++ [[ ! -d /opt/public/cbi/build ]]
++ thirdPartyJarsDir=/opt/public/cbi/build/3rdPartyJars
++ [[ ! -d /opt/public/cbi/build/3rdPartyJars ]]
++ [[ ! -d /opt/public/cbi/build/3rdPartyJars ]]
++ [[ -n N ]]
++ buildType=N
++ haderror=0
++ [[ -n tools.pdt ]]
++ projectid=tools.pdt
++ [[ -n 3.0.0 ]]
++ version=3.0.0
++ [[ -n -projRelengRoot :pserver:anonymous@xxxxxxxxxxxxxxx:/cvsroot/tools ]]
++ projRelengRoot='-projRelengRoot :pserver:anonymous@xxxxxxxxxxxxxxx:/cvsroot/tools'
++ [[ -n -projRelengPath org.eclipse.pdt/org.eclipse.pdt.releng ]]
++ projRelengPath='-projRelengPath org.eclipse.pdt/org.eclipse.pdt.releng'
++ [[ -n '' ]]
++ projRelengBranch=
++ [[ 0 -gt 0 ]]
++ writableBuildRoot=<https://hudson.eclipse.org/hudson/job/cbi-pdt-3.0-juno/ws/build>
++ [[ -d <https://hudson.eclipse.org/hudson/job/cbi-pdt-3.0-juno/ws/build> ]]
++ rm -fr <https://hudson.eclipse.org/hudson/job/cbi-pdt-3.0-juno/ws/build>
++ downloadsDir=<https://hudson.eclipse.org/hudson/job/cbi-pdt-3.0-juno/ws/build/downloads>
++ signingDir=<https://hudson.eclipse.org/hudson/job/cbi-pdt-3.0-juno/ws/build/signing>
++ [[ -n '' ]]
++ buildDir=<https://hudson.eclipse.org/hudson/job/cbi-pdt-3.0-juno/75/artifact/build/N201205211513>
++ mkdir -p <https://hudson.eclipse.org/hudson/job/cbi-pdt-3.0-juno/ws/build/downloads> <https://hudson.eclipse.org/hudson/job/cbi-pdt-3.0-juno/ws/build/signing> <https://hudson.eclipse.org/hudson/job/cbi-pdt-3.0-juno/75/artifact/build/N201205211513>
++ touch <https://hudson.eclipse.org/hudson/job/cbi-pdt-3.0-juno/ws/build/.cvspass>
++ relengBaseBuilderDir=<https://hudson.eclipse.org/hudson/job/cbi-pdt-3.0-juno/ws/build/org.eclipse.releng.basebuilder>
++ relengCommonBuilderDir=<https://hudson.eclipse.org/hudson/job/cbi-pdt-3.0-juno/ws/build/org.eclipse.dash.common.releng>
++ ln -s /opt/public/cbi/build/org.eclipse.releng.basebuilder <https://hudson.eclipse.org/hudson/job/cbi-pdt-3.0-juno/ws/build/>
++ ln -s /opt/public/cbi/build/org.eclipse.dash.common.releng <https://hudson.eclipse.org/hudson/job/cbi-pdt-3.0-juno/ws/build/>
++ ln -s /opt/public/cbi/build/3rdPartyJars <https://hudson.eclipse.org/hudson/job/cbi-pdt-3.0-juno/ws/build/>
++ thirdPartyJarsDir=<https://hudson.eclipse.org/hudson/job/cbi-pdt-3.0-juno/ws/build/3rdPartyJars>
++ find <https://hudson.eclipse.org/hudson/job/cbi-pdt-3.0-juno/ws/build/downloads> -maxdepth 1 -type f -name '*-SNAPSHOT.zip' -exec rm -f '{}' ';'
++ cd <https://hudson.eclipse.org/hudson/job/cbi-pdt-3.0-juno/ws/build/org.eclipse.dash.common.releng/tools/scripts>
++ ./start.sh -projectid tools.pdt -version 3.0.0 -buildType N -buildTimestamp 201205211513 -writableBuildRoot <https://hudson.eclipse.org/hudson/job/cbi-pdt-3.0-juno/ws/build> -thirdPartyJarsDir <https://hudson.eclipse.org/hudson/job/cbi-pdt-3.0-juno/ws/build/3rdPartyJars> -downloadsDir <https://hudson.eclipse.org/hudson/job/cbi-pdt-3.0-juno/ws/build/downloads> -buildDir <https://hudson.eclipse.org/hudson/job/cbi-pdt-3.0-juno/75/artifact/build/N201205211513> -projRelengRoot :pserver:anonymous@xxxxxxxxxxxxxxx:/cvsroot/tools -projRelengPath org.eclipse.pdt/org.eclipse.pdt.releng -forceContextQualifier -fetchTag HEAD
Found cvs: /usr/bin/cvs /usr/bin/X11/cvs /usr/share/cvs /usr/share/man/man1/cvs.1.gz /usr/share/man/man5/cvs.5.gz
Found svn in PATH=
/bin:/usr/bin/:/usr/local/bin
Found wget: /usr/bin/wget /usr/bin/X11/wget /usr/share/man/man1/wget.1.gz
21/05/2012 15:13:49 Xvnc version X.org/xf4vnc custom version
21/05/2012 15:13:49 Copyright (C) 2001-2004 Alan Hourihane.
21/05/2012 15:13:49 Copyright (C) 2000-2004 Constantin Kaplinsky
21/05/2012 15:13:49 Copyright (C) 1999 AT&T Laboratories Cambridge
21/05/2012 15:13:49 All Rights Reserved.
21/05/2012 15:13:49 See http://www.tightvnc.com/ for information on TightVNC
21/05/2012 15:13:49 See http://xf4vnc.sf.net for xf4vnc-specific information
21/05/2012 15:13:49 Desktop name 'x11' (hudson:14)
21/05/2012 15:13:49 Protocol versions supported: 3.7, 3.3
21/05/2012 15:13:49 RGB format 8 8 8
21/05/2012 15:13:49 Listening for VNC connections on TCP port 5914
[dix] Could not init font path element /usr/share/fonts/TTF/, removing from list!
[dix] Could not init font path element /usr/share/fonts/OTF, removing from list!
(EE) config/hal: NewInputDeviceRequest failed (2)
(EE) config/hal: NewInputDeviceRequest failed (2)
Found vncserver in PATH=
/bin:/usr/bin/:/usr/local/bin
Found Xvfb in PATH=
/bin:/usr/bin/:/usr/local/bin
Found Xvnc in PATH=
/bin:/usr/bin/:/usr/local/bin
WARNING: You may require 1 or more of the following tools for this build to proceed:
  javac
[start] [15:13:51] Started on 20120521 with these options:
   -projectid tools.pdt
   -version 3.0.0
   -buildType N
   -buildTimestamp 201205211513
   -writableBuildRoot <https://hudson.eclipse.org/hudson/job/cbi-pdt-3.0-juno/ws/build>
   -thirdPartyJarsDir <https://hudson.eclipse.org/hudson/job/cbi-pdt-3.0-juno/ws/build/3rdPartyJars>
   -downloadsDir <https://hudson.eclipse.org/hudson/job/cbi-pdt-3.0-juno/ws/build/downloads>
   -buildDir <https://hudson.eclipse.org/hudson/job/cbi-pdt-3.0-juno/75/artifact/build/N201205211513>
   -projRelengRoot :pserver:anonymous@xxxxxxxxxxxxxxx:/cvsroot/tools
   -projRelengPath org.eclipse.pdt/org.eclipse.pdt.releng
   -forceContextQualifier
   -fetchTag HEAD

[start] Create build directory <https://hudson.eclipse.org/hudson/job/cbi-pdt-3.0-juno/75/artifact/build/N201205211513>

  cvs -d :pserver:anonymous@xxxxxxxxxxxxxxx:/cvsroot/tools -Q ex -r HEAD -d org.eclipse.pdt.releng org.eclipse.pdt/org.eclipse.pdt.releng
[start] [15:13:51] Export done.

[start] Export skipped: org.eclipse.dash.common.releng already exists.

[start] Export skipped: org.eclipse.releng.basebuilder already exists.

Environment variables:
  HOME      = <https://hudson.eclipse.org/hudson/job/cbi-pdt-3.0-juno/ws/build>
  JAVA_HOME = /shared/common/jdk-1.5.0-22.x86_64
  ANT_HOME  = /opt/public/common/apache-ant-1.7.1
  ANT       = /opt/public/common/apache-ant-1.7.1/bin/ant

[start] mapVersionTag: HEAD
[start] [15:13:51] Invoke Eclipse build
 
[15:13:51]
  /shared/common/jdk-1.5.0-22.x86_64/bin/java 
  -enableassertions
  -cp <https://hudson.eclipse.org/hudson/job/cbi-pdt-3.0-juno/ws/build/org.eclipse.releng.basebuilder/plugins/org.eclipse.equinox.launcher.jar> org.eclipse.equinox.launcher.Main
  -application org.eclipse.ant.core.antRunner
  -f <https://hudson.eclipse.org/hudson/job/cbi-pdt-3.0-juno/ws/build/org.eclipse.dash.common.releng/buildAll.xml> run
  -Dprojectid=tools.pdt
  -DbuildTimestamp=201205211513
  -DbuildType=N
  -Dversion=3.0.0
  -DwritableBuildRoot=<https://hudson.eclipse.org/hudson/job/cbi-pdt-3.0-juno/ws/build>
  -DdownloadsDir=<https://hudson.eclipse.org/hudson/job/cbi-pdt-3.0-juno/ws/build/downloads>
  -DthirdPartyJarsDir=<https://hudson.eclipse.org/hudson/job/cbi-pdt-3.0-juno/ws/build/3rdPartyJars>
  -DbuildDir=<https://hudson.eclipse.org/hudson/job/cbi-pdt-3.0-juno/75/artifact/build/N201205211513>
  -DrelengBuilderDir=<https://hudson.eclipse.org/hudson/job/cbi-pdt-3.0-juno/ws/build/org.eclipse.pdt.releng>
  -DrelengCommonBuilderDir=<https://hudson.eclipse.org/hudson/job/cbi-pdt-3.0-juno/ws/build/org.eclipse.dash.common.releng>
  -DrelengBaseBuilderDir=<https://hudson.eclipse.org/hudson/job/cbi-pdt-3.0-juno/ws/build/org.eclipse.releng.basebuilder>
  -DJAVA_HOME=/shared/common/jdk-1.5.0-22.x86_64
  -DmapVersionTag=HEAD
  -DforceContextQualifier=v201205211513
  -DfetchTag=HEAD
Buildfile: <https://hudson.eclipse.org/hudson/job/cbi-pdt-3.0-juno/ws/build/org.eclipse.dash.common.releng/buildAll.xml>

init:

check.ant-contrib:

resolvepaths:

init:

genBuildCfgInit:
Trying to override old definition of task resolvepath

projectid2names:

genBuildCfg:
Trying to override old definition of task resolvepath

createBuildConfigFile:
Trying to override old definition of task resolvepath

initCommandlineArgsList:
Trying to override old definition of task resolvepath

load.properties:
     [echo] Load properties from <https://hudson.eclipse.org/hudson/job/cbi-pdt-3.0-juno/ws/build/org.eclipse.pdt.releng/build.properties>
     [echo] 
     [echo] Loaded JAVA*_HOME and bootclasspath values:
     [echo]         JAVA_HOME = /shared/common/jdk-1.5.0-22.x86_64
     [echo]       JAVA14_HOME = /shared/common/jdk-1.5.0-22.x86_64, J2SE-1.4 = /shared/common/jdk-1.5.0-22.x86_64/lib/vm.jar:/shared/common/jdk-1.5.0-22.x86_64/jre/lib/vm.jar:/shared/common/jdk-1.5.0-22.x86_64/lib/dt.jar:/shared/common/jdk-1.5.0-22.x86_64/jre/lib/dt.jar:/shared/common/jdk-1.5.0-22.x86_64/lib/rt.jar:/shared/common/jdk-1.5.0-22.x86_64/jre/lib/rt.jar:/shared/common/jdk-1.5.0-22.x86_64/lib/core.jar:/shared/common/jdk-1.5.0-22.x86_64/jre/lib/core.jar:/shared/common/jdk-1.5.0-22.x86_64/lib/xml.jar:/shared/common/jdk-1.5.0-22.x86_64/jre/lib/xml.jar:/shared/common/jdk-1.5.0-22.x86_64/lib/graphics.jar:/shared/common/jdk-1.5.0-22.x86_64/jre/lib/graphics.jar:/shared/common/jdk-1.5.0-22.x86_64/lib/server.jar:/shared/common/jdk-1.5.0-22.x86_64/jre/lib/server.jar:/shared/common/jdk-1.5.0-22.x86_64/lib/ibmorbapi.jar:/shared/common/jdk-1.5.0-22.x86_64/jre/lib/ibmorbapi.jar:/shared/common/jdk-1.5.0-22.x86_64/lib/security.jar:/shared/common/jdk-1.5.0-22.x86_64/jre/lib/security.jar:/shared/common/jdk-1.5.0-22.x86_64/lib/classes.jar:/shared/common/jdk-1.5.0-22.x86_64/jre/lib/classes.jar:/shared/common/jdk-1.5.0-22.x86_64/jre/lib/jce.jar:/shared/common/jdk-1.5.0-22.x86_64/lib/jsse.jar:/shared/common/jdk-1.5.0-22.x86_64/jre/lib/jsse.jar:/shared/common/jdk-1.5.0-22.x86_64/../Classes/dt.jar:/shared/common/jdk-1.5.0-22.x86_64/../Classes/classes.jar:/shared/common/jdk-1.5.0-22.x86_64/../Classes/jsse.jar:/shared/common/jdk-1.5.0-22.x86_64/../Classes/jce.jar
     [echo]       JAVA50_HOME = /shared/common/jdk-1.5.0-22.x86_64, J2SE-1.5 = /shared/common/jdk-1.5.0-22.x86_64/jre/lib/rt.jar:/shared/common/jdk-1.5.0-22.x86_64/jre/lib/vm.jar:/shared/common/jdk-1.5.0-22.x86_64/jre/lib/core.jar:/shared/common/jdk-1.5.0-22.x86_64/jre/lib/xml.jar:/shared/common/jdk-1.5.0-22.x86_64/jre/lib/graphics.jar:/shared/common/jdk-1.5.0-22.x86_64/jre/lib/server.jar:/shared/common/jdk-1.5.0-22.x86_64/jre/lib/ibmorbapi.jar:/shared/common/jdk-1.5.0-22.x86_64/jre/lib/security.jar:/shared/common/jdk-1.5.0-22.x86_64/jre/lib/classes.jar:/shared/common/jdk-1.5.0-22.x86_64/jre/lib/jsse.jar:/shared/common/jdk-1.5.0-22.x86_64/jre/lib/jce.jar:/shared/common/jdk-1.5.0-22.x86_64/jre/lib/ibmjcefw.jar:/shared/common/jdk-1.5.0-22.x86_64/../Classes/dt.jar:/shared/common/jdk-1.5.0-22.x86_64/../Classes/classes.jar:/shared/common/jdk-1.5.0-22.x86_64/../Classes/jsse.jar:/shared/common/jdk-1.5.0-22.x86_64/../Classes/jce.jar
     [echo]       JAVA60_HOME = /shared/common/jdk-1.6.x86_64, JavaSE-1.6 = /shared/common/jdk-1.6.x86_64/jre/lib/rt.jar:/shared/common/jdk-1.6.x86_64/jre/lib/core.jar:/shared/common/jdk-1.6.x86_64/jre/lib/annotation.jar:/shared/common/jdk-1.6.x86_64/jre/lib/beans.jar:/shared/common/jdk-1.6.x86_64/jre/lib/ibmorbapi.jar:/shared/common/jdk-1.6.x86_64/jre/lib/java.util.jar:/shared/common/jdk-1.6.x86_64/jre/lib/jlm.jar:/shared/common/jdk-1.6.x86_64/jre/lib/logging.jar:/shared/common/jdk-1.6.x86_64/jre/lib/resources.jar:/shared/common/jdk-1.6.x86_64/jre/lib/security.jar:/shared/common/jdk-1.6.x86_64/jre/lib/sql.jar:/shared/common/jdk-1.6.x86_64/jre/lib/vm.jar:/shared/common/jdk-1.6.x86_64/jre/lib/xmldsigfw.jar:/shared/common/jdk-1.6.x86_64/jre/lib/xml.jar:/shared/common/jdk-1.6.x86_64/jre/lib/graphics.jar:/shared/common/jdk-1.6.x86_64/jre/lib/server.jar:/shared/common/jdk-1.6.x86_64/jre/lib/jce.jar:/shared/common/jdk-1.6.x86_64/jre/lib/jsse.jar:/shared/common/jdk-1.6.x86_64/jre/lib/ibmjcefw.jar:/shared/common/jdk-1.6.x86_64/lib/dt.jar:/shared/common/jdk-1.6.x86_64/../Classes/dt.jar:/shared/common/jdk-1.6.x86_64/../Classes/classes.jar:/shared/common/jdk-1.6.x86_64/../Classes/jsse.jar:/shared/common/jdk-1.6.x86_64/../Classes/jce.jar
     [echo] Created <https://hudson.eclipse.org/hudson/job/cbi-pdt-3.0-juno/75/artifact/build/N201205211513/build.cfg>
Trying to override old definition of task resolvepath

collectMapTypes:
     [echo] Found these map entry types: CVS
Trying to override old definition of task resolvepath

collectURLs:

getZip:
      [get] Getting: http://download.eclipse.org/eclipse/downloads/drops/R-3.7-201106131736/eclipse-SDK-3.7-linux-gtk-x86_64.tar.gz
      [get] To: <https://hudson.eclipse.org/hudson/job/cbi-pdt-3.0-juno/ws/build/downloads/eclipse-SDK-3.7-linux-gtk-x86_64.tar.gz>
      [get] Error opening connection java.io.FileNotFoundException: http://download.eclipse.org/eclipse/downloads/drops/R-3.7-201106131736/eclipse-SDK-3.7-linux-gtk-x86_64.tar.gz
      [get] Error opening connection java.io.FileNotFoundException: http://download.eclipse.org/eclipse/downloads/drops/R-3.7-201106131736/eclipse-SDK-3.7-linux-gtk-x86_64.tar.gz
      [get] Error opening connection java.io.FileNotFoundException: http://download.eclipse.org/eclipse/downloads/drops/R-3.7-201106131736/eclipse-SDK-3.7-linux-gtk-x86_64.tar.gz
      [get] Can't get http://download.eclipse.org/eclipse/downloads/drops/R-3.7-201106131736/eclipse-SDK-3.7-linux-gtk-x86_64.tar.gz to <https://hudson.eclipse.org/hudson/job/cbi-pdt-3.0-juno/ws/build/downloads/eclipse-SDK-3.7-linux-gtk-x86_64.tar.gz>

BUILD FAILED
<https://hudson.eclipse.org/hudson/job/cbi-pdt-3.0-juno/ws/build/org.eclipse.dash.common.releng/tools/scripts/buildAllHelper.xml>:2831: The following error occurred while executing this line:
<https://hudson.eclipse.org/hudson/job/cbi-pdt-3.0-juno/ws/build/org.eclipse.dash.common.releng/tools/scripts/buildAllHelper.xml>:3035: The following error occurred while executing this line:
<https://hudson.eclipse.org/hudson/job/cbi-pdt-3.0-juno/ws/build/org.eclipse.dash.common.releng/tools/scripts/buildAllHelper.xml>:3202: Can't get http://download.eclipse.org/eclipse/downloads/drops/R-3.7-201106131736/eclipse-SDK-3.7-linux-gtk-x86_64.tar.gz to <https://hudson.eclipse.org/hudson/job/cbi-pdt-3.0-juno/ws/build/downloads/eclipse-SDK-3.7-linux-gtk-x86_64.tar.gz>

Total time: 2 seconds
[start] [15:13:56] start.sh finished.

++ rm -f <https://hudson.eclipse.org/hudson/job/cbi-pdt-3.0-juno/ws/build/.cvspass>
+++ date '+%Y/%m/%d %H:%M'
++ echo '[2012/05/21 15:13] Hudson job  build #75 (2012-05-21_15-13-09) done.'
[2012/05/21 15:13] Hudson job  build #75 (2012-05-21_15-13-09) done.
Terminating xvnc.
Recording test results
No test report files were found. Configuration error?
Archiving artifacts