Skip to main content

[Date Prev][Date Next][Thread Prev][Thread Next][Date Index][Thread Index] [List Home]
[orion-releng] [Hudson] Build failed in Hudson: orion-client-stylers #1

See <https://hudson.eclipse.org/orion/job/orion-client-stylers/1/>

------------------------------------------
[...truncated 3414 lines...]
     [java] >> WARNING: Trying to document renderTag as a member of undocumented symbol GitRepositoryExplorer.
     [java] >> WARNING: Trying to document displayRemotes as a member of undocumented symbol GitRepositoryExplorer.
     [java] >> WARNING: Trying to document renderRemote as a member of undocumented symbol GitRepositoryExplorer.
     [java] >> WARNING: Trying to document displayConfig as a member of undocumented symbol GitRepositoryExplorer.
     [java] >> WARNING: Trying to document renderConfigEntry as a member of undocumented symbol GitRepositoryExplorer.
     [java] >> WARNING: Trying to document updateNavTools as a member of undocumented symbol exports.
     [java] >> WARNING: Trying to document handleKnownHostsError as a member of undocumented symbol exports.
     [java] >> WARNING: Trying to document handleSshAuthenticationError as a member of undocumented symbol exports.
     [java] >> WARNING: Trying to document getDefaultSshOptions as a member of undocumented symbol exports.
     [java] >> WARNING: Trying to document handleProgressServiceResponse as a member of undocumented symbol exports.
     [java] >> WARNING: Trying to document gatherSshCredentials as a member of undocumented symbol exports.
     [java] >> WARNING: Trying to document handleGitServiceResponse as a member of undocumented symbol exports.
     [java] >> WARNING: Trying to document createFileCommands as a member of undocumented symbol exports.
     [java] >> WARNING: Trying to document createGitClonesCommands as a member of undocumented symbol exports.
     [java] >> WARNING: Trying to document createGitStatusCommands as a member of undocumented symbol exports.
     [java] >> WARNING: Trying to document GitService as a member of undocumented symbol eclipse.
     [java] >> WARNING: Trying to document GitService as a member of undocumented symbol orion.git.
     [java] >> WARNING: Trying to document GitLogExplorer as a member of undocumented symbol exports.
     [java] >> WARNING: Trying to document GitLogExplorer as a member of undocumented symbol orion.git.
     [java] >> WARNING: Trying to document getCloneFileUri as a member of undocumented symbol GitLogExplorer.
     [java] >> WARNING: Trying to document makeHref as a member of undocumented symbol GitLogExplorer.
     [java] >> WARNING: Trying to document initTitleBar as a member of undocumented symbol GitLogExplorer.
     [java] >> WARNING: Trying to document redisplay as a member of undocumented symbol GitLogExplorer.
     [java] >> WARNING: Trying to document changedItem as a member of undocumented symbol GitLogExplorer.
     [java] >> WARNING: Trying to document getOutgoingIncomingChanges as a member of undocumented symbol GitLogExplorer.
     [java] >> WARNING: Trying to document handleError as a member of undocumented symbol GitLogExplorer.
     [java] >> WARNING: Trying to document loadResource as a member of undocumented symbol GitLogExplorer.
     [java] >> WARNING: Trying to document display as a member of undocumented symbol GitLogExplorer.
     [java] >> WARNING: Trying to document displayLog as a member of undocumented symbol GitLogExplorer.
     [java] >> WARNING: Trying to document destroy as a member of undocumented symbol LogModel.
     [java] >> WARNING: Trying to document getRoot as a member of undocumented symbol LogModel.
     [java] >> WARNING: Trying to document getChildren as a member of undocumented symbol LogModel.
     [java] >> WARNING: Trying to document getId as a member of undocumented symbol LogModel.
     [java] >> WARNING: Trying to document getCellElement as a member of undocumented symbol LogRenderer.
     [java] >> WARNING: Trying to document isRowSelectable as a member of undocumented symbol LogNavigator.
     [java] >> WARNING: Trying to document getItemCount as a member of undocumented symbol LogNavigator.
     [java] >> WARNING: Trying to document getConfig as a member of undocumented symbol GitConfigPreference.
     [java] >> WARNING: Trying to document setConfig as a member of undocumented symbol GitConfigPreference.
     [java] >> WARNING: Trying to document GitClonesModel as a member of undocumented symbol orion.git.widgets.
     [java] >> WARNING: Trying to document getRoot as a member of undocumented symbol GitClonesModel.
     [java] >> WARNING: Trying to document getIdentity as a member of undocumented symbol GitClonesModel.
     [java] >> WARNING: Trying to document getChildren as a member of undocumented symbol GitClonesModel.
     [java] >> WARNING: Trying to document getLabelColumnIndex as a member of undocumented symbol RemotePrompterRenderer.
     [java] >> WARNING: Trying to document getCellElement as a member of undocumented symbol RemotePrompterRenderer.
     [java] >> WARNING: Trying to document validateFunction as a member of undocumented symbol RemotePrompterDialog#_validate.
     [java] >> WARNING: Trying to document onchange as a member of undocumented symbol this.$selectedFile.
     [java] >> WARNING: Trying to document onchange as a member of undocumented symbol this.$url.
     [java] >> WARNING: Trying to document handleReadyState as a member of undocumented symbol ApplyPatchDialog.
     [java] >> WARNING: Trying to document OpenCommitDialog as a member of undocumented symbol orion.git.widgets.
     [java] >> WARNING: Trying to document process as a member of undocumented symbol GitCredentialsDialog#_execute.
     [java] >> WARNING: Trying to document onload as a member of undocumented symbol reader.
     [java] >> WARNING: Trying to document makePathSegment as a member of undocumented symbol CloneGitRepositoryDialog#_openDirectoryPickerDialog.
     [java] >> WARNING: Trying to document GitReviewRequestExplorer as a member of undocumented symbol exports.
     [java] >> WARNING: Trying to document GitReviewRequestExplorer as a member of undocumented symbol orion.git.
     [java] >> WARNING: Trying to document changedItem as a member of undocumented symbol GitReviewRequestExplorer.
     [java] >> WARNING: Trying to document redisplay as a member of undocumented symbol GitReviewRequestExplorer.
     [java] >> WARNING: Trying to document display as a member of undocumented symbol GitReviewRequestExplorer.
     [java] >> WARNING: Trying to document renderCloneSection as a member of undocumented symbol GitReviewRequestExplorer.
     [java] >> WARNING: Trying to document renderSections as a member of undocumented symbol GitReviewRequestExplorer.
     [java] >> WARNING: Trying to document initTitleBar as a member of undocumented symbol GitReviewRequestExplorer.
     [java] >> WARNING: Trying to document sshCheck as a member of undocumented symbol GitReviewRequestExplorer.
     [java] >> WARNING: Trying to document put as a member of undocumented symbol PreferenceStorage.
     [java] >> WARNING: Trying to document get as a member of undocumented symbol PreferenceStorage.
     [java] >> WARNING: Trying to document isEnabled as a member of undocumented symbol PreferenceStorage.
     [java] >> WARNING: Trying to document enable as a member of undocumented symbol PreferenceStorage.
     [java] >> WARNING: Trying to document disable as a member of undocumented symbol PreferenceStorage.
     [java] >> WARNING: Trying to document remove as a member of undocumented symbol PreferenceStorage.
     [java] >> WARNING: Trying to document getRepositories as a member of undocumented symbol PreferenceStorage.
     [java] >> WARNING: Trying to document destroy as a member of undocumented symbol GitStatusModel.
     [java] >> WARNING: Trying to document interestedCategory as a member of undocumented symbol GitStatusModel.
     [java] >> WARNING: Trying to document init as a member of undocumented symbol GitStatusModel.
     [java] >> WARNING: Trying to document getModelType as a member of undocumented symbol GitStatusModel.
     [java] >> WARNING: Trying to document getGroupData as a member of undocumented symbol GitStatusModel.
     [java] >> WARNING: Trying to document isStaged as a member of undocumented symbol GitStatusModel.
     [java] >> WARNING: Trying to document getClass as a member of undocumented symbol GitStatusModel.
     [java] >> WARNING: Trying to document getTooltip as a member of undocumented symbol GitStatusModel.
     [java] >> WARNING: Trying to document GitStatusExplorer as a member of undocumented symbol exports.
     [java] >> WARNING: Trying to document GitStatusExplorer as a member of undocumented symbol orion.git.
     [java] >> WARNING: Trying to document handleError as a member of undocumented symbol GitStatusExplorer.
     [java] >> WARNING: Trying to document changedItem as a member of undocumented symbol GitStatusExplorer.
     [java] >> WARNING: Trying to document redisplay as a member of undocumented symbol GitStatusExplorer.
     [java] >> WARNING: Trying to document display as a member of undocumented symbol GitStatusExplorer.
     [java] >> WARNING: Trying to document initTitleBar as a member of undocumented symbol GitStatusExplorer.
     [java] >> WARNING: Trying to document displayUnstaged as a member of undocumented symbol GitStatusExplorer.
     [java] >> WARNING: Trying to document destroy as a member of undocumented symbol UnstagedModel.
     [java] >> WARNING: Trying to document getRoot as a member of undocumented symbol UnstagedModel.
     [java] >> WARNING: Trying to document getChildren as a member of undocumented symbol UnstagedModel.
     [java] >> WARNING: Trying to document getId as a member of undocumented symbol UnstagedModel.
     [java] >> WARNING: Trying to document getCellElement as a member of undocumented symbol UnstagedRenderer.
     [java] >> WARNING: Trying to document isRowSelectable as a member of undocumented symbol UnstagedNavigator.
     [java] >> WARNING: Trying to document getItemCount as a member of undocumented symbol UnstagedNavigator.
     [java] >> WARNING: Trying to document displayStaged as a member of undocumented symbol GitStatusExplorer.
     [java] >> WARNING: Trying to document destroy as a member of undocumented symbol StagedModel.
     [java] >> WARNING: Trying to document getRoot as a member of undocumented symbol StagedModel.
     [java] >> WARNING: Trying to document getChildren as a member of undocumented symbol StagedModel.
     [java] >> WARNING: Trying to document getId as a member of undocumented symbol StagedModel.
     [java] >> WARNING: Trying to document getCellElement as a member of undocumented symbol StagedRenderer.
     [java] >> WARNING: Trying to document isRowSelectable as a member of undocumented symbol StagedNavigator.
     [java] >> WARNING: Trying to document getItemCount as a member of undocumented symbol StagedNavigator.
     [java] >> WARNING: Trying to document displayCommits as a member of undocumented symbol GitStatusExplorer.
     [java] >> WARNING: Trying to document renderNoCommit as a member of undocumented symbol GitStatusExplorer.
     [java] >> WARNING: Trying to document renderCommit as a member of undocumented symbol GitStatusExplorer.
     [java] >> WARNING: Trying to document Indexer as a member of undocumented symbol javascript.
     [java] >> WARNING: Trying to document Summary as a member of undocumented symbol javascript.
     [java] >> WARNING: Trying to document revive as a member of undocumented symbol Definition.
     [java] >> WARNING: Trying to document computeSignature as a member of undocumented symbol javascript.Signatures.
     [java] >> WARNING: Trying to document getParamsFrom as a member of undocumented symbol javascript.Signatures.
     [java] >> WARNING: Trying to document getNameFrom as a member of undocumented symbol javascript.Signatures.
     [java] >> WARNING: Trying to document getSignatureSourceRangeFrom as a member of undocumented symbol javascript.Signatures.
     [java] >> WARNING: Trying to document JavaScriptOccurrences as a member of undocumented symbol javascript.
     [java] >> WARNING: Trying to document addElement as a member of undocumented symbol javascript.Visitor.
     [java] >> WARNING: Trying to document JSOutliner as a member of undocumented symbol javascript.
     [java] >> WARNING: Trying to document enter as a member of undocumented symbol javascript.Visitor.
     [java] >> WARNING: Trying to document leave as a member of undocumented symbol javascript.Visitor.
     [java] >> WARNING: Trying to document checkId as a member of undocumented symbol javascript.Visitor.
     [java] >> WARNING: Trying to document findWord as a member of undocumented symbol javascript.Finder.
     [java] >> WARNING: Trying to document findNode as a member of undocumented symbol javascript.Finder.
     [java] >> WARNING: Trying to document findToken as a member of undocumented symbol javascript.Finder.
     [java] >> WARNING: Trying to document ASTManager as a member of undocumented symbol javascript.
     [java] >> WARNING: Trying to document HTMLContentAssistProvider as a member of undocumented symbol orion.editor.
     [java] >> WARNING: Trying to document getPrefix as a member of undocumented symbol HTMLContentAssistProvider.
     [java] >> WARNING: Trying to document computeProposals as a member of undocumented symbol HTMLContentAssistProvider.
     [java] >> WARNING: Trying to document CssContentAssistProvider as a member of undocumented symbol orion.editor.
     [java] >> WARNING: Trying to document getPrefix as a member of undocumented symbol CssContentAssistProvider.
     [java] >> WARNING: Trying to document addInputListener as a member of undocumented symbol Profile.
     [java] >> WARNING: Trying to document draw as a member of undocumented symbol Profile.
     [java] >> WARNING: Trying to document setUserToDisplay as a member of undocumented symbol Profile.
     [java] >> WARNING: Trying to document redisplayLastUser as a member of undocumented symbol Profile.
     [java] >> WARNING: Trying to document populateData as a member of undocumented symbol Profile.
     [java] >> WARNING: Trying to document setHash as a member of undocumented symbol Profile.
     [java] >> WARNING: Trying to document createFormElem as a member of undocumented symbol Profile.
     [java] >> WARNING: Trying to document drawIframe as a member of undocumented symbol Profile.
     [java] >> WARNING: Trying to document drawSections as a member of undocumented symbol Profile.
     [java] >> WARNING: Trying to document fire as a member of undocumented symbol Profile.
     [java] >> WARNING: Trying to document displayMessage as a member of undocumented symbol Profile.
     [java] >> WARNING: Trying to document done as a member of undocumented symbol NewUserDialog.
     [java] >> WARNING: Trying to document done as a member of undocumented symbol ResetPasswordDialog.
     [java] >> WARNING: Trying to document UsersClient as a member of undocumented symbol orion.profile.usersClient.
     [java] >> WARNING: Trying to document UsersList as a member of undocumented symbol eclipse.
     [java] >> WARNING: Trying to document calculateQuery as a member of undocumented symbol UsersList.
     [java] >> WARNING: Trying to document loadUsers as a member of undocumented symbol UsersList.
     [java] >> WARNING: Trying to document getUsersListSubset as a member of undocumented symbol UsersList.
     [java] >> WARNING: Trying to document UsersRenderer as a member of undocumented symbol eclipse.
     [java] >> WARNING: Trying to document getCellHeaderElement as a member of undocumented symbol UsersRenderer.
     [java] >> WARNING: Trying to document getCellElement as a member of undocumented symbol UsersRenderer.
     [java] >> WARNING: Can't augment contributer: orion.webui.Dialog
     [java] 
     [java] Creates a modal prompt dialog., not found.
     [java] >> WARNING: Can't augment contributer: orion.webui.Dropdown
     [java] 
     [java] Attaches context menu behavior to a given node., not found.
     [java] >> WARNING: Can't augment contributer: orion.editor.AbstractStyler, not found.
     [java] 2387 warnings.

download3rdPartyLibs:
      [get] Getting: http://requirejs.org/docs/release/2.1.6/r.js
      [get] To: /jobs/genie.eclipse.orion/orion-client-stylers/workspace/target/requirejs/r.js

updateBuildLabel:
     [echo] Updating build label...

checkDirs:

cleanStaging:

cleanOptimized:

requirejs:
     [echo] requirejs build started...
    [mkdir] Created dir: /jobs/genie.eclipse.orion/orion-client-stylers/workspace/staging
    [mkdir] Created dir: /jobs/genie.eclipse.orion/orion-client-stylers/workspace/optimized

widget.check:

widgetClean:
    [mkdir] Created dir: /jobs/genie.eclipse.orion/orion-client-stylers/workspace/built-js
     [copy] Copying 1 file to /jobs/genie.eclipse.orion/orion-client-stylers/workspace/staging
     [copy] Copying 1 file to /jobs/genie.eclipse.orion/orion-client-stylers/workspace/staging
     [copy] Copying 1 file to /jobs/genie.eclipse.orion/orion-client-stylers/workspace/staging
     [copy] Copying 1 file to /jobs/genie.eclipse.orion/orion-client-stylers/workspace/staging
     [copy] Copying 1 file to /jobs/genie.eclipse.orion/orion-client-stylers/workspace/staging
     [copy] Copying 1 file to /jobs/genie.eclipse.orion/orion-client-stylers/workspace/staging
     [copy] Copying 1 file to /jobs/genie.eclipse.orion/orion-client-stylers/workspace/staging
     [copy] Copying 1 file to /jobs/genie.eclipse.orion/orion-client-stylers/workspace/staging
     [copy] Copying 1 file to /jobs/genie.eclipse.orion/orion-client-stylers/workspace/staging
[stageBundles] Found bundle web folder: /jobs/genie.eclipse.orion/orion-client-stylers/workspace/bundles/org.eclipse.orion.client.core/web
[stageBundles] Found bundle web folder: /jobs/genie.eclipse.orion/orion-client-stylers/workspace/bundles/org.eclipse.orion.client.cf/web
[stageBundles] Found bundle web folder: /jobs/genie.eclipse.orion/orion-client-stylers/workspace/bundles/org.eclipse.orion.client.ui/web
[stageBundles] Found bundle web folder: /jobs/genie.eclipse.orion/orion-client-stylers/workspace/bundles/org.eclipse.orion.client.editor/web
[stageBundles] Found bundle web folder: /jobs/genie.eclipse.orion/orion-client-stylers/workspace/bundles/org.eclipse.orion.client.git/web
[stageBundles] Found bundle web folder: /jobs/genie.eclipse.orion/orion-client-stylers/workspace/bundles/org.eclipse.orion.client.javascript/web
[stageBundles] Found bundle web folder: /jobs/genie.eclipse.orion/orion-client-stylers/workspace/bundles/org.eclipse.orion.client.webtools/web
[stageBundles] Found bundle web folder: /jobs/genie.eclipse.orion/orion-client-stylers/workspace/bundles/org.eclipse.orion.client.users/web
     [copy] Copying 1153 files to /jobs/genie.eclipse.orion/orion-client-stylers/workspace/staging

orionOptimize:

browserOptimize:

editorOptimize:

editorStylersOptimize:
     [java] Error: Error: ERROR: build file does not exist: /jobs/genie.eclipse.orion/orion-client-stylers/workspace/staging/editor.build.stylers-js.js
[INFO] ------------------------------------------------------------------------
[INFO] Reactor Summary:
[INFO] 
[INFO] Orion Client Parent ............................... FAILURE [4:25.373s]
[INFO] org.eclipse.orion.client.core ..................... SKIPPED
[INFO] org.eclipse.orion.client.editor ................... SKIPPED
[INFO] org.eclipse.orion.client.webtools ................. SKIPPED
[INFO] org.eclipse.orion.client.javascript ............... SKIPPED
[INFO] org.eclipse.orion.client.git ...................... SKIPPED
[INFO] org.eclipse.orion.client.cf ....................... SKIPPED
[INFO] org.eclipse.orion.client.ui ....................... SKIPPED
[INFO] org.eclipse.orion.client.users .................... SKIPPED
[INFO] org.eclipse.orion.doc.isv ......................... SKIPPED
[INFO] org.eclipse.orion.doc.user ........................ SKIPPED
[INFO] org.eclipse.orion.client.feature .................. SKIPPED
[INFO] org.eclipse.orion.client.repository ............... SKIPPED
[INFO] ------------------------------------------------------------------------
[INFO] BUILD FAILURE
[INFO] ------------------------------------------------------------------------
[INFO] Total time: 5:11.702s
[INFO] Finished at: Thu Apr 10 16:30:09 EDT 2014
[INFO] Final Memory: 34M/1722M
[INFO] ------------------------------------------------------------------------
[INFO] o.h.m.e.h.MavenExecutionResultHandler - Build failed with exception(s)
[INFO] o.h.m.e.h.MavenExecutionResultHandler - [1] org.apache.maven.lifecycle.LifecycleExecutionException: Failed to execute goal org.apache.maven.plugins:maven-antrun-plugin:1.7:run (default) on project org.eclipse.orion.client.parent: An Ant BuildException has occured: The following error occurred while executing this line:
/jobs/genie.eclipse.orion/orion-client-stylers/workspace/releng/org.eclipse.orion.client.releng/builder/orion.mini.xml:338: The following error occurred while executing this line:
/jobs/genie.eclipse.orion/orion-client-stylers/workspace/releng/org.eclipse.orion.client.releng/builder/orion.mini.xml:167: The following error occurred while executing this line:
/jobs/genie.eclipse.orion/orion-client-stylers/workspace/releng/org.eclipse.orion.client.releng/builder/orion.mini.xml:157: The following error occurred while executing this line:
/jobs/genie.eclipse.orion/orion-client-stylers/workspace/releng/org.eclipse.orion.client.releng/builder/orion.mini.xml:272: Java returned: 1
around Ant part ...<ant antfile="/jobs/genie.eclipse.orion/orion-client-stylers/workspace/releng/org.eclipse.orion.client.releng/builder/orion.mini.xml">... @ 14:137 in /jobs/genie.eclipse.orion/orion-client-stylers/workspace/target/antrun/build-main.xml
[DEBUG] Closing connection to remote
[ERROR] Failed to execute goal org.apache.maven.plugins:maven-antrun-plugin:1.7:run (default) on project org.eclipse.orion.client.parent: An Ant BuildException has occured: The following error occurred while executing this line:
[ERROR] /jobs/genie.eclipse.orion/orion-client-stylers/workspace/releng/org.eclipse.orion.client.releng/builder/orion.mini.xml:338: The following error occurred while executing this line:
[ERROR] /jobs/genie.eclipse.orion/orion-client-stylers/workspace/releng/org.eclipse.orion.client.releng/builder/orion.mini.xml:167: The following error occurred while executing this line:
[ERROR] /jobs/genie.eclipse.orion/orion-client-stylers/workspace/releng/org.eclipse.orion.client.releng/builder/orion.mini.xml:157: The following error occurred while executing this line:
[ERROR] /jobs/genie.eclipse.orion/orion-client-stylers/workspace/releng/org.eclipse.orion.client.releng/builder/orion.mini.xml:272: Java returned: 1
[ERROR] around Ant part ...<ant antfile="/jobs/genie.eclipse.orion/orion-client-stylers/workspace/releng/org.eclipse.orion.client.releng/builder/orion.mini.xml">... @ 14:137 in /jobs/genie.eclipse.orion/orion-client-stylers/workspace/target/antrun/build-main.xml
[ERROR] -> [Help 1]
[ERROR] 
[ERROR] To see the full stack trace of the errors, re-run Maven with the -e switch.
[ERROR] Re-run Maven using the -X switch to enable full debug logging.
[ERROR] 
[ERROR] For more information about the errors and possible solutions, please read the following articles:
[ERROR] [Help 1] http://cwiki.apache.org/confluence/display/MAVEN/MojoExecutionException
[DEBUG] Waiting for process to finish
[DEBUG] Result: 1

--
This message is automatically generated by Hudson. 
For more information on Hudson, see: http://hudson-ci.org/


Back to the top