[Date Prev][Date Next][Thread Prev][Thread Next][Date Index][Thread Index] [List Home]
[orbit-dev] [ORBIT-BUILD: orbit-I] orbit-I Build Failed

View results here -> http://build.eclipse.org:9777/dashboard/tab/build/detail/orbit-I?log=log20120305134341

BUILD FAILED
Ant Error Message: /shared/orbit/org.eclipse.orbit.releng.control/cc_project_build.xml:69: The following error occurred while executing this line: /shared/orbit/projectBuilders/orbit-I/org.eclipse.orbit/org.eclipse.orbit.releng.builder/build.xml:89: The following error occurred while executing this line: /shared/orbit/projectBuilders/orbit-I/org.eclipse.orbit/org.eclipse.orbit.releng.builder/distribution/orbit.build/build.xml:31: The following error occurred while executing this line: /shared/orbit/projectBuilders/orbit-I/org.eclipse.orbit/org.eclipse.orbit.releng.builder/scripts/build/runbuild.xml:22: The following error occurred while executing this line: /shared/orbit/projectBuilders/orbit-I/org.eclipse.orbit/org.eclipse.orbit.releng.builder/scripts/build/checkForFastFail.xml:65: The following error occurred while executing this line: /shared/orbit/projectBuilders/orbit-I/org.eclipse.orbit/org.eclipse.orbit.releng.builder/scripts/build/checkForFastFail.xml:107: The following error occurred while executing this line: /shared/orbit/projectBuilders/orbit-I/org.eclipse.orbit/org.eclipse.orbit.releng.builder/scripts/build/checkForFastFail.xml:134: Generic failure for unknown reasons. See log context.
Date of build: 2012-03-05T13:43:41
Time to build: 19 minutes 55 seconds
Last changed: 2012-03-05T13:41:06
Last log entry: [guava] updated tags to v201203051440

 Errors/Warnings: (81)
Java Result: 13Result: 1

Result: 1

Result: 1

Result: 1

checkout.builder.clean: true

cvs checkout: Updating org.eclipse.orbit/org.eclipse.orbit.releng

cvs checkout: Updating org.eclipse.orbit/org.eclipse.orbit.releng/.settings

cvs checkout: Updating org.eclipse.orbit/org.eclipse.orbit.releng/ip_logs

cvs checkout: Updating org.eclipse.orbit/org.eclipse.orbit.releng/maps

cvs checkout: Updating org.eclipse.orbit/org.eclipse.orbit.releng/psf

retieved new version of build.cfg

Version tag for org.eclipse.orbit/org.eclipse.orbit.releng.builder is: v201201190330

cvs checkout: Updating org.eclipse.orbit/org.eclipse.orbit.releng.builder

cvs checkout: Updating org.eclipse.orbit/org.eclipse.orbit.releng.builder/.settings

cvs checkout: Updating org.eclipse.orbit/org.eclipse.orbit.releng.builder/components

cvs checkout: Updating org.eclipse.orbit/org.eclipse.orbit.releng.builder/components/set1

cvs checkout: Updating org.eclipse.orbit/org.eclipse.orbit.releng.builder/components/set2

cvs checkout: Updating org.eclipse.orbit/org.eclipse.orbit.releng.builder/distribution

cvs checkout: Updating org.eclipse.orbit/org.eclipse.orbit.releng.builder/distribution/orbit.build

cvs checkout: Updating org.eclipse.orbit/org.eclipse.orbit.releng.builder/distribution/orbit.site

cvs checkout: Updating org.eclipse.orbit/org.eclipse.orbit.releng.builder/distribution/orbit.site/commonFiles

cvs checkout: Updating org.eclipse.orbit/org.eclipse.orbit.releng.builder/distribution/orbit.site/staticDropFiles

cvs checkout: Updating org.eclipse.orbit/org.eclipse.orbit.releng.builder/distribution/orbit.site/templateFiles

cvs checkout: Updating org.eclipse.orbit/org.eclipse.orbit.releng.builder/distribution/orbit.upload

cvs checkout: Updating org.eclipse.orbit/org.eclipse.orbit.releng.builder/rootfiles

cvs checkout: Updating org.eclipse.orbit/org.eclipse.orbit.releng.builder/scripts

cvs checkout: Updating org.eclipse.orbit/org.eclipse.orbit.releng.builder/scripts/build

cvs checkout: Updating org.eclipse.orbit/org.eclipse.orbit.releng.builder/scripts/dependency

cvs checkout: Updating org.eclipse.orbit/org.eclipse.orbit.releng.builder/scripts/tests

cvs checkout: Updating org.eclipse.orbit/org.eclipse.orbit.releng.builder/scripts/tools

cvs checkout: Updating org.eclipse.orbit/org.eclipse.orbit.releng.builder/scripts/upload

cvs checkout: Updating org.eclipse.orbit/org.eclipse.orbit.releng.builder/templateFiles

cvs checkout: Updating org.eclipse.orbit/org.eclipse.orbit.releng.builder/templateRepo

retieved new version of org.eclipse.orbit/org.eclipse.orbit.releng.builder

cctimestamp: 20120305134341

datetime: 201203051345

timestamp: 20120305134341

buildfile: /shared/orbit/projectBuilders/orbit-I/org.eclipse.orbit/org.eclipse.orbit.releng.builder/distribution/orbit.build/build.xml

resolution.devMode: true

eclipse builder being installed to: /shared/orbit/basebuilders/orbit-I

Creating dependency script: /shared/orbit/projects/orbit-I/workdir/dependency.eclipsebuilder.xml

touch file /shared/orbit/prereqsCache/eclipse-SDK-3.8M4-linux-gtk.tar.gz

grouopId: eclipsebuilder

install.destination: /shared/orbit/basebuilders/orbit-I

FAST FAIL CHECK found reason to end build: Generic failure for unknown reasons. See log context.

Resource being used in fast fail check: /shared/orbit/logs/orbit-I/antBuilderOutput.log

FAST FAIL CHECK found matching string 'BUILD FAILED'

----------------

Context of matching text leading to fast fail (-10 to +20 lines, see /shared/orbit/logs/orbit-I/antBuilderOutput.log if reason not obvious from context):

----------------

[orbit-set1] [echo] Calling orbit.sourceBundleVersionReplacer for /shared/orbit/projects/orbit-I/workdir/tmp/eclipse/plugins/org.apache.el.source_7.0.21.v201203050645.

[orbit-set1]

[orbit-set1] properties:

[orbit-set1]

[orbit-set1] init:

[orbit-set1]

[orbit-set1] gather.bin.parts:

[orbit-set1] [mkdir] Created dir: /shared/orbit/projects/orbit-I/workdir/tmp/eclipse/plugins/com.google.guava.source_10.0.1.v201203051440

[orbit-set1] [copy] Copying 333 files to /shared/orbit/projects/orbit-I/workdir/tmp/eclipse/plugins/com.google.guava.source_10.0.1.v201203051440

[orbit-set1]

[orbit-set1] BUILD FAILED

[orbit-set1] /shared/orbit/projectBuilders/orbit-I/org.eclipse.orbit/org.eclipse.orbit.releng.builder/scripts/build/runbuild.xml:62: The following error occurred while executing this line:

[orbit-set1] /opt/public/orbit/basebuilders/orbit-I/eclipse/plugins/org.eclipse.pde.build_3.8.0.v20111116-2011/scripts/build.xml:37: The following error occurred while executing this line:

[orbit-set1] /opt/public/orbit/basebuilders/orbit-I/eclipse/plugins/org.eclipse.pde.build_3.8.0.v20111116-2011/scripts/build.xml:118: The following error occurred while executing this line:

[orbit-set1] /shared/orbit/projectBuilders/orbit-I/org.eclipse.orbit/org.eclipse.orbit.releng.builder/components/set1/customTargets.xml:61: The following error occurred while executing this line:

[orbit-set1] /opt/public/orbit/basebuilders/orbit-I/eclipse/plugins/org.eclipse.pde.build_3.8.0.v20111116-2011/scripts/genericTargets.xml:190: The following error occurred while executing this line:

[orbit-set1] /shared/orbit/projects/orbit-I/workdir/assemble.org.eclipse.pde.build.container.feature.all.xml:25: The following error occurred while executing this line:

[orbit-set1] /shared/orbit/projects/orbit-I/workdir/assemble.org.eclipse.pde.build.container.feature.all.xml:15: The following error occurred while executing this line:

[orbit-set1] /shared/orbit/projectBuilders/orbit-I/org.eclipse.orbit/org.eclipse.orbit.releng.builder/components/set1/customTargets.xml:91: The following error occurred while executing this line:

[orbit-set1] /shared/orbit/projects/orbit-I/workdir/assemble.org.eclipse.pde.build.container.feature.xml:89: The following error occurred while executing this line:

[orbit-set1] /shared/orbit/projects/orbit-I/workdir/assemble.org.eclipse.pde.build.container.feature.xml:324: The following error occurred while executing this line:

[orbit-set1] /shared/orbit/projects/orbit-I/workdir/assemble.org.eclipse.pde.build.container.feature.xml:27: The following error occurred while executing this line:

[orbit-set1] /opt/public/orbit/projects/orbit-I/workdir/plugins/com.google.guava.source_10.0.1/build.xml:125: Problem reading the content of the manifest : /shared/orbit/projects/orbit-I/workdir/tmp/eclipse/plugins/com.google.guava.source_10.0.1.v201203051440/META-INF/MANIFEST.MF

[orbit-set1]

[orbit-set1] Total time: 17 minutes 38 seconds

[orbit-set1] An error has occurred. See the log file

[orbit-set1] /opt/buildhomes/orbitBuild/workspace/.metadata/.log.

[orbit-set1] Java Result: 13

checkForFastFail:

----------------

 Unit Tests: (0)
No Tests Run
This project doesn't have any tests
 

 Modifications since last successful build:  (7)
modified mbruch /org.eclipse.orbit/org.eclipse.orbit.releng/maps/bundles.map 1.797 2012-03-05T13:41:06 [guava] updated tags to v201203051440
modified mbruch /org.eclipse.orbit/org.eclipse.orbit.releng/maps/bundles.map 1.796 2012-03-05T13:29:43 [guava] after updated tag for source-bundle folder
modified mbruch /org.eclipse.orbit/org.eclipse.orbit.releng/maps/bundles.map 1.795 2012-03-05T09:48:23 [guava] fixed misspelling for source-bundle
modified mbruch /org.eclipse.orbit/org.eclipse.orbit.releng/maps/bundles.map 1.794 2012-03-05T09:15:37 [guava] tagged feature.set1 project; empty-line change to trigger build.
modified mbruch /org.eclipse.orbit/org.eclipse.orbit.releng/ip_logs/com.google.guava.xml 1.1 2012-03-05T08:52:46 [guava] added Google Guava 10.0.1 to Orbit
modified mbruch /org.eclipse.orbit/org.eclipse.orbit.releng/maps/bundles.map 1.793 2012-03-05T08:52:46 [guava] added Google Guava 10.0.1 to Orbit
modified mbruch /org.eclipse.orbit/org.eclipse.orbit.releng/psf/orbit.psf 1.120 2012-03-05T08:52:46 [guava] added Google Guava 10.0.1 to Orbit