[Date Prev][Date Next][Thread Prev][Thread Next][Date Index][Thread Index] [List Home]
[orbit-dev] [ORBIT-BUILD: orbit-I] orbit-I Build Failed

View results here -> http://build.eclipse.org:9777/dashboard/build/detail//orbit-I?log=log20080311135052

BUILD FAILED
Ant Error Message: /shared/orbit/org.eclipse.orbit.releng.control/cc_project_build.xml:74: The following error occurred while executing this line: /shared/orbit/projectBuilders/orbit-I/org.eclipse.orbit/org.eclipse.orbit.releng.builder/build.xml:148: The following error occurred while executing this line: /shared/orbit/projectBuilders/orbit-I/org.eclipse.orbit/org.eclipse.orbit.releng.builder/distribution/orbit.upload/build.xml:9: The following error occurred while executing this line: /shared/orbit/projectBuilders/orbit-I/org.eclipse.orbit/org.eclipse.orbit.releng.builder/scripts/upload/upload.xml:84: exec returned: 12
Date of build: 2008-03-11 13:50 (GMT)
Time to build: 46 minutes 12 seconds
Last changed: 03/11/2008 13:47:17
Last log entry: *** empty log message ***

 Errors/Warnings: (19)
Test org.eclipse.orbit.releng.tests.TestLayout FAILED
checkout.builder.clean: true

retieved new version of build.cfg

Version tag for org.eclipse.orbit/org.eclipse.orbit.releng.builder is: v200803100818

retieved new version of org.eclipse.orbit/org.eclipse.orbit.releng.builder

cctimestamp: 20080311135052

datetime: 200803111352

timestamp: 20080311135052

buildfile: /shared/orbit/projectBuilders/orbit-I/org.eclipse.orbit/org.eclipse.orbit.releng.builder/distribution/orbit.build/build.xml

buildDirectory: /shared/orbit/projects/orbit-I/workdir

chmod for /shared/orbit/projects/orbit-I/workdir/I20080311135052

RSYNC to: /home/data/users/david_williams/downloads/tools/orbit/committers/drops/I20080311135052

rsync: writefd_unbuffered failed to write 446 bytes [sender]: Broken pipe (32)

rsync: close failed on "/home/data/users/david_williams/downloads/tools/orbit/committers/drops/I20080311135052/updateSite/plugins/.com.ibm.icu_3.8.1.v20080304.jar.ZPwLVt": Input/output error (5)

rsync error: error in file IO (code 11) at receiver.c(628) [receiver=2.6.8]

rsync: connection unexpectedly closed (20628 bytes received so far) [generator]

rsync error: error in rsync protocol data stream (code 12) at io.c(459) [generator=2.6.8]

rsync: connection unexpectedly closed (6502 bytes received so far) [sender]

rsync error: error in rsync protocol data stream (code 12) at io.c(459) [sender=2.6.8]

 Unit Tests: (0)
No Tests Run
This project doesn't have any tests
 

 Modifications since last successful build:  (1)
modified prapicau /org.eclipse.orbit/org.eclipse.orbit.releng/maps/bundles.map 03/11/2008 13:47:17 *** empty log message ***