[Date Prev][Date Next][Thread Prev][Thread Next][Date Index][Thread Index] [List Home]
[nebula-dev] Build failed in Hudson: nebula.incubation #354

See <https://hudson.eclipse.org/hudson/job/nebula.incubation/354/changes>

Changes:

[Wim Jongman] 381894: Add RAP Incubator to repositories

------------------------------------------
[...truncated 8220 lines...]
13 KB   29 KB   1889 KB   
13 KB   30 KB   1889 KB   
13 KB   30 KB   1889 KB   
13 KB   31 KB   1889 KB   
13 KB   31 KB   1889 KB   
13 KB   31 KB   1889 KB   
13 KB   31 KB   1889 KB   
13 KB   32 KB   1889 KB   
13 KB   32 KB   1889 KB   
13 KB   33 KB   1889 KB   
13 KB   33 KB   1889 KB   
13 KB   34 KB   1889 KB   
13 KB   34 KB   1889 KB   
13 KB   35 KB   1889 KB   
13 KB   35 KB   1889 KB   
13 KB   36 KB   1889 KB   
13 KB   36 KB   1889 KB   
13 KB   36 KB   1889 KB   
13 KB   37 KB   1889 KB   
13 KB   37 KB   1889 KB   
13 KB   38 KB   1889 KB   
13 KB   38 KB   1889 KB   
13 KB   39 KB   1889 KB   
13 KB   39 KB   1889 KB   
13 KB   40 KB   1889 KB   
13 KB   41 KB   1889 KB   
13 KB   41 KB   1889 KB   
13 KB   42 KB   1889 KB   
13 KB   44 KB   1889 KB   
13 KB   45 KB   1889 KB   
                          
Downloaded: http://repo1.maven.org/maven2/org/apache/ant/ant/1.8.2/ant-1.8.2.jar (1889 KB at 651.0 KB/sec)
985 B   13 KB   45 KB     
2 KB   13 KB   45 KB    
2 KB   13 KB   45 KB   
3 KB   13 KB   45 KB   
3 KB   13 KB   45 KB   
4 KB   13 KB   45 KB   
4 KB   13 KB   45 KB   
5 KB   13 KB   45 KB   
5 KB   13 KB   45 KB   
5 KB   13 KB   45 KB   
6 KB   13 KB   45 KB   
7 KB   13 KB   45 KB   
7 KB   13 KB   45 KB   
8 KB   13 KB   45 KB   
8 KB   13 KB   45 KB   
9 KB   13 KB   45 KB   
9 KB   13 KB   45 KB   
10 KB   13 KB   45 KB   
10 KB   13 KB   45 KB   
11 KB   13 KB   45 KB   
11 KB   13 KB   45 KB   
11 KB   13 KB   45 KB   
11 KB   13 KB   45 KB   
12 KB   13 KB   45 KB   
12 KB   13 KB   45 KB   
13 KB   13 KB   45 KB   
13 KB   13 KB   45 KB   
14 KB   13 KB   45 KB   
14 KB   13 KB   45 KB   
15 KB   13 KB   45 KB   
15 KB   13 KB   45 KB   
16 KB   13 KB   45 KB   
16 KB   13 KB   45 KB   
17 KB   13 KB   45 KB   
17 KB   13 KB   45 KB   
17 KB   13 KB   45 KB   
17 KB   13 KB   45 KB   
18 KB   13 KB   45 KB   
19 KB   13 KB   45 KB   
19 KB   13 KB   45 KB   
19 KB   13 KB   45 KB   
20 KB   13 KB   45 KB   
20 KB   13 KB   45 KB   
21 KB   13 KB   45 KB   
21 KB   13 KB   45 KB   
22 KB   13 KB   45 KB   
22 KB   13 KB   45 KB   
23 KB   13 KB   45 KB   
23 KB   13 KB   45 KB   
24 KB   13 KB   45 KB   
24 KB   13 KB   45 KB   
25 KB   13 KB   45 KB   
26 KB   13 KB   45 KB   
26 KB   13 KB   45 KB   
26 KB   13 KB   45 KB   
26 KB   13 KB   45 KB   
27 KB   13 KB   45 KB   
27 KB   13 KB   45 KB   
27 KB   13 KB   45 KB   
28 KB   13 KB   45 KB   
28 KB   13 KB   45 KB   
29 KB   13 KB   45 KB   
29 KB   13 KB   45 KB   
30 KB   13 KB   45 KB   
30 KB   13 KB   45 KB   
30 KB   13 KB   45 KB   
30 KB   13 KB   45 KB   
31 KB   13 KB   45 KB   
31 KB   13 KB   45 KB   
31 KB   13 KB   45 KB   
32 KB   13 KB   45 KB   
33 KB   13 KB   45 KB   
33 KB   13 KB   45 KB   
34 KB   13 KB   45 KB   
34 KB   13 KB   45 KB   
37 KB   13 KB   45 KB   
                        
Downloaded: http://repo1.maven.org/maven2/org/apache/ant/ant-launcher/1.8.2/ant-launcher-1.8.2.jar (13 KB at 6.1 KB/sec)
37 KB   995 B   45 KB   
37 KB   2 KB   45 KB    
37 KB   2 KB   45 KB   
37 KB   3 KB   45 KB   
37 KB   3 KB   45 KB   
37 KB   4 KB   45 KB   
37 KB   4 KB   45 KB   
37 KB   5 KB   45 KB   
37 KB   5 KB   45 KB   
37 KB   5 KB   45 KB   
37 KB   6 KB   45 KB   
37 KB   7 KB   45 KB   
37 KB   7 KB   45 KB   
37 KB   8 KB   45 KB   
37 KB   8 KB   45 KB   
37 KB   9 KB   45 KB   
37 KB   9 KB   45 KB   
37 KB   10 KB   45 KB   
37 KB   10 KB   45 KB   
37 KB   11 KB   45 KB   
37 KB   11 KB   45 KB   
37 KB   11 KB   45 KB   
37 KB   12 KB   45 KB   
37 KB   12 KB   45 KB   
37 KB   13 KB   45 KB   
37 KB   13 KB   45 KB   
37 KB   14 KB   45 KB   
37 KB   14 KB   45 KB   
37 KB   15 KB   45 KB   
37 KB   15 KB   45 KB   
37 KB   16 KB   45 KB   
37 KB   16 KB   45 KB   
37 KB   17 KB   45 KB   
37 KB   17 KB   45 KB   
37 KB   17 KB   45 KB   
37 KB   17 KB   45 KB   
37 KB   18 KB   45 KB   
37 KB   19 KB   45 KB   
37 KB   19 KB   45 KB   
37 KB   20 KB   45 KB   
37 KB   20 KB   45 KB   
37 KB   20 KB   45 KB   
37 KB   20 KB   45 KB   
37 KB   21 KB   45 KB   
37 KB   22 KB   45 KB   
37 KB   22 KB   45 KB   
37 KB   23 KB   45 KB   
37 KB   23 KB   45 KB   
37 KB   24 KB   45 KB   
37 KB   24 KB   45 KB   
37 KB   24 KB   45 KB   
37 KB   24 KB   45 KB   
37 KB   25 KB   45 KB   
37 KB   25 KB   45 KB   
37 KB   26 KB   45 KB   
37 KB   27 KB   45 KB   
37 KB   27 KB   45 KB   
37 KB   27 KB   45 KB   
37 KB   27 KB   45 KB   
37 KB   28 KB   45 KB   
37 KB   29 KB   45 KB   
37 KB   29 KB   45 KB   
37 KB   30 KB   45 KB   
37 KB   30 KB   45 KB   
37 KB   31 KB   45 KB   
37 KB   31 KB   45 KB   
37 KB   32 KB   45 KB   
37 KB   32 KB   45 KB   
37 KB   33 KB   45 KB   
37 KB   34 KB   45 KB   
37 KB   34 KB   45 KB   
37 KB   34 KB   45 KB   
37 KB   34 KB   45 KB   
37 KB   37 KB   45 KB   
37 KB   39 KB   45 KB   
                        
Downloaded: http://repo1.maven.org/maven2/org/codehaus/mojo/wagon-maven-plugin/1.0-beta-3/wagon-maven-plugin-1.0-beta-3.jar (45 KB at 19.8 KB/sec)
                        
Downloaded: http://repo1.maven.org/maven2/org/apache/maven/shared/file-management/1.2.1/file-management-1.2.1.jar (37 KB at 16.3 KB/sec)
                        
Downloaded: http://repo1.maven.org/maven2/org/apache/maven/shared/maven-shared-io/1.1/maven-shared-io-1.1.jar (39 KB at 19.2 KB/sec)
[INFO] ------------------------------------------------------------------------
[INFO] Reactor Summary:
[INFO] 
[INFO] nebula-parent ..................................... SUCCESS [0.318s]
[INFO] org.eclipse.nebula.examples ....................... SUCCESS [4.897s]
[INFO] Nebula Examples View Feature ...................... SUCCESS [1.400s]
[INFO] Collapsible Buttons Widget ........................ SUCCESS [2.560s]
[INFO] Nebula incubation parent .......................... SUCCESS [0.012s]
[INFO] Eclipse Nebula Feature ............................ SUCCESS [1.336s]
[INFO] org.eclipse.nebula.widgets.formattedtext .......... SUCCESS [2.688s]
[INFO] org.eclipse.nebula.widgets.datechooser ............ SUCCESS [2.268s]
[INFO] org.eclipse.nebula.widgets.formattedtext.feature .. SUCCESS [1.353s]
[INFO] org.eclipse.nebula.widgets.datechooser.feature .... SUCCESS [1.354s]
[INFO] org.eclipse.nebula.widgets.treemapper ............. SUCCESS [2.096s]
[INFO] org.eclipse.nebula.widgets.treemapper.feature ..... SUCCESS [1.384s]
[INFO] org.eclipse.nebula.widgets.radiogroup ............. SUCCESS [2.241s]
[INFO] org.eclipse.nebula.widgets.radiogroup.feature ..... SUCCESS [1.327s]
[INFO] org.eclipse.nebula.widgets.pagination ............. SUCCESS [3.581s]
[INFO] Nebula Pagination Control ......................... SUCCESS [1.515s]
[INFO] org.eclipse.nebula.widgets.picture ................ SUCCESS [2.309s]
[INFO] Nebula Picture Control ............................ SUCCESS [1.679s]
[INFO] org.eclipse.nebula.widgets.geomap ................. SUCCESS [2.377s]
[INFO] org.eclipse.nebula.widgets.geomap.feature ......... SUCCESS [1.263s]
[INFO] Eclipse Nebula Feature ............................ SUCCESS [1.276s]
[INFO] org.eclipse.nebula.widgets.datechooser.example .... SUCCESS [2.098s]
[INFO] org.eclipse.nebula.widgets.radiogroup.example ..... SUCCESS [2.008s]
[INFO] org.eclipse.nebula.widgets.treemapper.examples .... SUCCESS [2.047s]
[INFO] org.eclipse.nebula.widgets.pagination.example ..... SUCCESS [2.761s]
[INFO] org.eclipse.nebula.widgets.picture.example ........ SUCCESS [1.984s]
[INFO] org.eclipse.nebula.widgets.geomap.example ......... SUCCESS [1.934s]
[INFO] Nebula Examples View Feature ...................... SUCCESS [1.533s]
[INFO] org.eclipse.nebula.widgets.collapsiblebuttons.example  SUCCESS [3.268s]
[INFO] org.eclipse.nebula.widgets.radiogroup.tests ....... SUCCESS [34.859s]
[INFO] org.eclipse.nebula.widgets.treemapper.tests ....... SUCCESS [17.696s]
[INFO] org.eclipse.nebula.widgets.pagination.snippets .... SUCCESS [3.010s]
[INFO] org.eclipse.nebula.widgets.pagination.tests ....... SUCCESS [5.688s]
[INFO] org.eclipse.nebula.widgets.picture.snippets ....... SUCCESS [2.161s]
[INFO] org.eclipse.nebula.widgets.geomap.snippets ........ SUCCESS [1.998s]
[INFO] Eclipse Nebula Plugin Update Site ................. FAILURE [36.590s]
[INFO] ------------------------------------------------------------------------
[INFO] BUILD FAILURE
[INFO] ------------------------------------------------------------------------
[INFO] Total time: 3:24.471s
[INFO] Finished at: Wed Jun 06 13:59:17 EDT 2012
[INFO] Final Memory: 168M/551M
[INFO] ------------------------------------------------------------------------
[ERROR] Failed to execute goal org.eclipse.dash.maven:eclipse-signing-maven-plugin:1.0.3:pack (pack) on project org.eclipse.nebula.updatesite.incubation: file to pack does not exist! -> <https://hudson.eclipse.org/hudson/job/nebula.incubation/ws/releng/org.eclipse.nebula.updatesite.incubation/target/org.eclipse.nebula.updatesite.incubation.zip> -> [Help 1]
[ERROR] 
[ERROR] To see the full stack trace of the errors, re-run Maven with the -e switch.
[ERROR] Re-run Maven using the -X switch to enable full debug logging.
[ERROR] 
[ERROR] For more information about the errors and possible solutions, please read the following articles:
[ERROR] [Help 1] http://cwiki.apache.org/confluence/display/MAVEN/MojoFailureException
[ERROR] 
[ERROR] After correcting the problems, you can resume the build with the command
[ERROR]   mvn <goals> -rf :org.eclipse.nebula.updatesite.incubation
Terminating xvnc.
Recording test results