[Date Prev][Date Next][Thread Prev][Thread Next][Date Index][Thread Index] [List Home]
[linuxtools-dev] Build failed in Hudson: linuxtools-master #903

See <https://hudson.eclipse.org/hudson/job/linuxtools-master/903/changes>

Changes:

[Bernd Hufmann] Fix for bug 381096 (fix for ClassCastException)

[Francois Chouinard] Push LTTng MANIFEST.MF/pom.xml to 1.0 and correct features dependencies

[Francois Chouinard] Remove references to 'incubation'

------------------------------------------
[...truncated 15337 lines...]
[INFO] 
[INFO] --- maven-antrun-plugin:1.7:run (deploy) @ org.eclipse.linuxtools.releng-site ---
[WARNING] Parameter tasks is deprecated, use target instead
[INFO] Executing tasks

main:
     [copy] Copying 351 files to /home/data/httpd/download.eclipse.org/technology/linuxtools/updates-nightly
[INFO] Executed tasks
[INFO] ------------------------------------------------------------------------
[INFO] Reactor Summary:
[INFO] 
[INFO] Eclipse Linux Tools Parent ........................ SUCCESS [3.191s]
[INFO] Eclipse Linux Tools ChangeLog Parent .............. SUCCESS [0.104s]
[INFO] Linux Tools ChangeLog Core Plug-in ................ SUCCESS [16.328s]
[INFO] Linux Tools ChangeLog C/C++ Parser Plug-in ........ SUCCESS [5.783s]
[INFO] Linux Tools ChangeLog Documentation Plug-in ....... SUCCESS [0.519s]
[INFO] Linux Tools ChangeLog Java Parser Plug-in ......... SUCCESS [4.404s]
[INFO] Linux Tools ChangeLog Feature ..................... SUCCESS [1.304s]
[INFO] Linux Tools ChangeLog Core Tests Plug-in .......... SUCCESS [33.642s]
[INFO] Eclipse Linux Tools Valgrind Parent ............... SUCCESS [0.139s]
[INFO] Linux Tools Tools Launcher Core Plug-in ........... SUCCESS [5.327s]
[INFO] Linux Tools Binutils Plug-in ...................... SUCCESS [7.861s]
[INFO] Linux Tools Data Viewers Plug-in .................. SUCCESS [12.422s]
[INFO] Linux Tools Annotated Source Editor Plug-in ....... SUCCESS [11.561s]
[INFO] Linux Tools PieChart plug-in ...................... SUCCESS [6.568s]
[INFO] Linux Tools Data Viewers Charts Plug-in ........... SUCCESS [7.061s]
[INFO] Eclipse Linux Tools GCov Parent ................... SUCCESS [0.167s]
[INFO] Linux Tools GCov Plug-in .......................... SUCCESS [9.594s]
[INFO] Linux Tools GCov Documentation Plug-in ............ SUCCESS [0.428s]
[INFO] Linux Tools GCov Feature .......................... SUCCESS [1.089s]
[INFO] Linux Tools GCov Test Plug-in ..................... SUCCESS [1:35.816s]
[INFO] Eclipse Linux Tools GProf Parent .................. SUCCESS [0.106s]
[INFO] Linux Tools GProf Plug-in ......................... SUCCESS [10.083s]
[INFO] Linux Tools Gprof Documentation Plug-in ........... SUCCESS [0.434s]
[INFO] Linux Tools GProf Integration Feature ............. SUCCESS [1.146s]
[INFO] Linux Tools GProf Tests Plug-in ................... SUCCESS [47.570s]
[INFO] Eclipse Linux Tools Libhover Parent ............... SUCCESS [0.071s]
[INFO] Linux Tools Libhover Plug-in ...................... SUCCESS [8.972s]
[INFO] Linux Tools Libhover Library Documentation Plug-in  SUCCESS [0.442s]
[INFO] Linux Tools glibc Libhover Core Plug-in ........... SUCCESS [0.494s]
[INFO] Linux Tools Libhover Feature ...................... SUCCESS [1.111s]
[INFO] Linux Tools libstdc++ Libhover Plug-in ............ SUCCESS [0.523s]
[INFO] Linux Tools Newlib Libhover Plug-in ............... SUCCESS [0.477s]
[INFO] Linux Tools Libhover Newlib Feature ............... SUCCESS [0.988s]
[INFO] Linux Tools Devhelp Libhover Plug-in .............. SUCCESS [7.393s]
[INFO] Linux Tools Devhelp Libhover Feature .............. SUCCESS [1.070s]
[INFO] Eclipse Linux Tools LTTng Parent .................. SUCCESS [0.108s]
[INFO] Linux Tools LTTng CTF Parser Plug-in .............. SUCCESS [12.273s]
[INFO] Linux Tools LTTng CTF Core Plug-in ................ SUCCESS [11.647s]
[INFO] Linux Tools LTTng CTF (Common Trace Format) ....... SUCCESS [1.049s]
[INFO] Linux Tools LTTng TMF Core Plug-in ................ SUCCESS [12.556s]
[INFO] Linux Tools LTTng TMF UI Plug-in .................. SUCCESS [33.877s]
[INFO] Linux Tools LTTng TMF (Tracing and Monitoring Framework)  SUCCESS [1.150s]
[INFO] Linux Tools LTTng TMF Core Unit Test Suite ........ SUCCESS [34.877s]
[INFO] Linux Tools LTTng TMF UI Unit Test Suite .......... SUCCESS [2:15.182s]
[INFO] Linux Tools LTTng JNI Plug-in (legacy) ............ SUCCESS [7.515s]
[INFO] Linux Tools LTTng Core Plug-in (legacy) ........... SUCCESS [13.574s]
[INFO] Linux Tools LTTng UI Plug-in (legacy) ............. SUCCESS [22.243s]
[INFO] Linux Tools LTTng Help Plug-in .................... SUCCESS [0.754s]
[INFO] Linux Tools LTTng (legacy) ........................ SUCCESS [1.199s]
[INFO] Linux Tools LTTng UI Unit Test Suite (legacy) ..... SUCCESS [16.096s]
[INFO] Linux Tools LTTng Core Plug-in .................... SUCCESS [6.136s]
[INFO] Linux Tools LTTng UI Plug-in ...................... SUCCESS [13.334s]
[INFO] Linux Tools LTTng (Linux Tracing Toolkit) ......... SUCCESS [1.123s]
[INFO] Linux Tools LTTng Core Unit Test Suite ............ SUCCESS [12.380s]
[INFO] Linux Tools LTTng UI Unit Test Suite .............. SUCCESS [2:43.482s]
[INFO] Linux Tools LTTng Kernel Analysis Core ............ SUCCESS [5.311s]
[INFO] Linux Tools LTTng Kernel Analysis UI Plug-in ...... SUCCESS [8.491s]
[INFO] Linux Tools LTTng Kernel Analysis ................. SUCCESS [1.160s]
[INFO] Linux Tools LTTng Kernel Analysis Core Unit Test Suite  SUCCESS [9.427s]
[INFO] Linux Tools LTTng Kernel Analysis UI Unit Test Suite  SUCCESS [10.028s]
[INFO] Eclipse Linux Tools Man Parent .................... SUCCESS [0.096s]
[INFO] Linux Tools Man Plug-in ........................... SUCCESS [5.910s]
[INFO] Linux Tools Man Feature (Incubation) .............. SUCCESS [1.065s]
[INFO] Eclipse Linux Tools OProfile Parent ............... SUCCESS [0.084s]
[INFO] Linux Tools OProfile Core Plug-in ................. SUCCESS [1.111s]
[INFO] Linux Tools OProfile Tests Plug-in ................ SUCCESS [4.972s]
[INFO] Linux Tools OProfile Core Tests Plug-in ........... SUCCESS [13.778s]
[INFO] Linux Tools OProfile Documentation Plug-in ........ SUCCESS [0.468s]
[INFO] Linux Tools Profiling Launch Plug-in .............. SUCCESS [6.727s]
[INFO] Linux Tools Profiling UI Plug-in .................. SUCCESS [5.352s]
[INFO] Linux Tools Profiling Framework Feature ........... SUCCESS [1.125s]
[INFO] Linux Tools OProfile UI Plug-in ................... SUCCESS [6.933s]
[INFO] Linux Tools OProfile Launch Plug-in ............... SUCCESS [8.127s]
[INFO] Linux Tools OProfile Integration Feature .......... SUCCESS [1.178s]
[INFO] Linux Tools Profiling Tests Plug-in ............... SUCCESS [5.602s]
[INFO] Linux Tools OProfile Launch Tests Plug-in ......... SUCCESS [13.011s]
[INFO] Linux Tools OProfile UI Tests Plug-in ............. SUCCESS [4.791s]
[INFO] Linux Tools Tools Launcher UI Plug-in ............. SUCCESS [5.430s]
[INFO] Linux Tools Valgrind Tools Integration Feature .... SUCCESS [1.059s]
[INFO] Linux Tools Dataviewers Feature ................... SUCCESS [1.135s]
[INFO] Linux Tools Profiling Remote Launch Plug-in ....... SUCCESS [7.026s]
[INFO] Linux Tools RDT Proxy Plug-in ..................... SUCCESS [6.058s]
[INFO] Linux Tools Profiling Remote Capabilities Feature . SUCCESS [1.105s]
[INFO] Linux Tools Profiling Capability Plug-in .......... SUCCESS [0.414s]
[INFO] Linux Tools SSH Proxy Plug-in ..................... SUCCESS [6.928s]
[INFO] Eclipse Linux Tools RPM Parent .................... SUCCESS [0.100s]
[INFO] Linux Tools RPM Core Plug-in ...................... SUCCESS [7.717s]
[INFO] Linux Tools RPM Specfile Editor Tests Plug-in ..... SUCCESS [12.056s]
[INFO] Linux Tools RPM UI Plug-in ........................ SUCCESS [7.089s]
[INFO] Linux Tools RPM Specfile Editor Plug-in ........... SUCCESS [14.817s]
[INFO] Linux Tools RPM Rpmlint Core Plug-in .............. SUCCESS [7.529s]
[INFO] Linux Tools RPM Specfile Editor Documentation Plug-in  SUCCESS [0.524s]
[INFO] Linux Tools RPM Import/Export/Building and Editing Tools Feature  SUCCESS [1.251s]
[INFO] Linux Tools RPM Specfile Editor Tests Plug-in ..... SUCCESS [26.891s]
[INFO] Eclipse Linux Tools RPM Stubby Parent ............. SUCCESS [0.081s]
[INFO] Linux Tools RPM Stubby Plug-in .................... SUCCESS [6.426s]
[INFO] Linux Tools RPM Stubby Feature (Incubation) ....... SUCCESS [1.065s]
[INFO] Eclipse Linux Tools SystemTap Parent .............. SUCCESS [0.079s]
[INFO] Linux Tools Callgraph Core Plug-in ................ SUCCESS [8.123s]
[INFO] Linux Tools Callgraph Graphing Plug-in ............ SUCCESS [12.807s]
[INFO] Linux Tools Callgraph Documentation Plug-in ....... SUCCESS [0.641s]
[INFO] Linux Tools Callgraph Launch Plug-in .............. SUCCESS [10.576s]
[INFO] Linux Tools C/C++ Call Graph Visualization Feature  SUCCESS [1.158s]
[INFO] Linux Tools Callgraph Launch Tests Plug-in ........ SUCCESS [18.323s]
[INFO] Linux Tools Callgraph Graphing Tests Plug-in ...... SUCCESS [20.855s]
[INFO] Linux Tools SystemTap Script Editor Plug-In ....... SUCCESS [7.174s]
[INFO] Linux Tools Structures Plug-in .................... SUCCESS [8.091s]
[INFO] Linux Tools SystemTap ConsoleLog Plug-in .......... SUCCESS [8.975s]
[INFO] Linux Tools SystemTap Graphing API (non-UI) ....... SUCCESS [7.649s]
[INFO] Linux Tools SystemTap GUI Documentation Plug-in ... SUCCESS [0.711s]
[INFO] Linux Tools SystemTap Graphing API (UI) Plug-In ... SUCCESS [11.356s]
[INFO] Linux Tools SystemTap Logging Functionality Plug-in  SUCCESS [6.007s]
[INFO] Linux Tools SystemTapGUI Plug-in .................. SUCCESS [6.576s]
[INFO] Linux Tools SystemTap Graphing Plug-in ............ SUCCESS [7.090s]
[INFO] Linux Tools SystemTap IDE Plug-in ................. SUCCESS [11.457s]
[INFO] Linux Tools SystemTap GraphicalRun Plug-in ........ SUCCESS [5.244s]
[INFO] Linux Tools SystemTap Dashboard Plug-in ........... SUCCESS [9.282s]
[INFO] Linux Tools SystemTap Dashboard Extension Plug-in . SUCCESS [7.551s]
[INFO] Linux Tools SystemTap IDE and Visualization Tools Feature  SUCCESS [1.325s]
[INFO] Linux Tools SystemTapGui Test Suite Plug-in ....... SUCCESS [4.584s]
[INFO] Linux Tools Thread Profiler Plug-in ............... SUCCESS [7.989s]
[INFO] Linux Tools Thread Profiler Feature ............... SUCCESS [0.575s]
[INFO] Eclipse Linux Tools Valgrind Parent ............... SUCCESS [0.100s]
[INFO] Linux Tools Valgrind Core Plug-in ................. SUCCESS [5.362s]
[INFO] Linux Tools Valgrind UI Plug-in ................... SUCCESS [6.791s]
[INFO] Linux Tools Valgrind Launch Plug-in ............... SUCCESS [8.444s]
[INFO] Linux Tools Cachegrind Plug-in .................... SUCCESS [8.089s]
[INFO] Linux Tools Valgrind Tests Plug-in ................ SUCCESS [6.305s]
[INFO] Linux Tools Cachegrind Tests Plug-in .............. SUCCESS [1:30.996s]
[INFO] Linux Tools Valgrind Documentation Plug-in ........ SUCCESS [0.483s]
[INFO] Linux Tools Valgrind Helgrind Plug-in ............. SUCCESS [5.946s]
[INFO] Linux Tools Helgrind Tests Plug-in ................ SUCCESS [34.740s]
[INFO] Linux Tools Valgrind Massif Plug-in ............... SUCCESS [9.863s]
[INFO] Linux Tools Massif Tests Plug-in .................. SUCCESS [1:53.857s]
[INFO] Linux Tools Valgrind Memcheck Plug-in ............. SUCCESS [6.906s]
[INFO] Linux Tools Memcheck Core Tests Plug-in ........... SUCCESS [1:20.260s]
[INFO] Linux Tools Valgrind Editor Plug-in ............... SUCCESS [7.662s]
[INFO] Linux Tools Valgrind Tools Integration Feature .... SUCCESS [1.174s]
[INFO] Eclipse Linux Tools Perf Parent ................... SUCCESS [0.113s]
[INFO] Linux Tools Perf Plug-in .......................... SUCCESS [8.703s]
[INFO] Linux Tools Perf Documentation Plug-in ............ SUCCESS [0.448s]
[INFO] Linux Tools Perf Integration Feature .............. SUCCESS [1.103s]
[INFO] Linux Tools Perf Tests Plug-in .................... SUCCESS [6.177s]
[INFO] Eclipse Linux Tools Releng Parent ................. SUCCESS [0.087s]
[INFO] Eclipse Linux Tools p2 Repository (Incubation) .... SUCCESS [14:29.947s]
[INFO] ------------------------------------------------------------------------
[INFO] BUILD FAILURE
[INFO] ------------------------------------------------------------------------
[INFO] Total time: 43:57.159s
[INFO] Finished at: Wed May 30 18:45:31 EDT 2012
[INFO] Final Memory: 275M/660M
[INFO] ------------------------------------------------------------------------
[INFO] o.h.m.e.h.MavenExecutionResultHandler - Build failed with exception(s)
[INFO] o.h.m.e.h.MavenExecutionResultHandler - [1] org.apache.maven.lifecycle.LifecycleExecutionException: Failed to execute goal on project org.eclipse.linuxtools.lttng2.core.tests: Could not resolve dependencies for project org.eclipse.linuxtools.lttng2:org.eclipse.linuxtools.lttng2.core.tests:eclipse-test-plugin:1.0.0-SNAPSHOT: Could not find artifact org.eclipse.linuxtools.lttng2:org.eclipse.linuxtools.lttng2.core:jar:1.0.0-SNAPSHOT in maven.eclipse.org (http://maven.eclipse.org/nexus/content/groups/public/)
[DEBUG] Closing connection to remote
[ERROR] Failed to execute goal on project org.eclipse.linuxtools.lttng2.core.tests: Could not resolve dependencies for project org.eclipse.linuxtools.lttng2:org.eclipse.linuxtools.lttng2.core.tests:eclipse-test-plugin:1.0.0-SNAPSHOT: Could not find artifact org.eclipse.linuxtools.lttng2:org.eclipse.linuxtools.lttng2.core:jar:1.0.0-SNAPSHOT in maven.eclipse.org (http://maven.eclipse.org/nexus/content/groups/public/) -> [Help 1]
org.apache.maven.lifecycle.LifecycleExecutionException: Failed to execute goal on project org.eclipse.linuxtools.lttng2.core.tests: Could not resolve dependencies for project org.eclipse.linuxtools.lttng2:org.eclipse.linuxtools.lttng2.core.tests:eclipse-test-plugin:1.0.0-SNAPSHOT: Could not find artifact org.eclipse.linuxtools.lttng2:org.eclipse.linuxtools.lttng2.core:jar:1.0.0-SNAPSHOT in maven.eclipse.org (http://maven.eclipse.org/nexus/content/groups/public/)
	at org.apache.maven.lifecycle.internal.LifecycleDependencyResolver.getDependencies(LifecycleDependencyResolver.java:196)
	at org.apache.maven.lifecycle.internal.LifecycleDependencyResolver.resolveProjectDependencies(LifecycleDependencyResolver.java:108)
	at org.apache.maven.lifecycle.internal.MojoExecutor.ensureDependenciesAreResolved(MojoExecutor.java:258)
	at org.apache.maven.lifecycle.internal.MojoExecutor.execute(MojoExecutor.java:201)
	at org.apache.maven.lifecycle.internal.MojoExecutor.execute(MojoExecutor.java:153)
	at org.apache.maven.lifecycle.internal.MojoExecutor.execute(MojoExecutor.java:145)
	at org.apache.maven.lifecycle.internal.MojoExecutor.executeForkedExecutions(MojoExecutor.java:365)
	at org.apache.maven.lifecycle.internal.MojoExecutor.execute(MojoExecutor.java:199)
	at org.apache.maven.lifecycle.internal.MojoExecutor.execute(MojoExecutor.java:153)
	at org.apache.maven.lifecycle.internal.MojoExecutor.execute(MojoExecutor.java:145)
	at org.apache.maven.lifecycle.internal.LifecycleModuleBuilder.buildProject(LifecycleModuleBuilder.java:84)
	at org.apache.maven.lifecycle.internal.LifecycleModuleBuilder.buildProject(LifecycleModuleBuilder.java:59)
	at org.apache.maven.lifecycle.internal.LifecycleStarter.singleThreadedBuild(LifecycleStarter.java:183)
	at org.apache.maven.lifecycle.internal.LifecycleStarter.execute(LifecycleStarter.java:161)
	at org.apache.maven.DefaultMaven.doExecute(DefaultMaven.java:319)
	at org.apache.maven.DefaultMaven.execute(DefaultMaven.java:156)
	at org.apache.maven.cli.MavenCli.execute(MavenCli.java:537)
	at org.apache.maven.cli.MavenCli.doMain(MavenCli.java:196)
	at org.apache.maven.cli.MavenCli.main(MavenCli.java:141)
	at sun.reflect.NativeMethodAccessorImpl.invoke0(Native Method)
	at sun.reflect.NativeMethodAccessorImpl.invoke(NativeMethodAccessorImpl.java:39)
	at sun.reflect.DelegatingMethodAccessorImpl.invoke(DelegatingMethodAccessorImpl.java:25)
	at java.lang.reflect.Method.invoke(Method.java:597)
	at org.codehaus.plexus.classworlds.launcher.Launcher.launchEnhanced(Launcher.java:290)
	at org.codehaus.plexus.classworlds.launcher.Launcher.launch(Launcher.java:230)
	at org.codehaus.plexus.classworlds.launcher.Launcher.mainWithExitCode(Launcher.java:409)
	at org.codehaus.plexus.classworlds.launcher.Launcher.main(Launcher.java:352)
Caused by: org.apache.maven.project.DependencyResolutionException: Could not resolve dependencies for project org.eclipse.linuxtools.lttng2:org.eclipse.linuxtools.lttng2.core.tests:eclipse-test-plugin:1.0.0-SNAPSHOT: Could not find artifact org.eclipse.linuxtools.lttng2:org.eclipse.linuxtools.lttng2.core:jar:1.0.0-SNAPSHOT in maven.eclipse.org (http://maven.eclipse.org/nexus/content/groups/public/)
	at org.apache.maven.project.DefaultProjectDependenciesResolver.resolve(DefaultProjectDependenciesResolver.java:170)
	at org.apache.maven.lifecycle.internal.LifecycleDependencyResolver.getDependencies(LifecycleDependencyResolver.java:171)
	... 26 more
Caused by: org.sonatype.aether.resolution.DependencyResolutionException: Could not find artifact org.eclipse.linuxtools.lttng2:org.eclipse.linuxtools.lttng2.core:jar:1.0.0-SNAPSHOT in maven.eclipse.org (http://maven.eclipse.org/nexus/content/groups/public/)
	at org.sonatype.aether.impl.internal.DefaultRepositorySystem.resolveDependencies(DefaultRepositorySystem.java:412)
	at org.apache.maven.project.DefaultProjectDependenciesResolver.resolve(DefaultProjectDependenciesResolver.java:164)
	... 27 more
Caused by: org.sonatype.aether.resolution.ArtifactResolutionException: Could not find artifact org.eclipse.linuxtools.lttng2:org.eclipse.linuxtools.lttng2.core:jar:1.0.0-SNAPSHOT in maven.eclipse.org (http://maven.eclipse.org/nexus/content/groups/public/)
	at org.sonatype.aether.impl.internal.DefaultArtifactResolver.resolve(DefaultArtifactResolver.java:541)
	at org.sonatype.aether.impl.internal.DefaultArtifactResolver.resolveArtifacts(DefaultArtifactResolver.java:220)
	at org.sonatype.aether.impl.internal.DefaultRepositorySystem.resolveDependencies(DefaultRepositorySystem.java:395)
	... 28 more
Caused by: org.sonatype.aether.transfer.ArtifactNotFoundException: Could not find artifact org.eclipse.linuxtools.lttng2:org.eclipse.linuxtools.lttng2.core:jar:1.0.0-SNAPSHOT in maven.eclipse.org (http://maven.eclipse.org/nexus/content/groups/public/)
	at org.sonatype.aether.connector.wagon.WagonRepositoryConnector$4.wrap(WagonRepositoryConnector.java:945)
	at org.sonatype.aether.connector.wagon.WagonRepositoryConnector$4.wrap(WagonRepositoryConnector.java:940)
	at org.sonatype.aether.connector.wagon.WagonRepositoryConnector$GetTask.flush(WagonRepositoryConnector.java:695)
	at org.sonatype.aether.connector.wagon.WagonRepositoryConnector$GetTask.flush(WagonRepositoryConnector.java:689)
	at org.sonatype.aether.connector.wagon.WagonRepositoryConnector.get(WagonRepositoryConnector.java:445)
	at org.sonatype.aether.impl.internal.DefaultArtifactResolver.resolve(DefaultArtifactResolver.java:460)
	... 30 more
[ERROR] 
[ERROR] Re-run Maven using the -X switch to enable full debug logging.
[ERROR] 
[ERROR] For more information about the errors and possible solutions, please read the following articles:
[ERROR] [Help 1] http://cwiki.apache.org/confluence/display/MAVEN/DependencyResolutionException
[ERROR] 
[ERROR] After correcting the problems, you can resume the build with the command
[ERROR]   mvn <goals> -rf :org.eclipse.linuxtools.lttng2.core.tests
[INFO] Build failures were ignored.
[DEBUG] Waiting for process to finish
[DEBUG] Result: 0
Terminating xvnc.
[DRY] Collecting duplicate code analysis files...
[FINDBUGS] Collecting findbugs analysis files...
Recording test results
Publishing Javadoc
ERROR: Publisher hudson.tasks.JavadocArchiver aborted due to exception
<https://hudson.eclipse.org/hudson/job/linuxtools-master/ws/target/site/apidocs> does not exist.
	at org.apache.tools.ant.types.AbstractFileSet.getDirectoryScanner(AbstractFileSet.java:474)
	at hudson.FilePath$34.hasMatch(FilePath.java:1774)
	at hudson.FilePath$34.invoke(FilePath.java:1683)
	at hudson.FilePath$34.invoke(FilePath.java:1674)
	at hudson.FilePath$FileCallableWrapper.call(FilePath.java:1960)
	at hudson.remoting.UserRequest.perform(UserRequest.java:114)
	at hudson.remoting.UserRequest.perform(UserRequest.java:48)
	at hudson.remoting.Request$2.run(Request.java:283)
	at java.util.concurrent.Executors$RunnableAdapter.call(Executors.java:441)
	at java.util.concurrent.FutureTask$Sync.innerRun(FutureTask.java:303)
	at java.util.concurrent.FutureTask.run(FutureTask.java:138)
	at java.util.concurrent.ThreadPoolExecutor$Worker.runTask(ThreadPoolExecutor.java:886)
	at java.util.concurrent.ThreadPoolExecutor$Worker.run(ThreadPoolExecutor.java:908)
	at java.lang.Thread.run(Thread.java:619)
Archiving artifacts