[Date Prev][Date Next][Thread Prev][Thread Next][Date Index][Thread Index] [List Home]
[jubula-dev] Build failed in Jenkins: jubula-nightly #3204

See <https://ci.eclipse.org/jubula/job/jubula-nightly/3204/display/redirect?page=changes>

Changes:

[marvin.mueller] Fix Problem with html image check

------------------------------------------
[...truncated 1.95 MB...]
[INFO] --- tycho-p2-plugin:1.0.0:p2-metadata (p2-metadata) @ org.eclipse.jubula.documentation.orbit ---
[INFO] 
[INFO] --- maven-install-plugin:2.3.1:install (default-install) @ org.eclipse.jubula.documentation.orbit ---
[INFO] Installing /jobs/genie.jubula/jubula-nightly/workspace/org.eclipse.jubula.core/org.eclipse.jubula.documentation.orbit/target/org.eclipse.jubula.documentation.orbit-6.0.0-SNAPSHOT.jar to <https://ci.eclipse.org/jubula/job/jubula-nightly/ws/.repository/org/eclipse/jubula/org.eclipse.jubula.documentation.orbit/6.0.0-SNAPSHOT/org.eclipse.jubula.documentation.orbit-6.0.0-SNAPSHOT.jar>
[INFO] Installing /jobs/genie.jubula/jubula-nightly/workspace/org.eclipse.jubula.core/org.eclipse.jubula.documentation.orbit/pom.xml to <https://ci.eclipse.org/jubula/job/jubula-nightly/ws/.repository/org/eclipse/jubula/org.eclipse.jubula.documentation.orbit/6.0.0-SNAPSHOT/org.eclipse.jubula.documentation.orbit-6.0.0-SNAPSHOT.pom>
[INFO] Installing /jobs/genie.jubula/jubula-nightly/workspace/org.eclipse.jubula.core/org.eclipse.jubula.documentation.orbit/target/org.eclipse.jubula.documentation.orbit-6.0.0-SNAPSHOT.jar.pack.gz to <https://ci.eclipse.org/jubula/job/jubula-nightly/ws/.repository/org/eclipse/jubula/org.eclipse.jubula.documentation.orbit/6.0.0-SNAPSHOT/org.eclipse.jubula.documentation.orbit-6.0.0-SNAPSHOT-pack200.jar.pack.gz>
[INFO] Installing /jobs/genie.jubula/jubula-nightly/workspace/org.eclipse.jubula.core/org.eclipse.jubula.documentation.orbit/target/p2content.xml to <https://ci.eclipse.org/jubula/job/jubula-nightly/ws/.repository/org/eclipse/jubula/org.eclipse.jubula.documentation.orbit/6.0.0-SNAPSHOT/org.eclipse.jubula.documentation.orbit-6.0.0-SNAPSHOT-p2metadata.xml>
[INFO] Installing /jobs/genie.jubula/jubula-nightly/workspace/org.eclipse.jubula.core/org.eclipse.jubula.documentation.orbit/target/p2artifacts.xml to <https://ci.eclipse.org/jubula/job/jubula-nightly/ws/.repository/org/eclipse/jubula/org.eclipse.jubula.documentation.orbit/6.0.0-SNAPSHOT/org.eclipse.jubula.documentation.orbit-6.0.0-SNAPSHOT-p2artifacts.xml>
[INFO] 
[INFO] --- tycho-p2-plugin:1.0.0:update-local-index (default-update-local-index) @ org.eclipse.jubula.documentation.orbit ---
[INFO] 
[INFO] --- maven-deploy-plugin:2.5:deploy (default-deploy) @ org.eclipse.jubula.documentation.orbit ---
Downloading from repo.eclipse.org: https://repo.eclipse.org/content/repositories/jubula-snapshots/org/eclipse/jubula/org.eclipse.jubula.documentation.orbit/6.0.0-SNAPSHOT/maven-metadata.xml
Progress (1): 1.5 kB                    Downloaded from repo.eclipse.org: https://repo.eclipse.org/content/repositories/jubula-snapshots/org/eclipse/jubula/org.eclipse.jubula.documentation.orbit/6.0.0-SNAPSHOT/maven-metadata.xml (1.5 kB at 82 kB/s)
Uploading to repo.eclipse.org: https://repo.eclipse.org/content/repositories/jubula-snapshots/org/eclipse/jubula/org.eclipse.jubula.documentation.orbit/6.0.0-SNAPSHOT/org.eclipse.jubula.documentation.orbit-6.0.0-20180206.130657-50.jar
Progress (1): 2.0/6.6 kBProgress (1): 4.1/6.6 kBProgress (1): 6.1/6.6 kBProgress (1): 6.6 kB                        Uploaded to repo.eclipse.org: https://repo.eclipse.org/content/repositories/jubula-snapshots/org/eclipse/jubula/org.eclipse.jubula.documentation.orbit/6.0.0-SNAPSHOT/org.eclipse.jubula.documentation.orbit-6.0.0-20180206.130657-50.jar (6.6 kB at 58 kB/s)
Uploading to repo.eclipse.org: https://repo.eclipse.org/content/repositories/jubula-snapshots/org/eclipse/jubula/org.eclipse.jubula.documentation.orbit/6.0.0-SNAPSHOT/org.eclipse.jubula.documentation.orbit-6.0.0-20180206.130657-50.pom
Progress (1): 2.0/2.9 kBProgress (1): 2.9 kB                        Uploaded to repo.eclipse.org: https://repo.eclipse.org/content/repositories/jubula-snapshots/org/eclipse/jubula/org.eclipse.jubula.documentation.orbit/6.0.0-SNAPSHOT/org.eclipse.jubula.documentation.orbit-6.0.0-20180206.130657-50.pom (2.9 kB at 29 kB/s)
Downloading from repo.eclipse.org: https://repo.eclipse.org/content/repositories/jubula-snapshots/org/eclipse/jubula/org.eclipse.jubula.documentation.orbit/maven-metadata.xml
Progress (1): 496 B                   Downloaded from repo.eclipse.org: https://repo.eclipse.org/content/repositories/jubula-snapshots/org/eclipse/jubula/org.eclipse.jubula.documentation.orbit/maven-metadata.xml (496 B at 22 kB/s)
Uploading to repo.eclipse.org: https://repo.eclipse.org/content/repositories/jubula-snapshots/org/eclipse/jubula/org.eclipse.jubula.documentation.orbit/6.0.0-SNAPSHOT/maven-metadata.xml
Progress (1): 1.5 kB                    Uploaded to repo.eclipse.org: https://repo.eclipse.org/content/repositories/jubula-snapshots/org/eclipse/jubula/org.eclipse.jubula.documentation.orbit/6.0.0-SNAPSHOT/maven-metadata.xml (1.5 kB at 20 kB/s)
Uploading to repo.eclipse.org: https://repo.eclipse.org/content/repositories/jubula-snapshots/org/eclipse/jubula/org.eclipse.jubula.documentation.orbit/maven-metadata.xml
Progress (1): 496 B                   Uploaded to repo.eclipse.org: https://repo.eclipse.org/content/repositories/jubula-snapshots/org/eclipse/jubula/org.eclipse.jubula.documentation.orbit/maven-metadata.xml (496 B at 5.3 kB/s)
Uploading to repo.eclipse.org: https://repo.eclipse.org/content/repositories/jubula-snapshots/org/eclipse/jubula/org.eclipse.jubula.documentation.orbit/6.0.0-SNAPSHOT/org.eclipse.jubula.documentation.orbit-6.0.0-20180206.130657-50-pack200.jar.pack.gz
Progress (1): 2.0/6.0 kBProgress (1): 4.1/6.0 kBProgress (1): 6.0 kB                        Uploaded to repo.eclipse.org: https://repo.eclipse.org/content/repositories/jubula-snapshots/org/eclipse/jubula/org.eclipse.jubula.documentation.orbit/6.0.0-SNAPSHOT/org.eclipse.jubula.documentation.orbit-6.0.0-20180206.130657-50-pack200.jar.pack.gz (6.0 kB at 19 kB/s)
Uploading to repo.eclipse.org: https://repo.eclipse.org/content/repositories/jubula-snapshots/org/eclipse/jubula/org.eclipse.jubula.documentation.orbit/6.0.0-SNAPSHOT/maven-metadata.xml
Progress (1): 1.5 kB                    Uploaded to repo.eclipse.org: https://repo.eclipse.org/content/repositories/jubula-snapshots/org/eclipse/jubula/org.eclipse.jubula.documentation.orbit/6.0.0-SNAPSHOT/maven-metadata.xml (1.5 kB at 22 kB/s)
Uploading to repo.eclipse.org: https://repo.eclipse.org/content/repositories/jubula-snapshots/org/eclipse/jubula/org.eclipse.jubula.documentation.orbit/6.0.0-SNAPSHOT/org.eclipse.jubula.documentation.orbit-6.0.0-20180206.130657-50-p2metadata.xml
Progress (1): 2.0/4.5 kBProgress (1): 4.1/4.5 kBProgress (1): 4.5 kB                        Uploaded to repo.eclipse.org: https://repo.eclipse.org/content/repositories/jubula-snapshots/org/eclipse/jubula/org.eclipse.jubula.documentation.orbit/6.0.0-SNAPSHOT/org.eclipse.jubula.documentation.orbit-6.0.0-20180206.130657-50-p2metadata.xml (4.5 kB at 61 kB/s)
Uploading to repo.eclipse.org: https://repo.eclipse.org/content/repositories/jubula-snapshots/org/eclipse/jubula/org.eclipse.jubula.documentation.orbit/6.0.0-SNAPSHOT/maven-metadata.xml
Progress (1): 1.5 kB                    Uploaded to repo.eclipse.org: https://repo.eclipse.org/content/repositories/jubula-snapshots/org/eclipse/jubula/org.eclipse.jubula.documentation.orbit/6.0.0-SNAPSHOT/maven-metadata.xml (1.5 kB at 17 kB/s)
Uploading to repo.eclipse.org: https://repo.eclipse.org/content/repositories/jubula-snapshots/org/eclipse/jubula/org.eclipse.jubula.documentation.orbit/6.0.0-SNAPSHOT/org.eclipse.jubula.documentation.orbit-6.0.0-20180206.130657-50-p2artifacts.xml
Progress (1): 687 B                   Uploaded to repo.eclipse.org: https://repo.eclipse.org/content/repositories/jubula-snapshots/org/eclipse/jubula/org.eclipse.jubula.documentation.orbit/6.0.0-SNAPSHOT/org.eclipse.jubula.documentation.orbit-6.0.0-20180206.130657-50-p2artifacts.xml (687 B at 6.0 kB/s)
Uploading to repo.eclipse.org: https://repo.eclipse.org/content/repositories/jubula-snapshots/org/eclipse/jubula/org.eclipse.jubula.documentation.orbit/6.0.0-SNAPSHOT/maven-metadata.xml
Progress (1): 1.5 kB                    Uploaded to repo.eclipse.org: https://repo.eclipse.org/content/repositories/jubula-snapshots/org/eclipse/jubula/org.eclipse.jubula.documentation.orbit/6.0.0-SNAPSHOT/maven-metadata.xml (1.5 kB at 19 kB/s)
[INFO] 
[INFO] ------------------------------------------------------------------------
[INFO] Building org.eclipse.jubula.client.ua.help 6.0.0-SNAPSHOT
[INFO] ------------------------------------------------------------------------
[INFO] 
[INFO] --- maven-clean-plugin:2.5:clean (default-clean) @ org.eclipse.jubula.client.ua.help ---
[INFO] 
[INFO] --- tycho-packaging-plugin:1.0.0:build-qualifier (default-build-qualifier) @ org.eclipse.jubula.client.ua.help ---
[INFO] The project's OSGi version is 6.0.0.201802061301
[INFO] 
[INFO] --- tycho-packaging-plugin:1.0.0:validate-id (default-validate-id) @ org.eclipse.jubula.client.ua.help ---
[INFO] 
[INFO] --- tycho-packaging-plugin:1.0.0:validate-version (default-validate-version) @ org.eclipse.jubula.client.ua.help ---
[INFO] 
[INFO] --- maven-antrun-plugin:1.7:run (default) @ org.eclipse.jubula.client.ua.help ---
[INFO] Executing tasks

main:

validateEnv:

echoEnvInfo:

buildInstallationManual:

checkParam:

buildHtmlImageLister:
     [exec] Picked up JAVA_TOOL_OPTIONS: -Xmx2G -Djava.io.tmpdir=/tmp/genie.jubula
      [jar] Building jar: /jobs/genie.jubula/jubula-nightly/workspace/org.eclipse.jubula.core/org.eclipse.jubula.documentation/HtmlImageLister.jar

buildHTML:

checkParam:

clean:
     [copy] Copying 2 files to /jobs/genie.jubula/jubula-nightly/workspace/org.eclipse.jubula.core/org.eclipse.jubula.documentation/install/en/build/html/images
     [copy] Copying 2 files to /jobs/genie.jubula/jubula-nightly/workspace/org.eclipse.jubula.core/org.eclipse.jubula.documentation/install/en/build/html/css

checkForErrors:
 [loadfile] Do not set property errorlines as its length is 0.
   [delete] Deleting: /jobs/genie.jubula/jubula-nightly/workspace/org.eclipse.jubula.core/org.eclipse.jubula.documentation/output.log

checkImages:
   [delete] Deleting: /jobs/genie.jubula/jubula-nightly/workspace/org.eclipse.jubula.core/org.eclipse.jubula.documentation/imageList.txt
[INFO] ------------------------------------------------------------------------
[INFO] Reactor Summary:
[INFO] 
[INFO] Eclipse Jubula ..................................... SUCCESS [  0.953 s]
[INFO] org.eclipse.jubula.releng.client ................... SUCCESS [  0.318 s]
[INFO] org.eclipse.jubula.tools ........................... SUCCESS [  8.426 s]
[INFO] org.eclipse.jubula.tools.exec ...................... SUCCESS [  2.472 s]
[INFO] org.eclipse.jubula.communication ................... SUCCESS [  3.301 s]
[INFO] org.eclipse.jubula.logging ......................... SUCCESS [  3.304 s]
[INFO] org.eclipse.jubula.version ......................... SUCCESS [  2.312 s]
[INFO] org.eclipse.jubula.toolkit.common .................. SUCCESS [  2.495 s]
[INFO] org.eclipse.jubula.toolkit.api ..................... SUCCESS [  2.959 s]
[INFO] org.eclipse.jubula.client.api ...................... SUCCESS [  3.171 s]
[INFO] org.eclipse.jubula.client.core ..................... SUCCESS [ 18.676 s]
[INFO] org.eclipse.jubula.rc.common ....................... SUCCESS [  3.805 s]
[INFO] org.eclipse.jubula.autagent ........................ SUCCESS [  3.393 s]
[INFO] org.eclipse.jubula.autagent.api .................... SUCCESS [  2.498 s]
[INFO] org.eclipse.jubula.rc.common.agent ................. SUCCESS [  2.456 s]
[INFO] org.eclipse.jubula.rc.swing ........................ SUCCESS [  3.254 s]
[INFO] org.eclipse.jubula.rc.javafx ....................... SUCCESS [  3.662 s]
[INFO] org.eclipse.jubula.rc.javafx.j8u40 ................. SUCCESS [  2.458 s]
[INFO] org.eclipse.jubula.rc.swt .......................... SUCCESS [  4.870 s]
[INFO] Eclipse Jubula Server Components ................... SUCCESS [  0.311 s]
[INFO] Eclipse Jubula Server Remote Control Components .... SUCCESS [  0.262 s]
[INFO] org.eclipse.jubula.rc.common.orbit ................. SUCCESS [  2.102 s]
[INFO] org.eclipse.jubula.rc.rcp.common ................... SUCCESS [ 20.228 s]
[INFO] org.eclipse.jubula.rc.rcp.swt ...................... SUCCESS [  4.100 s]
[INFO] org.eclipse.jubula.rc.rcp.feature .................. SUCCESS [  1.831 s]
[INFO] org.eclipse.jubula.rc.rcp.e3 ....................... SUCCESS [  2.709 s]
[INFO] org.eclipse.jubula.rc.rcp.e3.releng ................ SUCCESS [  0.256 s]
[INFO] org.eclipse.jubula.rc.rcp.e3.specific .............. SUCCESS [  2.503 s]
[INFO] org.eclipse.jubula.rc.rcp.e3.feature ............... SUCCESS [  1.580 s]
[INFO] org.eclipse.jubula.rc.rcp.e3.site .................. SUCCESS [  1.782 s]
[INFO] org.eclipse.jubula.rc.rcp.e4.releng ................ SUCCESS [  0.264 s]
[INFO] org.eclipse.jubula.rc.rcp.e4 ....................... SUCCESS [  2.544 s]
[INFO] org.eclipse.jubula.rc.rcp.e4.swt ................... SUCCESS [  2.524 s]
[INFO] org.eclipse.jubula.rc.rcp.e4.feature ............... SUCCESS [  1.616 s]
[INFO] org.eclipse.jubula.rc.rcp.e4.site .................. SUCCESS [  1.556 s]
[INFO] org.eclipse.jubula.rc.rcp.site ..................... SUCCESS [  2.656 s]
[INFO] org.eclipse.jubula.rc.rcp .......................... SUCCESS [  9.173 s]
[INFO] org.eclipse.jubula.rc.rcp.ext ...................... SUCCESS [  2.687 s]
[INFO] org.eclipse.jubula.app.autrun ...................... SUCCESS [  3.118 s]
[INFO] org.eclipse.jubula.app.autagent .................... SUCCESS [  2.967 s]
[INFO] org.eclipse.jubula.feature.rc ...................... SUCCESS [  1.770 s]
[INFO] org.eclipse.jubula.product.autagent.start .......... SUCCESS [  6.548 s]
[INFO] org.eclipse.jubula.product.autagent.stop ........... SUCCESS [  6.461 s]
[INFO] org.eclipse.jubula.rc.rcp.accessor.feature ......... SUCCESS [  1.690 s]
[INFO] org.eclipse.jubula.rc.rcp.accessor.site ............ SUCCESS [  8.502 s]
[INFO] org.eclipse.jubula.client.ui ....................... SUCCESS [  4.386 s]
[INFO] org.eclipse.jubula.mylyn ........................... SUCCESS [  2.914 s]
[INFO] org.eclipse.jubula.client.alm.mylyn.core ........... SUCCESS [  3.115 s]
[INFO] org.eclipse.jubula.client.archive .................. SUCCESS [  3.363 s]
[INFO] org.eclipse.jubula.toolkit.html .................... SUCCESS [  2.567 s]
[INFO] org.eclipse.jubula.client.ui.rcp ................... SUCCESS [ 12.074 s]
[INFO] org.eclipse.jubula.app ............................. SUCCESS [  3.389 s]
[INFO] org.eclipse.jubula.client.cmd ...................... SUCCESS [  2.733 s]
[INFO] org.eclipse.jubula.app.dbtool ...................... SUCCESS [  2.850 s]
[INFO] org.eclipse.jubula.app.testexec .................... SUCCESS [  3.164 s]
[INFO] org.eclipse.jubula.client.alm.mylyn.ui ............. SUCCESS [  3.601 s]
[INFO] org.eclipse.jubula.client.alm.mylyn.ui.bridge ...... SUCCESS [  3.022 s]
[INFO] org.eclipse.jubula.client.alm.ui ................... SUCCESS [  2.954 s]
[INFO] org.eclipse.jubula.client.api.commands ............. SUCCESS [  3.026 s]
[INFO] org.eclipse.jubula.toolkit.base.provider ........... SUCCESS [  2.800 s]
[INFO] org.eclipse.jubula.toolkit.concrete.provider ....... SUCCESS [  2.646 s]
[INFO] org.eclipse.jubula.toolkit.html.provider ........... SUCCESS [  2.683 s]
[INFO] org.eclipse.jubula.toolkit.javafx.provider ......... SUCCESS [  2.718 s]
[INFO] org.eclipse.jubula.toolkit.swt.provider ............ SUCCESS [  2.748 s]
[INFO] org.eclipse.jubula.toolkit.rcp.provider ............ SUCCESS [  2.707 s]
[INFO] org.eclipse.jubula.toolkit.gef.provider ............ SUCCESS [  2.888 s]
[INFO] org.eclipse.jubula.toolkit.swing.provider .......... SUCCESS [  2.817 s]
[INFO] org.eclipse.jubula.toolkit.api.gen ................. SUCCESS [ 18.895 s]
[INFO] org.eclipse.jubula.client.api.converter.annotations  SUCCESS [  2.438 s]
[INFO] org.eclipse.jubula.client.api.converter ............ SUCCESS [  7.644 s]
[INFO] org.eclipse.jubula.client.api.converter.ui ......... SUCCESS [  2.782 s]
[INFO] org.eclipse.jubula.client.api.ui ................... SUCCESS [  7.214 s]
[INFO] org.eclipse.jubula.client.autagent ................. SUCCESS [  2.490 s]
[INFO] org.eclipse.jubula.client.core.exporter.junit ...... SUCCESS [  2.943 s]
[INFO] org.eclipse.jubula.client.core.functions ........... SUCCESS [  2.759 s]
[INFO] org.eclipse.jubula.client.inspector.ui ............. SUCCESS [  2.885 s]
[INFO] org.eclipse.jubula.client.stats .................... SUCCESS [  2.705 s]
[INFO] org.eclipse.jubula.client.teststyle ................ SUCCESS [  3.224 s]
[INFO] org.eclipse.jubula.client.teststyle.impl.standard .. SUCCESS [  2.787 s]
[INFO] org.eclipse.jubula.client.toolkit.ui ............... SUCCESS [  3.065 s]
[INFO] org.eclipse.jubula.client.ua.cheatsheets ........... SUCCESS [  2.839 s]
[INFO] org.eclipse.jubula.documentation.orbit ............. SUCCESS [  2.034 s]
[INFO] org.eclipse.jubula.client.ua.help .................. FAILURE [  2.674 s]
[INFO] org.eclipse.jubula.client.ua.welcome ............... SKIPPED
[INFO] org.eclipse.jubula.client.wiki.ui .................. SKIPPED
[INFO] org.eclipse.jubula.releng.examples ................. SKIPPED
[INFO] org.eclipse.jubula.examples.extension.releng ....... SKIPPED
[INFO] org.eclipse.jubula.examples.extension.javafx.rc .... SKIPPED
[INFO] org.eclipse.jubula.examples.extension.javafx.rc.container SKIPPED
[INFO] org.eclipse.jubula.examples.extension.javafx.toolkit SKIPPED
[INFO] org.eclipse.jubula.examples.extension.javafx.aut ... SKIPPED
[INFO] org.eclipse.jubula.examples.extension.javafx.feature SKIPPED
[INFO] org.eclipse.jubula.examples.extension.rcp.aut ...... SKIPPED
[INFO] org.eclipse.jubula.examples.extension.rcp.toolkit .. SKIPPED
[INFO] org.eclipse.jubula.examples.extension.rcp.rc ....... SKIPPED
[INFO] org.eclipse.jubula.examples.extension.rcp.feature .. SKIPPED
[INFO] org.eclipse.jubula.examples.extension.swing.toolkit  SKIPPED
[INFO] org.eclipse.jubula.examples.extension.swing.rc ..... SKIPPED
[INFO] org.eclipse.jubula.examples.extension.swing.aut .... SKIPPED
[INFO] org.eclipse.jubula.examples.extension.swing.feature  SKIPPED
[INFO] org.eclipse.jubula.feature.api.converter ........... SKIPPED
[INFO] org.eclipse.jubula.toolkit.base.api ................ SKIPPED
[INFO] org.eclipse.jubula.toolkit.concrete.api ............ SKIPPED
[INFO] org.eclipse.jubula.toolkit.html.api ................ SKIPPED
[INFO] org.eclipse.jubula.toolkit.javafx.api .............. SKIPPED
[INFO] org.eclipse.jubula.toolkit.swt.api ................. SKIPPED
[INFO] org.eclipse.jubula.toolkit.rcp.api ................. SKIPPED
[INFO] org.eclipse.jubula.toolkit.gef.api ................. SKIPPED
[INFO] org.eclipse.jubula.toolkit.swing.api ............... SKIPPED
[INFO] org.eclipse.jubula.feature.api.core ................ SKIPPED
[INFO] org.eclipse.jubula.feature.api ..................... SKIPPED
[INFO] org.eclipse.jubula.feature ......................... SKIPPED
[INFO] org.eclipse.jubula.launch .......................... SKIPPED
[INFO] org.eclipse.jubula.launch.java ..................... SKIPPED
[INFO] org.eclipse.jubula.launch.ui ....................... SKIPPED
[INFO] org.eclipse.jubula.launch.java.ui .................. SKIPPED
[INFO] org.eclipse.jubula.feature.launch.java ............. SKIPPED
[INFO] org.eclipse.jubula.launch.rcp.ui ................... SKIPPED
[INFO] org.eclipse.jubula.feature.launch.rcp .............. SKIPPED
[INFO] Jubula p2-repository for Eclipse ................... SKIPPED
[INFO] org.eclipse.jubula.client.qa.caa.gen.ui ............ SKIPPED
[INFO] org.eclipse.jubula.examples.aut.adder.javafx ....... SKIPPED
[INFO] org.eclipse.jubula.examples.aut.adder.swing ........ SKIPPED
[INFO] org.eclipse.jubula.examples.aut.adder.swt .......... SKIPPED
[INFO] org.eclipse.jubula.examples.aut.dvdtool ............ SKIPPED
[INFO] org.eclipse.jubula.examples.extension.swing.api .... SKIPPED
[INFO] org.eclipse.jubula.examples.extension.swing.api.test SKIPPED
[INFO] org.eclipse.jubula.examples.extension.javafx.api ... SKIPPED
[INFO] org.eclipse.jubula.examples.extension.javafx.api.test SKIPPED
[INFO] org.eclipse.jubula.examples.extension.rcp.api ...... SKIPPED
[INFO] org.eclipse.jubula.examples.extension.rcp.api.test . SKIPPED
[INFO] org.eclipse.jubula.qa.api .......................... SKIPPED
[INFO] org.eclipse.jubula.qa.api.rcp ...................... SKIPPED
[INFO] org.eclipse.jubula.tools.exec.tests.lin ............ SKIPPED
[INFO] ------------------------------------------------------------------------
[INFO] BUILD FAILURE
[INFO] ------------------------------------------------------------------------
[INFO] Total time: 05:55 min
[INFO] Finished at: 2018-02-06T08:07:01-05:00
[INFO] Final Memory: 292M/935M
[INFO] ------------------------------------------------------------------------
[ERROR] Failed to execute goal org.apache.maven.plugins:maven-antrun-plugin:1.7:run (default) on project org.eclipse.jubula.client.ua.help: An Ant BuildException has occured: The following error occurred while executing this line:
[ERROR] /jobs/genie.jubula/jubula-nightly/workspace/org.eclipse.jubula.core/org.eclipse.jubula.documentation/buildScript.xml:160: The following error occurred while executing this line:
[ERROR] /jobs/genie.jubula/jubula-nightly/workspace/org.eclipse.jubula.core/org.eclipse.jubula.documentation/buildScript.xml:299: The following error occurred while executing this line:
[ERROR] /jobs/genie.jubula/jubula-nightly/workspace/org.eclipse.jubula.core/org.eclipse.jubula.documentation/buildScript.xml:416: Missing Image Files:
[ERROR] /jobs/genie.jubula/jubula-nightly/workspace/org.eclipse.jubula.core/org.eclipse.jubula.documentation/install/en/docbook/Picked
[ERROR] /jobs/genie.jubula/jubula-nightly/workspace/org.eclipse.jubula.core/org.eclipse.jubula.documentation/install/en/docbook/up
[ERROR] /jobs/genie.jubula/jubula-nightly/workspace/org.eclipse.jubula.core/org.eclipse.jubula.documentation/install/en/docbook/JAVA_TOOL_OPTIONS
[ERROR] 
[ERROR] /jobs/genie.jubula/jubula-nightly/workspace/org.eclipse.jubula.core/org.eclipse.jubula.documentation/install/en/docbook/-Xmx2G
[ERROR] /jobs/genie.jubula/jubula-nightly/workspace/org.eclipse.jubula.core/org.eclipse.jubula.documentation/install/en/docbook/-Djava.io.tmpdir=/tmp/genie.jubula
[ERROR] around Ant part ...<ant antfile="buildScript.xml" dir="../org.eclipse.jubula.documentation" target="buildDocumentation"/>... @ 4:105 in /jobs/genie.jubula/jubula-nightly/workspace/org.eclipse.jubula.core/org.eclipse.jubula.client.ua.help/target/antrun/build-main.xml
[ERROR] -> [Help 1]
[ERROR] 
[ERROR] To see the full stack trace of the errors, re-run Maven with the -e switch.
[ERROR] Re-run Maven using the -X switch to enable full debug logging.
[ERROR] 
[ERROR] For more information about the errors and possible solutions, please read the following articles:
[ERROR] [Help 1] http://cwiki.apache.org/confluence/display/MAVEN/MojoExecutionException
[ERROR] 
[ERROR] After correcting the problems, you can resume the build with the command
[ERROR]   mvn <goals> -rf :org.eclipse.jubula.client.ua.help
Build step 'Invoke top-level Maven targets' marked build as failure
Not sending mail to unregistered user Marcel.Krauth@xxxxxxxxx
Not sending mail to unregistered user marvin.mueller@xxxxxxxxx