[Date Prev][Date Next][Thread Prev][Thread Next][Date Index][Thread Index] [List Home]
[jubula-dev] Build failed in Jenkins: jubula-nightly #3202

See <https://ci.eclipse.org/jubula/job/jubula-nightly/3202/display/redirect>

------------------------------------------
[...truncated 1.95 MB...]
[INFO] Pack200 packing jar /jobs/genie.jubula/jubula-nightly/workspace/org.eclipse.jubula.core/org.eclipse.jubula.documentation.orbit/target/org.eclipse.jubula.documentation.orbit-6.0.0-SNAPSHOT.jar
[INFO] 
[INFO] --- tycho-p2-plugin:1.0.0:p2-metadata (p2-metadata) @ org.eclipse.jubula.documentation.orbit ---
[INFO] 
[INFO] --- maven-install-plugin:2.3.1:install (default-install) @ org.eclipse.jubula.documentation.orbit ---
[INFO] Installing /jobs/genie.jubula/jubula-nightly/workspace/org.eclipse.jubula.core/org.eclipse.jubula.documentation.orbit/target/org.eclipse.jubula.documentation.orbit-6.0.0-SNAPSHOT.jar to <https://ci.eclipse.org/jubula/job/jubula-nightly/ws/.repository/org/eclipse/jubula/org.eclipse.jubula.documentation.orbit/6.0.0-SNAPSHOT/org.eclipse.jubula.documentation.orbit-6.0.0-SNAPSHOT.jar>
[INFO] Installing /jobs/genie.jubula/jubula-nightly/workspace/org.eclipse.jubula.core/org.eclipse.jubula.documentation.orbit/pom.xml to <https://ci.eclipse.org/jubula/job/jubula-nightly/ws/.repository/org/eclipse/jubula/org.eclipse.jubula.documentation.orbit/6.0.0-SNAPSHOT/org.eclipse.jubula.documentation.orbit-6.0.0-SNAPSHOT.pom>
[INFO] Installing /jobs/genie.jubula/jubula-nightly/workspace/org.eclipse.jubula.core/org.eclipse.jubula.documentation.orbit/target/org.eclipse.jubula.documentation.orbit-6.0.0-SNAPSHOT.jar.pack.gz to <https://ci.eclipse.org/jubula/job/jubula-nightly/ws/.repository/org/eclipse/jubula/org.eclipse.jubula.documentation.orbit/6.0.0-SNAPSHOT/org.eclipse.jubula.documentation.orbit-6.0.0-SNAPSHOT-pack200.jar.pack.gz>
[INFO] Installing /jobs/genie.jubula/jubula-nightly/workspace/org.eclipse.jubula.core/org.eclipse.jubula.documentation.orbit/target/p2content.xml to <https://ci.eclipse.org/jubula/job/jubula-nightly/ws/.repository/org/eclipse/jubula/org.eclipse.jubula.documentation.orbit/6.0.0-SNAPSHOT/org.eclipse.jubula.documentation.orbit-6.0.0-SNAPSHOT-p2metadata.xml>
[INFO] Installing /jobs/genie.jubula/jubula-nightly/workspace/org.eclipse.jubula.core/org.eclipse.jubula.documentation.orbit/target/p2artifacts.xml to <https://ci.eclipse.org/jubula/job/jubula-nightly/ws/.repository/org/eclipse/jubula/org.eclipse.jubula.documentation.orbit/6.0.0-SNAPSHOT/org.eclipse.jubula.documentation.orbit-6.0.0-SNAPSHOT-p2artifacts.xml>
[INFO] 
[INFO] --- tycho-p2-plugin:1.0.0:update-local-index (default-update-local-index) @ org.eclipse.jubula.documentation.orbit ---
[INFO] 
[INFO] --- maven-deploy-plugin:2.5:deploy (default-deploy) @ org.eclipse.jubula.documentation.orbit ---
Downloading from repo.eclipse.org: https://repo.eclipse.org/content/repositories/jubula-snapshots/org/eclipse/jubula/org.eclipse.jubula.documentation.orbit/6.0.0-SNAPSHOT/maven-metadata.xml
Progress (1): 1.5 kB                    Downloaded from repo.eclipse.org: https://repo.eclipse.org/content/repositories/jubula-snapshots/org/eclipse/jubula/org.eclipse.jubula.documentation.orbit/6.0.0-SNAPSHOT/maven-metadata.xml (1.5 kB at 42 kB/s)
Uploading to repo.eclipse.org: https://repo.eclipse.org/content/repositories/jubula-snapshots/org/eclipse/jubula/org.eclipse.jubula.documentation.orbit/6.0.0-SNAPSHOT/org.eclipse.jubula.documentation.orbit-6.0.0-20180206.113725-48.jar
Progress (1): 2.0/6.6 kBProgress (1): 4.1/6.6 kBProgress (1): 6.1/6.6 kBProgress (1): 6.6 kB                        Uploaded to repo.eclipse.org: https://repo.eclipse.org/content/repositories/jubula-snapshots/org/eclipse/jubula/org.eclipse.jubula.documentation.orbit/6.0.0-SNAPSHOT/org.eclipse.jubula.documentation.orbit-6.0.0-20180206.113725-48.jar (6.6 kB at 22 kB/s)
Uploading to repo.eclipse.org: https://repo.eclipse.org/content/repositories/jubula-snapshots/org/eclipse/jubula/org.eclipse.jubula.documentation.orbit/6.0.0-SNAPSHOT/org.eclipse.jubula.documentation.orbit-6.0.0-20180206.113725-48.pom
Progress (1): 2.0/2.9 kBProgress (1): 2.9 kB                        Uploaded to repo.eclipse.org: https://repo.eclipse.org/content/repositories/jubula-snapshots/org/eclipse/jubula/org.eclipse.jubula.documentation.orbit/6.0.0-SNAPSHOT/org.eclipse.jubula.documentation.orbit-6.0.0-20180206.113725-48.pom (2.9 kB at 45 kB/s)
Downloading from repo.eclipse.org: https://repo.eclipse.org/content/repositories/jubula-snapshots/org/eclipse/jubula/org.eclipse.jubula.documentation.orbit/maven-metadata.xml
Progress (1): 496 B                   Downloaded from repo.eclipse.org: https://repo.eclipse.org/content/repositories/jubula-snapshots/org/eclipse/jubula/org.eclipse.jubula.documentation.orbit/maven-metadata.xml (496 B at 19 kB/s)
Uploading to repo.eclipse.org: https://repo.eclipse.org/content/repositories/jubula-snapshots/org/eclipse/jubula/org.eclipse.jubula.documentation.orbit/6.0.0-SNAPSHOT/maven-metadata.xml
Progress (1): 1.5 kB                    Uploaded to repo.eclipse.org: https://repo.eclipse.org/content/repositories/jubula-snapshots/org/eclipse/jubula/org.eclipse.jubula.documentation.orbit/6.0.0-SNAPSHOT/maven-metadata.xml (1.5 kB at 19 kB/s)
Uploading to repo.eclipse.org: https://repo.eclipse.org/content/repositories/jubula-snapshots/org/eclipse/jubula/org.eclipse.jubula.documentation.orbit/maven-metadata.xml
Progress (1): 496 B                   Uploaded to repo.eclipse.org: https://repo.eclipse.org/content/repositories/jubula-snapshots/org/eclipse/jubula/org.eclipse.jubula.documentation.orbit/maven-metadata.xml (496 B at 7.3 kB/s)
Uploading to repo.eclipse.org: https://repo.eclipse.org/content/repositories/jubula-snapshots/org/eclipse/jubula/org.eclipse.jubula.documentation.orbit/6.0.0-SNAPSHOT/org.eclipse.jubula.documentation.orbit-6.0.0-20180206.113725-48-pack200.jar.pack.gz
Progress (1): 2.0/6.0 kBProgress (1): 4.1/6.0 kBProgress (1): 6.0 kB                        Uploaded to repo.eclipse.org: https://repo.eclipse.org/content/repositories/jubula-snapshots/org/eclipse/jubula/org.eclipse.jubula.documentation.orbit/6.0.0-SNAPSHOT/org.eclipse.jubula.documentation.orbit-6.0.0-20180206.113725-48-pack200.jar.pack.gz (6.0 kB at 40 kB/s)
Uploading to repo.eclipse.org: https://repo.eclipse.org/content/repositories/jubula-snapshots/org/eclipse/jubula/org.eclipse.jubula.documentation.orbit/6.0.0-SNAPSHOT/maven-metadata.xml
Progress (1): 1.5 kB                    Uploaded to repo.eclipse.org: https://repo.eclipse.org/content/repositories/jubula-snapshots/org/eclipse/jubula/org.eclipse.jubula.documentation.orbit/6.0.0-SNAPSHOT/maven-metadata.xml (1.5 kB at 20 kB/s)
Uploading to repo.eclipse.org: https://repo.eclipse.org/content/repositories/jubula-snapshots/org/eclipse/jubula/org.eclipse.jubula.documentation.orbit/6.0.0-SNAPSHOT/org.eclipse.jubula.documentation.orbit-6.0.0-20180206.113725-48-p2metadata.xml
Progress (1): 2.0/4.5 kBProgress (1): 4.1/4.5 kBProgress (1): 4.5 kB                        Uploaded to repo.eclipse.org: https://repo.eclipse.org/content/repositories/jubula-snapshots/org/eclipse/jubula/org.eclipse.jubula.documentation.orbit/6.0.0-SNAPSHOT/org.eclipse.jubula.documentation.orbit-6.0.0-20180206.113725-48-p2metadata.xml (4.5 kB at 66 kB/s)
Uploading to repo.eclipse.org: https://repo.eclipse.org/content/repositories/jubula-snapshots/org/eclipse/jubula/org.eclipse.jubula.documentation.orbit/6.0.0-SNAPSHOT/maven-metadata.xml
Progress (1): 1.5 kB                    Uploaded to repo.eclipse.org: https://repo.eclipse.org/content/repositories/jubula-snapshots/org/eclipse/jubula/org.eclipse.jubula.documentation.orbit/6.0.0-SNAPSHOT/maven-metadata.xml (1.5 kB at 19 kB/s)
Uploading to repo.eclipse.org: https://repo.eclipse.org/content/repositories/jubula-snapshots/org/eclipse/jubula/org.eclipse.jubula.documentation.orbit/6.0.0-SNAPSHOT/org.eclipse.jubula.documentation.orbit-6.0.0-20180206.113725-48-p2artifacts.xml
Progress (1): 687 B                   Uploaded to repo.eclipse.org: https://repo.eclipse.org/content/repositories/jubula-snapshots/org/eclipse/jubula/org.eclipse.jubula.documentation.orbit/6.0.0-SNAPSHOT/org.eclipse.jubula.documentation.orbit-6.0.0-20180206.113725-48-p2artifacts.xml (687 B at 8.7 kB/s)
Uploading to repo.eclipse.org: https://repo.eclipse.org/content/repositories/jubula-snapshots/org/eclipse/jubula/org.eclipse.jubula.documentation.orbit/6.0.0-SNAPSHOT/maven-metadata.xml
Progress (1): 1.5 kB                    Uploaded to repo.eclipse.org: https://repo.eclipse.org/content/repositories/jubula-snapshots/org/eclipse/jubula/org.eclipse.jubula.documentation.orbit/6.0.0-SNAPSHOT/maven-metadata.xml (1.5 kB at 22 kB/s)
[INFO] 
[INFO] ------------------------------------------------------------------------
[INFO] Building org.eclipse.jubula.client.ua.help 6.0.0-SNAPSHOT
[INFO] ------------------------------------------------------------------------
[INFO] 
[INFO] --- maven-clean-plugin:2.5:clean (default-clean) @ org.eclipse.jubula.client.ua.help ---
[INFO] 
[INFO] --- tycho-packaging-plugin:1.0.0:build-qualifier (default-build-qualifier) @ org.eclipse.jubula.client.ua.help ---
[INFO] The project's OSGi version is 6.0.0.201802061131
[INFO] 
[INFO] --- tycho-packaging-plugin:1.0.0:validate-id (default-validate-id) @ org.eclipse.jubula.client.ua.help ---
[INFO] 
[INFO] --- tycho-packaging-plugin:1.0.0:validate-version (default-validate-version) @ org.eclipse.jubula.client.ua.help ---
[INFO] 
[INFO] --- maven-antrun-plugin:1.7:run (default) @ org.eclipse.jubula.client.ua.help ---
[INFO] Executing tasks

main:

validateEnv:

echoEnvInfo:

buildInstallationManual:

checkParam:

buildHtmlImageLister:
     [exec] Picked up JAVA_TOOL_OPTIONS: -Xmx2G -Djava.io.tmpdir=/tmp/genie.jubula
      [jar] Building jar: /jobs/genie.jubula/jubula-nightly/workspace/org.eclipse.jubula.core/org.eclipse.jubula.documentation/HtmlImageLister.jar

buildHTML:

checkParam:

clean:
     [copy] Copying 2 files to /jobs/genie.jubula/jubula-nightly/workspace/org.eclipse.jubula.core/org.eclipse.jubula.documentation/install/en/build/html/images
     [copy] Copying 2 files to /jobs/genie.jubula/jubula-nightly/workspace/org.eclipse.jubula.core/org.eclipse.jubula.documentation/install/en/build/html/css

checkForErrors:
 [loadfile] Do not set property errorlines as its length is 0.
   [delete] Deleting: /jobs/genie.jubula/jubula-nightly/workspace/org.eclipse.jubula.core/org.eclipse.jubula.documentation/output.log

checkImages:
[INFO] ------------------------------------------------------------------------
[INFO] Reactor Summary:
[INFO] 
[INFO] Eclipse Jubula ..................................... SUCCESS [  0.927 s]
[INFO] org.eclipse.jubula.releng.client ................... SUCCESS [  0.562 s]
[INFO] org.eclipse.jubula.tools ........................... SUCCESS [  9.034 s]
[INFO] org.eclipse.jubula.tools.exec ...................... SUCCESS [  2.838 s]
[INFO] org.eclipse.jubula.communication ................... SUCCESS [  3.566 s]
[INFO] org.eclipse.jubula.logging ......................... SUCCESS [  2.725 s]
[INFO] org.eclipse.jubula.version ......................... SUCCESS [  2.724 s]
[INFO] org.eclipse.jubula.toolkit.common .................. SUCCESS [  2.835 s]
[INFO] org.eclipse.jubula.toolkit.api ..................... SUCCESS [  2.960 s]
[INFO] org.eclipse.jubula.client.api ...................... SUCCESS [  3.072 s]
[INFO] org.eclipse.jubula.client.core ..................... SUCCESS [ 18.571 s]
[INFO] org.eclipse.jubula.rc.common ....................... SUCCESS [  3.935 s]
[INFO] org.eclipse.jubula.autagent ........................ SUCCESS [  3.391 s]
[INFO] org.eclipse.jubula.autagent.api .................... SUCCESS [  2.380 s]
[INFO] org.eclipse.jubula.rc.common.agent ................. SUCCESS [  2.426 s]
[INFO] org.eclipse.jubula.rc.swing ........................ SUCCESS [  3.677 s]
[INFO] org.eclipse.jubula.rc.javafx ....................... SUCCESS [  3.890 s]
[INFO] org.eclipse.jubula.rc.javafx.j8u40 ................. SUCCESS [  2.624 s]
[INFO] org.eclipse.jubula.rc.swt .......................... SUCCESS [  4.943 s]
[INFO] Eclipse Jubula Server Components ................... SUCCESS [  0.653 s]
[INFO] Eclipse Jubula Server Remote Control Components .... SUCCESS [  0.381 s]
[INFO] org.eclipse.jubula.rc.common.orbit ................. SUCCESS [  2.424 s]
[INFO] org.eclipse.jubula.rc.rcp.common ................... SUCCESS [ 19.552 s]
[INFO] org.eclipse.jubula.rc.rcp.swt ...................... SUCCESS [  4.219 s]
[INFO] org.eclipse.jubula.rc.rcp.feature .................. SUCCESS [  1.486 s]
[INFO] org.eclipse.jubula.rc.rcp.e3 ....................... SUCCESS [  2.758 s]
[INFO] org.eclipse.jubula.rc.rcp.e3.releng ................ SUCCESS [  0.343 s]
[INFO] org.eclipse.jubula.rc.rcp.e3.specific .............. SUCCESS [  2.395 s]
[INFO] org.eclipse.jubula.rc.rcp.e3.feature ............... SUCCESS [  1.720 s]
[INFO] org.eclipse.jubula.rc.rcp.e3.site .................. SUCCESS [  2.192 s]
[INFO] org.eclipse.jubula.rc.rcp.e4.releng ................ SUCCESS [  0.295 s]
[INFO] org.eclipse.jubula.rc.rcp.e4 ....................... SUCCESS [  7.769 s]
[INFO] org.eclipse.jubula.rc.rcp.e4.swt ................... SUCCESS [  2.863 s]
[INFO] org.eclipse.jubula.rc.rcp.e4.feature ............... SUCCESS [  1.837 s]
[INFO] org.eclipse.jubula.rc.rcp.e4.site .................. SUCCESS [  1.584 s]
[INFO] org.eclipse.jubula.rc.rcp.site ..................... SUCCESS [  2.832 s]
[INFO] org.eclipse.jubula.rc.rcp .......................... SUCCESS [  9.755 s]
[INFO] org.eclipse.jubula.rc.rcp.ext ...................... SUCCESS [  2.634 s]
[INFO] org.eclipse.jubula.app.autrun ...................... SUCCESS [  2.703 s]
[INFO] org.eclipse.jubula.app.autagent .................... SUCCESS [  2.935 s]
[INFO] org.eclipse.jubula.feature.rc ...................... SUCCESS [  2.104 s]
[INFO] org.eclipse.jubula.product.autagent.start .......... SUCCESS [  6.573 s]
[INFO] org.eclipse.jubula.product.autagent.stop ........... SUCCESS [  6.605 s]
[INFO] org.eclipse.jubula.rc.rcp.accessor.feature ......... SUCCESS [  1.727 s]
[INFO] org.eclipse.jubula.rc.rcp.accessor.site ............ SUCCESS [  2.936 s]
[INFO] org.eclipse.jubula.client.ui ....................... SUCCESS [  4.904 s]
[INFO] org.eclipse.jubula.mylyn ........................... SUCCESS [  2.977 s]
[INFO] org.eclipse.jubula.client.alm.mylyn.core ........... SUCCESS [  3.998 s]
[INFO] org.eclipse.jubula.client.archive .................. SUCCESS [  3.882 s]
[INFO] org.eclipse.jubula.toolkit.html .................... SUCCESS [  3.115 s]
[INFO] org.eclipse.jubula.client.ui.rcp ................... SUCCESS [ 10.753 s]
[INFO] org.eclipse.jubula.app ............................. SUCCESS [  3.573 s]
[INFO] org.eclipse.jubula.client.cmd ...................... SUCCESS [  2.906 s]
[INFO] org.eclipse.jubula.app.dbtool ...................... SUCCESS [  3.495 s]
[INFO] org.eclipse.jubula.app.testexec .................... SUCCESS [  2.842 s]
[INFO] org.eclipse.jubula.client.alm.mylyn.ui ............. SUCCESS [  3.407 s]
[INFO] org.eclipse.jubula.client.alm.mylyn.ui.bridge ...... SUCCESS [  3.617 s]
[INFO] org.eclipse.jubula.client.alm.ui ................... SUCCESS [  3.114 s]
[INFO] org.eclipse.jubula.client.api.commands ............. SUCCESS [  2.893 s]
[INFO] org.eclipse.jubula.toolkit.base.provider ........... SUCCESS [  3.053 s]
[INFO] org.eclipse.jubula.toolkit.concrete.provider ....... SUCCESS [  2.964 s]
[INFO] org.eclipse.jubula.toolkit.html.provider ........... SUCCESS [  2.794 s]
[INFO] org.eclipse.jubula.toolkit.javafx.provider ......... SUCCESS [  2.980 s]
[INFO] org.eclipse.jubula.toolkit.swt.provider ............ SUCCESS [  2.691 s]
[INFO] org.eclipse.jubula.toolkit.rcp.provider ............ SUCCESS [  2.911 s]
[INFO] org.eclipse.jubula.toolkit.gef.provider ............ SUCCESS [  2.887 s]
[INFO] org.eclipse.jubula.toolkit.swing.provider .......... SUCCESS [  2.851 s]
[INFO] org.eclipse.jubula.toolkit.api.gen ................. SUCCESS [ 17.356 s]
[INFO] org.eclipse.jubula.client.api.converter.annotations  SUCCESS [  2.641 s]
[INFO] org.eclipse.jubula.client.api.converter ............ SUCCESS [  8.183 s]
[INFO] org.eclipse.jubula.client.api.converter.ui ......... SUCCESS [  2.841 s]
[INFO] org.eclipse.jubula.client.api.ui ................... SUCCESS [  7.846 s]
[INFO] org.eclipse.jubula.client.autagent ................. SUCCESS [  2.727 s]
[INFO] org.eclipse.jubula.client.core.exporter.junit ...... SUCCESS [  3.145 s]
[INFO] org.eclipse.jubula.client.core.functions ........... SUCCESS [  2.861 s]
[INFO] org.eclipse.jubula.client.inspector.ui ............. SUCCESS [  3.248 s]
[INFO] org.eclipse.jubula.client.stats .................... SUCCESS [  2.428 s]
[INFO] org.eclipse.jubula.client.teststyle ................ SUCCESS [  2.968 s]
[INFO] org.eclipse.jubula.client.teststyle.impl.standard .. SUCCESS [  2.604 s]
[INFO] org.eclipse.jubula.client.toolkit.ui ............... SUCCESS [  2.621 s]
[INFO] org.eclipse.jubula.client.ua.cheatsheets ........... SUCCESS [  2.368 s]
[INFO] org.eclipse.jubula.documentation.orbit ............. SUCCESS [  1.720 s]
[INFO] org.eclipse.jubula.client.ua.help .................. FAILURE [  2.797 s]
[INFO] org.eclipse.jubula.client.ua.welcome ............... SKIPPED
[INFO] org.eclipse.jubula.client.wiki.ui .................. SKIPPED
[INFO] org.eclipse.jubula.releng.examples ................. SKIPPED
[INFO] org.eclipse.jubula.examples.extension.releng ....... SKIPPED
[INFO] org.eclipse.jubula.examples.extension.javafx.rc .... SKIPPED
[INFO] org.eclipse.jubula.examples.extension.javafx.rc.container SKIPPED
[INFO] org.eclipse.jubula.examples.extension.javafx.toolkit SKIPPED
[INFO] org.eclipse.jubula.examples.extension.javafx.aut ... SKIPPED
[INFO] org.eclipse.jubula.examples.extension.javafx.feature SKIPPED
[INFO] org.eclipse.jubula.examples.extension.rcp.aut ...... SKIPPED
[INFO] org.eclipse.jubula.examples.extension.rcp.toolkit .. SKIPPED
[INFO] org.eclipse.jubula.examples.extension.rcp.rc ....... SKIPPED
[INFO] org.eclipse.jubula.examples.extension.rcp.feature .. SKIPPED
[INFO] org.eclipse.jubula.examples.extension.swing.toolkit  SKIPPED
[INFO] org.eclipse.jubula.examples.extension.swing.rc ..... SKIPPED
[INFO] org.eclipse.jubula.examples.extension.swing.aut .... SKIPPED
[INFO] org.eclipse.jubula.examples.extension.swing.feature  SKIPPED
[INFO] org.eclipse.jubula.feature.api.converter ........... SKIPPED
[INFO] org.eclipse.jubula.toolkit.base.api ................ SKIPPED
[INFO] org.eclipse.jubula.toolkit.concrete.api ............ SKIPPED
[INFO] org.eclipse.jubula.toolkit.html.api ................ SKIPPED
[INFO] org.eclipse.jubula.toolkit.javafx.api .............. SKIPPED
[INFO] org.eclipse.jubula.toolkit.swt.api ................. SKIPPED
[INFO] org.eclipse.jubula.toolkit.rcp.api ................. SKIPPED
[INFO] org.eclipse.jubula.toolkit.gef.api ................. SKIPPED
[INFO] org.eclipse.jubula.toolkit.swing.api ............... SKIPPED
[INFO] org.eclipse.jubula.feature.api.core ................ SKIPPED
[INFO] org.eclipse.jubula.feature.api ..................... SKIPPED
[INFO] org.eclipse.jubula.feature ......................... SKIPPED
[INFO] org.eclipse.jubula.launch .......................... SKIPPED
[INFO] org.eclipse.jubula.launch.java ..................... SKIPPED
[INFO] org.eclipse.jubula.launch.ui ....................... SKIPPED
[INFO] org.eclipse.jubula.launch.java.ui .................. SKIPPED
[INFO] org.eclipse.jubula.feature.launch.java ............. SKIPPED
[INFO] org.eclipse.jubula.launch.rcp.ui ................... SKIPPED
[INFO] org.eclipse.jubula.feature.launch.rcp .............. SKIPPED
[INFO] Jubula p2-repository for Eclipse ................... SKIPPED
[INFO] org.eclipse.jubula.client.qa.caa.gen.ui ............ SKIPPED
[INFO] org.eclipse.jubula.examples.aut.adder.javafx ....... SKIPPED
[INFO] org.eclipse.jubula.examples.aut.adder.swing ........ SKIPPED
[INFO] org.eclipse.jubula.examples.aut.adder.swt .......... SKIPPED
[INFO] org.eclipse.jubula.examples.aut.dvdtool ............ SKIPPED
[INFO] org.eclipse.jubula.examples.extension.swing.api .... SKIPPED
[INFO] org.eclipse.jubula.examples.extension.swing.api.test SKIPPED
[INFO] org.eclipse.jubula.examples.extension.javafx.api ... SKIPPED
[INFO] org.eclipse.jubula.examples.extension.javafx.api.test SKIPPED
[INFO] org.eclipse.jubula.examples.extension.rcp.api ...... SKIPPED
[INFO] org.eclipse.jubula.examples.extension.rcp.api.test . SKIPPED
[INFO] org.eclipse.jubula.qa.api .......................... SKIPPED
[INFO] org.eclipse.jubula.qa.api.rcp ...................... SKIPPED
[INFO] org.eclipse.jubula.tools.exec.tests.lin ............ SKIPPED
[INFO] ------------------------------------------------------------------------
[INFO] BUILD FAILURE
[INFO] ------------------------------------------------------------------------
[INFO] Total time: 06:07 min
[INFO] Finished at: 2018-02-06T06:37:29-05:00
[INFO] Final Memory: 295M/948M
[INFO] ------------------------------------------------------------------------
[ERROR] Failed to execute goal org.apache.maven.plugins:maven-antrun-plugin:1.7:run (default) on project org.eclipse.jubula.client.ua.help: An Ant BuildException has occured: The following error occurred while executing this line:
[ERROR] /jobs/genie.jubula/jubula-nightly/workspace/org.eclipse.jubula.core/org.eclipse.jubula.documentation/buildScript.xml:160: The following error occurred while executing this line:
[ERROR] /jobs/genie.jubula/jubula-nightly/workspace/org.eclipse.jubula.core/org.eclipse.jubula.documentation/buildScript.xml:299: The following error occurred while executing this line:
[ERROR] /jobs/genie.jubula/jubula-nightly/workspace/org.eclipse.jubula.core/org.eclipse.jubula.documentation/buildScript.xml:414: Missing Image Files:
[ERROR] /jobs/genie.jubula/jubula-nightly/workspace/org.eclipse.jubula.core/org.eclipse.jubula.documentation/install/en/docbook/Picked
[ERROR] /jobs/genie.jubula/jubula-nightly/workspace/org.eclipse.jubula.core/org.eclipse.jubula.documentation/install/en/docbook/up
[ERROR] /jobs/genie.jubula/jubula-nightly/workspace/org.eclipse.jubula.core/org.eclipse.jubula.documentation/install/en/docbook/JAVA_TOOL_OPTIONS
[ERROR] 
[ERROR] /jobs/genie.jubula/jubula-nightly/workspace/org.eclipse.jubula.core/org.eclipse.jubula.documentation/install/en/docbook/-Xmx2G
[ERROR] /jobs/genie.jubula/jubula-nightly/workspace/org.eclipse.jubula.core/org.eclipse.jubula.documentation/install/en/docbook/-Djava.io.tmpdir=/tmp/genie.jubula
[ERROR] around Ant part ...<ant antfile="buildScript.xml" dir="../org.eclipse.jubula.documentation" target="buildDocumentation"/>... @ 4:105 in /jobs/genie.jubula/jubula-nightly/workspace/org.eclipse.jubula.core/org.eclipse.jubula.client.ua.help/target/antrun/build-main.xml
[ERROR] -> [Help 1]
[ERROR] 
[ERROR] To see the full stack trace of the errors, re-run Maven with the -e switch.
[ERROR] Re-run Maven using the -X switch to enable full debug logging.
[ERROR] 
[ERROR] For more information about the errors and possible solutions, please read the following articles:
[ERROR] [Help 1] http://cwiki.apache.org/confluence/display/MAVEN/MojoExecutionException
[ERROR] 
[ERROR] After correcting the problems, you can resume the build with the command
[ERROR]   mvn <goals> -rf :org.eclipse.jubula.client.ua.help
Build step 'Invoke top-level Maven targets' marked build as failure
Not sending mail to unregistered user Marcel.Krauth@xxxxxxxxx