[Date Prev][Date Next][Thread Prev][Thread Next][Date Index][Thread Index] [List Home]
[jubula-dev] Build failed in Hudson: jubula-nightly #697

See <https://hudson.eclipse.org/hudson/job/jubula-nightly/697/>

------------------------------------------
[...truncated 653 lines...]
[INFO] --- maven-resources-plugin:2.4.3:resources (default-resources) @ org.eclipse.jubula.communication ---
[INFO] Using 'UTF-8' encoding to copy filtered resources.
[INFO] skip non existing resourceDirectory <https://hudson.eclipse.org/hudson/job/jubula-nightly/ws/jubula/org.eclipse.jubula.communication/src/main/resources>
[INFO] 
[INFO] --- tycho-compiler-plugin:0.14.0:compile (default-compile) @ org.eclipse.jubula.communication ---
[INFO] Compiling 93 source files to <https://hudson.eclipse.org/hudson/job/jubula-nightly/ws/jubula/org.eclipse.jubula.communication/target/classes>
[INFO] 
[INFO] --- maven-resources-plugin:2.4.3:testResources (default-testResources) @ org.eclipse.jubula.communication ---
[INFO] Using 'UTF-8' encoding to copy filtered resources.
[INFO] skip non existing resourceDirectory <https://hudson.eclipse.org/hudson/job/jubula-nightly/ws/jubula/org.eclipse.jubula.communication/src/test/resources>
[INFO] 
[INFO] --- tycho-packaging-plugin:0.14.0:package-plugin (default-package-plugin) @ org.eclipse.jubula.communication ---
[INFO] Building jar: <https://hudson.eclipse.org/hudson/job/jubula-nightly/ws/jubula/org.eclipse.jubula.communication/target/org.eclipse.jubula.communication-1.2.0-SNAPSHOT.jar>
[INFO] 
[INFO] --- tycho-p2-plugin:0.14.0:p2-metadata (default-p2-metadata) @ org.eclipse.jubula.communication ---
[INFO]                                                                         
[INFO] ------------------------------------------------------------------------
[INFO] Building org.eclipse.jubula.documentation.gen 1.2.0-SNAPSHOT
[INFO] ------------------------------------------------------------------------
[INFO] 
[INFO] --- maven-clean-plugin:2.4.1:clean (default-clean) @ org.eclipse.jubula.documentation.gen ---
[INFO] Deleting <https://hudson.eclipse.org/hudson/job/jubula-nightly/ws/jubula/org.eclipse.jubula.documentation.gen/target>
[INFO] 
[INFO] --- tycho-packaging-plugin:0.14.0:build-qualifier (default-build-qualifier) @ org.eclipse.jubula.documentation.gen ---
[INFO] 
[INFO] --- tycho-packaging-plugin:0.14.0:validate-id (default-validate-id) @ org.eclipse.jubula.documentation.gen ---
[INFO] 
[INFO] --- tycho-packaging-plugin:0.14.0:validate-version (default-validate-version) @ org.eclipse.jubula.documentation.gen ---
[INFO] 
[INFO] --- maven-resources-plugin:2.4.3:resources (default-resources) @ org.eclipse.jubula.documentation.gen ---
[INFO] Using 'UTF-8' encoding to copy filtered resources.
[INFO] skip non existing resourceDirectory <https://hudson.eclipse.org/hudson/job/jubula-nightly/ws/jubula/org.eclipse.jubula.documentation.gen/src/main/resources>
[INFO] 
[INFO] --- tycho-compiler-plugin:0.14.0:compile (default-compile) @ org.eclipse.jubula.documentation.gen ---
[INFO] Compiling 20 source files to <https://hudson.eclipse.org/hudson/job/jubula-nightly/ws/jubula/org.eclipse.jubula.documentation.gen/target/classes>
[INFO] 
[INFO] --- maven-resources-plugin:2.4.3:testResources (default-testResources) @ org.eclipse.jubula.documentation.gen ---
[INFO] Using 'UTF-8' encoding to copy filtered resources.
[INFO] skip non existing resourceDirectory <https://hudson.eclipse.org/hudson/job/jubula-nightly/ws/jubula/org.eclipse.jubula.documentation.gen/src/test/resources>
[INFO] 
[INFO] --- tycho-packaging-plugin:0.14.0:package-plugin (default-package-plugin) @ org.eclipse.jubula.documentation.gen ---
[INFO] Building jar: <https://hudson.eclipse.org/hudson/job/jubula-nightly/ws/jubula/org.eclipse.jubula.documentation.gen/target/org.eclipse.jubula.documentation.gen-1.2.0-SNAPSHOT.jar>
[INFO] META-INF already added, skipping
[INFO] resources already added, skipping
[INFO] lib already added, skipping
[INFO] META-INF/MANIFEST.MF already added, skipping
[INFO] about.html already added, skipping
[INFO] resources/texgen.properties already added, skipping
[INFO] lib/commons-configuration-1.2.jar already added, skipping
[INFO] 
[INFO] --- tycho-p2-plugin:0.14.0:p2-metadata (default-p2-metadata) @ org.eclipse.jubula.documentation.gen ---
[INFO] 
[INFO] --- maven-dependency-plugin:2.4:copy-dependencies (copy-dependencies) @ org.eclipse.jubula.documentation.gen ---
[INFO] Copying org.apache.commons.logging-1.1.1.v201101211721.jar to <https://hudson.eclipse.org/hudson/job/jubula-nightly/ws/jubula/org.eclipse.jubula.documentation.gen/target/lib/org.apache.commons.logging.jar>
[INFO] Copying org.eclipse.jubula.tools-1.2.0-SNAPSHOT.jar to <https://hudson.eclipse.org/hudson/job/jubula-nightly/ws/jubula/org.eclipse.jubula.documentation.gen/target/lib/org.eclipse.jubula.tools.jar>
[INFO] Copying org.slf4j.jcl-1.6.4.v20111214-2030.jar to <https://hudson.eclipse.org/hudson/job/jubula-nightly/ws/jubula/org.eclipse.jubula.documentation.gen/target/lib/org.slf4j.jcl.jar>
[INFO] Copying org.apache.commons.collections-3.2.0.v201005080500.jar to <https://hudson.eclipse.org/hudson/job/jubula-nightly/ws/jubula/org.eclipse.jubula.documentation.gen/target/lib/org.apache.commons.collections.jar>
[INFO] Copying ch.qos.logback.core-1.0.0.v20111214-2030.jar to <https://hudson.eclipse.org/hudson/job/jubula-nightly/ws/jubula/org.eclipse.jubula.documentation.gen/target/lib/ch.qos.logback.core.jar>
[INFO] Copying ch.qos.logback.classic-1.0.0.v20111214-2030.jar to <https://hudson.eclipse.org/hudson/job/jubula-nightly/ws/jubula/org.eclipse.jubula.documentation.gen/target/lib/ch.qos.logback.classic.jar>
[INFO] Copying org.apache.commons.configuration-1.2.0.jar to <https://hudson.eclipse.org/hudson/job/jubula-nightly/ws/jubula/org.eclipse.jubula.documentation.gen/target/lib/org.apache.commons.configuration.jar>
[INFO] Copying org.apache.commons.cli-1.2.0.v201105210650.jar to <https://hudson.eclipse.org/hudson/job/jubula-nightly/ws/jubula/org.eclipse.jubula.documentation.gen/target/lib/org.apache.commons.cli.jar>
[INFO] Copying xpp3_min-1.1.3.4.O.jar to <https://hudson.eclipse.org/hudson/job/jubula-nightly/ws/jubula/org.eclipse.jubula.documentation.gen/target/lib/org.eclipse.jubula.tools-lib/xpp3_min-1.1.3.4.O.jar.jar>
[INFO] Copying xstream-1.3.1.jar to <https://hudson.eclipse.org/hudson/job/jubula-nightly/ws/jubula/org.eclipse.jubula.documentation.gen/target/lib/org.eclipse.jubula.tools-lib/xstream-1.3.1.jar.jar>
[INFO] Copying org.slf4j.api-1.6.4.v20111214-2030.jar to <https://hudson.eclipse.org/hudson/job/jubula-nightly/ws/jubula/org.eclipse.jubula.documentation.gen/target/lib/org.slf4j.api.jar>
[INFO] Copying org.apache.commons.lang-2.4.0.v201005080502.jar to <https://hudson.eclipse.org/hudson/job/jubula-nightly/ws/jubula/org.eclipse.jubula.documentation.gen/target/lib/org.apache.commons.lang.jar>
[INFO]                                                                         
[INFO] ------------------------------------------------------------------------
[INFO] Building org.eclipse.jubula.toolkit.generate.interfaces 1.2.0-SNAPSHOT
[INFO] ------------------------------------------------------------------------
[INFO] 
[INFO] --- maven-clean-plugin:2.4.1:clean (default-clean) @ org.eclipse.jubula.toolkit.generate.interfaces ---
[INFO] Deleting <https://hudson.eclipse.org/hudson/job/jubula-nightly/ws/jubula/org.eclipse.jubula.toolkit.generate.interfaces/target>
[INFO] 
[INFO] --- maven-antrun-plugin:1.6:run (generate-Interfaces) @ org.eclipse.jubula.toolkit.generate.interfaces ---
[INFO] Executing tasks

main:

clean:
   [delete] Deleting directory <https://hudson.eclipse.org/hudson/job/jubula-nightly/ws/jubula/org.eclipse.jubula.toolkit.generate.interfaces/target>

build:
    [mkdir] Created dir: <https://hudson.eclipse.org/hudson/job/jubula-nightly/ws/jubula/org.eclipse.jubula.toolkit.generate.interfaces/target/clazzes>
    [mkdir] Created dir: <https://hudson.eclipse.org/hudson/job/jubula-nightly/ws/jubula/org.eclipse.jubula.toolkit.generate.interfaces/target/lib>
    [mkdir] Created dir: <https://hudson.eclipse.org/hudson/job/jubula-nightly/ws/jubula/org.eclipse.jubula.toolkit.generate.interfaces/target/resources>
     [copy] Copying 2 files to <https://hudson.eclipse.org/hudson/job/jubula-nightly/ws/jubula/org.eclipse.jubula.toolkit.generate.interfaces/target/resources>
     [echo] <https://hudson.eclipse.org/hudson/job/jubula-nightly/ws/jubula/org.eclipse.jubula.toolkit.generate.interfaces>
     [echo] 		
     [copy] Copying 16 files to <https://hudson.eclipse.org/hudson/job/jubula-nightly/ws/jubula/org.eclipse.jubula.toolkit.generate.interfaces/target/lib>
    [javac] <https://hudson.eclipse.org/hudson/job/jubula-nightly/ws/jubula/org.eclipse.jubula.toolkit.generate.interfaces/generateInterfaces.xml>:68: warning: 'includeantruntime' was not set, defaulting to build.sysclasspath=last; set to false for repeatable builds
    [javac] Compiling 3 source files to <https://hudson.eclipse.org/hudson/job/jubula-nightly/ws/jubula/org.eclipse.jubula.toolkit.generate.interfaces/target/clazzes>
[INFO] ------------------------------------------------------------------------
[INFO] Reactor Summary:
[INFO] 
[INFO] Eclipse Jubula .................................... SUCCESS [0.152s]
[INFO] org.eclipse.jubula.releng.client .................. SUCCESS [0.037s]
[INFO] org.eclipse.jubula.tools .......................... SUCCESS [2.960s]
[INFO] org.eclipse.jubula.communication .................. SUCCESS [0.813s]
[INFO] org.eclipse.jubula.documentation.gen .............. SUCCESS [1.895s]
[INFO] org.eclipse.jubula.toolkit.generate.interfaces .... FAILURE [0.611s]
[INFO] org.eclipse.jubula.ui.compatibility ............... SKIPPED
[INFO] org.eclipse.jubula.autagent ....................... SKIPPED
[INFO] org.eclipse.jubula.rc.common ...................... SKIPPED
[INFO] org.eclipse.jubula.rc.common.agent ................ SKIPPED
[INFO] org.eclipse.jubula.rc.swing ....................... SKIPPED
[INFO] org.eclipse.jubula.rc.swt ......................... SKIPPED
[INFO] org.eclipse.jubula.rc.rcp ......................... SKIPPED
[INFO] org.eclipse.jubula.app.autrun ..................... SKIPPED
[INFO] org.eclipse.jubula.app.autagent ................... SKIPPED
[INFO] org.eclipse.jubula.product.autagent.start ......... SKIPPED
[INFO] Eclipse Jubula Server Components .................. SKIPPED
[INFO] org.apache.poi .................................... SKIPPED
[INFO] org.eclipse.jubula.toolkit.common ................. SKIPPED
[INFO] org.eclipse.jubula.client.core .................... SKIPPED
[INFO] org.eclipse.jubula.client.ui ...................... SKIPPED
[INFO] org.eclipse.jubula.client.archive ................. SKIPPED
[INFO] org.eclipse.jubula.client.ui.rcp .................. SKIPPED
[INFO] org.eclipse.jubula.app ............................ SKIPPED
[INFO] org.eclipse.jubula.client.cmd ..................... SKIPPED
[INFO] org.eclipse.jubula.client.cmd.controller .......... SKIPPED
[INFO] org.eclipse.jubula.app.cmd ........................ SKIPPED
[INFO] org.eclipse.jubula.app.dbtool ..................... SKIPPED
[INFO] org.eclipse.jubula.client.analyze ................. SKIPPED
[INFO] org.eclipse.jubula.client.analyze.impl.standard ... SKIPPED
[INFO] org.eclipse.jubula.client.analyze.ui .............. SKIPPED
[INFO] org.eclipse.jubula.client.autagent ................ SKIPPED
[INFO] org.eclipse.jubula.client.inspector.ui ............ SKIPPED
[INFO] org.eclipse.jubula.client.teststyle ............... SKIPPED
[INFO] org.eclipse.jubula.client.teststyle.impl.standard . SKIPPED
[INFO] org.eclipse.jubula.client.ua.cheatsheets .......... SKIPPED
[INFO] org.eclipse.jubula.client.ua.help ................. SKIPPED
[INFO] org.eclipse.jubula.client.ua.welcome .............. SKIPPED
[INFO] org.eclipse.jubula.toolkit.provider.swt ........... SKIPPED
[INFO] org.eclipse.jubula.toolkit.provider.rcp ........... SKIPPED
[INFO] org.eclipse.jubula.toolkit.provider.html .......... SKIPPED
[INFO] org.eclipse.jubula.toolkit.provider.rcp.gef ....... SKIPPED
[INFO] org.eclipse.jubula.toolkit.provider.swing ......... SKIPPED
[INFO] org.eclipse.jubula.toolkit.provider.base .......... SKIPPED
[INFO] org.eclipse.jubula.toolkit.provider.concrete ...... SKIPPED
[INFO] org.eclipse.jubula.feature ........................ SKIPPED
[INFO] org.eclipse.jubula.launch ......................... SKIPPED
[INFO] org.eclipse.jubula.launch.java .................... SKIPPED
[INFO] org.eclipse.jubula.launch.ui ...................... SKIPPED
[INFO] org.eclipse.jubula.launch.java.ui ................. SKIPPED
[INFO] org.eclipse.jubula.feature.launch.java ............ SKIPPED
[INFO] org.eclipse.jubula.launch.rcp.ui .................. SKIPPED
[INFO] org.eclipse.jubula.feature.launch.rcp ............. SKIPPED
[INFO] Jubula for Eclipse 3.6 and 3.7 .................... SKIPPED
[INFO] ------------------------------------------------------------------------
[INFO] BUILD FAILURE
[INFO] ------------------------------------------------------------------------
[INFO] Total time: 1:55.978s
[INFO] Finished at: Thu May 03 06:49:36 EDT 2012
[INFO] Final Memory: 140M/297M
[INFO] ------------------------------------------------------------------------
[INFO] o.h.m.e.h.MavenExecutionResultHandler - Build failed with exception(s)
[INFO] o.h.m.e.h.MavenExecutionResultHandler - [1] org.apache.maven.lifecycle.LifecycleExecutionException: Failed to execute goal org.apache.maven.plugins:maven-antrun-plugin:1.6:run (generate-Interfaces) on project org.eclipse.jubula.toolkit.generate.interfaces: An Ant BuildException has occured: The following error occurred while executing this line:
<https://hudson.eclipse.org/hudson/job/jubula-nightly/ws/jubula/org.eclipse.jubula.toolkit.generate.interfaces/generateInterfaces.xml>:68: Error running javac compiler
[DEBUG] Closing connection to remote
[ERROR] Failed to execute goal org.apache.maven.plugins:maven-antrun-plugin:1.6:run (generate-Interfaces) on project org.eclipse.jubula.toolkit.generate.interfaces: An Ant BuildException has occured: The following error occurred while executing this line:
[ERROR] <https://hudson.eclipse.org/hudson/job/jubula-nightly/ws/jubula/org.eclipse.jubula.toolkit.generate.interfaces/generateInterfaces.xml>:68: Error running javac compiler: Cannot run program "javac" (in directory "<https://hudson.eclipse.org/hudson/job/jubula-nightly/ws/jubula/org.eclipse.jubula.toolkit.generate.interfaces";)>: java.io.IOException: error=2, No such file or directory
[ERROR] -> [Help 1]
org.apache.maven.lifecycle.LifecycleExecutionException: Failed to execute goal org.apache.maven.plugins:maven-antrun-plugin:1.6:run (generate-Interfaces) on project org.eclipse.jubula.toolkit.generate.interfaces: An Ant BuildException has occured: The following error occurred while executing this line:
<https://hudson.eclipse.org/hudson/job/jubula-nightly/ws/jubula/org.eclipse.jubula.toolkit.generate.interfaces/generateInterfaces.xml>:68: Error running javac compiler
	at org.apache.maven.lifecycle.internal.MojoExecutor.execute(MojoExecutor.java:217)
	at org.apache.maven.lifecycle.internal.MojoExecutor.execute(MojoExecutor.java:153)
	at org.apache.maven.lifecycle.internal.MojoExecutor.execute(MojoExecutor.java:145)
	at org.apache.maven.lifecycle.internal.LifecycleModuleBuilder.buildProject(LifecycleModuleBuilder.java:84)
	at org.apache.maven.lifecycle.internal.LifecycleModuleBuilder.buildProject(LifecycleModuleBuilder.java:59)
	at org.apache.maven.lifecycle.internal.LifecycleStarter.singleThreadedBuild(LifecycleStarter.java:183)
	at org.apache.maven.lifecycle.internal.LifecycleStarter.execute(LifecycleStarter.java:161)
	at org.apache.maven.DefaultMaven.doExecute(DefaultMaven.java:319)
	at org.apache.maven.DefaultMaven.execute(DefaultMaven.java:156)
	at org.apache.maven.cli.MavenCli.execute(MavenCli.java:537)
	at org.apache.maven.cli.MavenCli.doMain(MavenCli.java:196)
	at org.apache.maven.cli.MavenCli.main(MavenCli.java:141)
	at sun.reflect.NativeMethodAccessorImpl.invoke0(Native Method)
	at sun.reflect.NativeMethodAccessorImpl.invoke(NativeMethodAccessorImpl.java:39)
	at sun.reflect.DelegatingMethodAccessorImpl.invoke(DelegatingMethodAccessorImpl.java:25)
	at java.lang.reflect.Method.invoke(Method.java:597)
	at org.codehaus.plexus.classworlds.launcher.Launcher.launchEnhanced(Launcher.java:290)
	at org.codehaus.plexus.classworlds.launcher.Launcher.launch(Launcher.java:230)
	at org.codehaus.plexus.classworlds.launcher.Launcher.mainWithExitCode(Launcher.java:409)
	at org.codehaus.plexus.classworlds.launcher.Launcher.main(Launcher.java:352)
Caused by: org.apache.maven.plugin.MojoExecutionException: An Ant BuildException has occured: The following error occurred while executing this line:
<https://hudson.eclipse.org/hudson/job/jubula-nightly/ws/jubula/org.eclipse.jubula.toolkit.generate.interfaces/generateInterfaces.xml>:68: Error running javac compiler
	at org.apache.maven.plugin.antrun.AntRunMojo.execute(AntRunMojo.java:283)
	at org.apache.maven.plugin.DefaultBuildPluginManager.executeMojo(DefaultBuildPluginManager.java:101)
	at org.apache.maven.lifecycle.internal.MojoExecutor.execute(MojoExecutor.java:209)
	... 19 more
Caused by: <https://hudson.eclipse.org/hudson/job/jubula-nightly/ws/jubula/org.eclipse.jubula.toolkit.generate.interfaces/target/antrun/build-main.xml>:4: The following error occurred while executing this line:
<https://hudson.eclipse.org/hudson/job/jubula-nightly/ws/jubula/org.eclipse.jubula.toolkit.generate.interfaces/generateInterfaces.xml>:68: Error running javac compiler
	at org.apache.tools.ant.ProjectHelper.addLocationToBuildException(ProjectHelper.java:497)
	at org.apache.tools.ant.taskdefs.Ant.execute(Ant.java:444)
	at org.apache.tools.ant.UnknownElement.execute(UnknownElement.java:291)
	at sun.reflect.NativeMethodAccessorImpl.invoke0(Native Method)
	at sun.reflect.NativeMethodAccessorImpl.invoke(NativeMethodAccessorImpl.java:39)
	at sun.reflect.DelegatingMethodAccessorImpl.invoke(DelegatingMethodAccessorImpl.java:25)
	at java.lang.reflect.Method.invoke(Method.java:597)
	at org.apache.tools.ant.dispatch.DispatchUtils.execute(DispatchUtils.java:106)
	at org.apache.tools.ant.Task.perform(Task.java:348)
	at org.apache.tools.ant.Target.execute(Target.java:390)
	at org.apache.tools.ant.Target.performTasks(Target.java:411)
	at org.apache.tools.ant.Project.executeSortedTargets(Project.java:1397)
	at org.apache.tools.ant.Project.executeTarget(Project.java:1366)
	at org.apache.maven.plugin.antrun.AntRunMojo.execute(AntRunMojo.java:270)
	... 21 more
Caused by: <https://hudson.eclipse.org/hudson/job/jubula-nightly/ws/jubula/org.eclipse.jubula.toolkit.generate.interfaces/generateInterfaces.xml>:68: Error running javac compiler
	at org.apache.tools.ant.taskdefs.compilers.DefaultCompilerAdapter.executeExternalCompile(DefaultCompilerAdapter.java:514)
	at org.apache.tools.ant.taskdefs.compilers.JavacExternal.execute(JavacExternal.java:61)
	at org.apache.tools.ant.taskdefs.Javac.compile(Javac.java:1097)
	at org.apache.tools.ant.taskdefs.Javac.execute(Javac.java:906)
	at org.apache.tools.ant.UnknownElement.execute(UnknownElement.java:291)
	at sun.reflect.GeneratedMethodAccessor16.invoke(Unknown Source)
	at sun.reflect.DelegatingMethodAccessorImpl.invoke(DelegatingMethodAccessorImpl.java:25)
	at java.lang.reflect.Method.invoke(Method.java:597)
	at org.apache.tools.ant.dispatch.DispatchUtils.execute(DispatchUtils.java:106)
	at org.apache.tools.ant.Task.perform(Task.java:348)
	at org.apache.tools.ant.Target.execute(Target.java:390)
	at org.apache.tools.ant.Target.performTasks(Target.java:411)
	at org.apache.tools.ant.Project.executeSortedTargets(Project.java:1397)
	at org.apache.tools.ant.helper.SingleCheckExecutor.executeTargets(SingleCheckExecutor.java:38)
	at org.apache.tools.ant.Project.executeTargets(Project.java:1249)
	at org.apache.tools.ant.taskdefs.Ant.execute(Ant.java:442)
	... 33 more
Caused by: java.io.IOException: Cannot run program "javac" (in directory "<https://hudson.eclipse.org/hudson/job/jubula-nightly/ws/jubula/org.eclipse.jubula.toolkit.generate.interfaces";)>: java.io.IOException: error=2, No such file or directory
	at java.lang.ProcessBuilder.start(ProcessBuilder.java:460)
	at java.lang.Runtime.exec(Runtime.java:593)
	at org.apache.tools.ant.taskdefs.Execute$Java13CommandLauncher.exec(Execute.java:827)
	at org.apache.tools.ant.taskdefs.Execute.launch(Execute.java:445)
	at org.apache.tools.ant.taskdefs.Execute.execute(Execute.java:459)
	at org.apache.tools.ant.taskdefs.compilers.DefaultCompilerAdapter.executeExternalCompile(DefaultCompilerAdapter.java:511)
	... 48 more
Caused by: java.io.IOException: java.io.IOException: error=2, No such file or directory
	at java.lang.UNIXProcess.<init>(UNIXProcess.java:148)
	at java.lang.ProcessImpl.start(ProcessImpl.java:65)
	at java.lang.ProcessBuilder.start(ProcessBuilder.java:453)
	... 53 more
[ERROR] 
[ERROR] Re-run Maven using the -X switch to enable full debug logging.
[ERROR] 
[ERROR] For more information about the errors and possible solutions, please read the following articles:
[ERROR] [Help 1] http://cwiki.apache.org/confluence/display/MAVEN/MojoExecutionException
[ERROR] 
[ERROR] After correcting the problems, you can resume the build with the command
[ERROR]   mvn <goals> -rf :org.eclipse.jubula.toolkit.generate.interfaces
[DEBUG] Waiting for process to finish
[DEBUG] Result: 1
Archiving artifacts