Skip to main content

[Date Prev][Date Next][Thread Prev][Thread Next][Date Index][Thread Index] [List Home]
[jetty-dev] Build failed in Hudson: jetty #812

See <https://hudson.eclipse.org/hudson/job/jetty/812/changes>

Changes:

[gwilkins] 332517 Improved DefaultServlet debug

[gwilkins] 324505 Implement API login

[gwilkins] 324505 Implement API login

------------------------------------------
[...truncated 4421 lines...]
2011-01-10 08:26:47.482:WARN::/: javax.servlet.ServletException: java.lang.InterruptedException: sleep interrupted
2011-01-10 08:26:47.485:WARN::/: javax.servlet.ServletException: java.lang.InterruptedException: sleep interrupted
2011-01-10 08:26:47.482:WARN::/: javax.servlet.ServletException: java.lang.InterruptedException: sleep interrupted
2011-01-10 08:26:47.484:WARN::/: javax.servlet.ServletException: java.lang.InterruptedException: sleep interrupted
2011-01-10 08:26:47.483:WARN::/: javax.servlet.ServletException: java.lang.InterruptedException: sleep interrupted
2011-01-10 08:26:47.485:WARN::/: javax.servlet.ServletException: java.lang.InterruptedException: sleep interrupted
2011-01-10 08:26:47.485:WARN::/: javax.servlet.ServletException: java.lang.InterruptedException: sleep interrupted
2011-01-10 08:26:47.485:WARN::/: javax.servlet.ServletException: java.lang.InterruptedException: sleep interrupted
2011-01-10 08:26:47.484:WARN::/: javax.servlet.ServletException: java.lang.InterruptedException: sleep interrupted
2011-01-10 08:26:47.486:WARN::/: javax.servlet.ServletException: java.lang.InterruptedException: sleep interrupted
2011-01-10 08:26:47.486:WARN::/: javax.servlet.ServletException: java.lang.InterruptedException: sleep interrupted
2011-01-10 08:26:47.486:WARN::/: javax.servlet.ServletException: java.lang.InterruptedException: sleep interrupted
Tests run: 1, Failures: 0, Errors: 0, Skipped: 0, Time elapsed: 10.536 sec
Running org.eclipse.jetty.client.AsyncCallbackHttpExchangeTest
Tests run: 1, Failures: 0, Errors: 0, Skipped: 0, Time elapsed: 0.01 sec
Running org.eclipse.jetty.client.ExternalKeyStoreAsyncSslHttpExchangeTest
2011-01-10 08:26:47.509:INFO::jetty-7.3.0-SNAPSHOT
2011-01-10 08:26:47.511:INFO::Started SslSocketConnector@0.0.0.0:52394
2011-01-10 08:26:48.227:INFO::jetty-7.3.0-SNAPSHOT
2011-01-10 08:26:48.229:INFO::Started SslSocketConnector@0.0.0.0:58270
2011-01-10 08:26:49.035:INFO::jetty-7.3.0-SNAPSHOT
2011-01-10 08:26:49.037:INFO::Started SslSocketConnector@0.0.0.0:43241
2011-01-10 08:26:49.691:INFO::jetty-7.3.0-SNAPSHOT
2011-01-10 08:26:49.694:INFO::Started SslSocketConnector@0.0.0.0:36110
2011-01-10 08:26:50.923:INFO::jetty-7.3.0-SNAPSHOT
2011-01-10 08:26:50.926:INFO::Started SslSocketConnector@0.0.0.0:53419
2011-01-10 08:26:51.555:INFO::jetty-7.3.0-SNAPSHOT
2011-01-10 08:26:51.557:INFO::Started SslSocketConnector@0.0.0.0:51855
2011-01-10 08:26:52.683:INFO::jetty-7.3.0-SNAPSHOT
2011-01-10 08:26:52.685:INFO::Started SslSocketConnector@0.0.0.0:39096
2011-01-10 08:26:53.483:INFO::jetty-7.3.0-SNAPSHOT
2011-01-10 08:26:53.485:INFO::Started SslSocketConnector@0.0.0.0:34528
2011-01-10 08:26:54.443:INFO::jetty-7.3.0-SNAPSHOT
2011-01-10 08:26:54.445:INFO::Started SslSocketConnector@0.0.0.0:38785
Tests run: 9, Failures: 0, Errors: 0, Skipped: 0, Time elapsed: 7.569 sec
Running org.eclipse.jetty.client.WebdavListenerTest
Tests run: 1, Failures: 0, Errors: 0, Skipped: 0, Time elapsed: 0.063 sec
Running org.eclipse.jetty.client.SslSecurityListenerTest
2011-01-10 08:26:55.141:INFO::jetty-7.3.0-SNAPSHOT
2011-01-10 08:26:55.144:INFO::Started SslSocketConnector@0.0.0.0:60876
Tests run: 1, Failures: 0, Errors: 0, Skipped: 0, Time elapsed: 2.14 sec
Running org.eclipse.jetty.client.SecurityListenerTest
2011-01-10 08:26:57.282:INFO::jetty-7.3.0-SNAPSHOT
2011-01-10 08:26:57.284:INFO::Started SelectChannelConnector@0.0.0.0:50037
2011-01-10 08:26:57.291:INFO::Graceful shutdown SelectChannelConnector@0.0.0.0:50037
Tests run: 1, Failures: 0, Errors: 0, Skipped: 0, Time elapsed: 0.636 sec
Running org.eclipse.jetty.client.ContentExchangeTest
2011-01-10 08:26:57.918:INFO::jetty-7.3.0-SNAPSHOT
2011-01-10 08:26:57.918:INFO::started o.e.j.s.ServletContextHandler{/,<https://hudson.eclipse.org/hudson/job/jetty/ws/jettytrunk/jetty-client/target/test-output/docroot/}>
2011-01-10 08:26:57.920:INFO::Started SelectChannelConnector@0.0.0.0:56730
2011-01-10 08:26:58.042:INFO::stopped o.e.j.s.ServletContextHandler{/,<https://hudson.eclipse.org/hudson/job/jetty/ws/jettytrunk/jetty-client/target/test-output/docroot/}>
2011-01-10 08:26:58.044:INFO::jetty-7.3.0-SNAPSHOT
2011-01-10 08:26:58.044:INFO::started o.e.j.s.ServletContextHandler{/,<https://hudson.eclipse.org/hudson/job/jetty/ws/jettytrunk/jetty-client/target/test-output/docroot/}>
2011-01-10 08:26:58.045:INFO::Started SelectChannelConnector@0.0.0.0:53093
2011-01-10 08:26:58.170:INFO::stopped o.e.j.s.ServletContextHandler{/,<https://hudson.eclipse.org/hudson/job/jetty/ws/jettytrunk/jetty-client/target/test-output/docroot/}>
2011-01-10 08:26:58.172:INFO::jetty-7.3.0-SNAPSHOT
2011-01-10 08:26:58.172:INFO::started o.e.j.s.ServletContextHandler{/,<https://hudson.eclipse.org/hudson/job/jetty/ws/jettytrunk/jetty-client/target/test-output/docroot/}>
2011-01-10 08:26:58.173:INFO::Started SelectChannelConnector@0.0.0.0:56223
2011-01-10 08:26:58.294:INFO::stopped o.e.j.s.ServletContextHandler{/,<https://hudson.eclipse.org/hudson/job/jetty/ws/jettytrunk/jetty-client/target/test-output/docroot/}>
2011-01-10 08:26:58.296:INFO::jetty-7.3.0-SNAPSHOT
2011-01-10 08:26:58.296:INFO::started o.e.j.s.ServletContextHandler{/,<https://hudson.eclipse.org/hudson/job/jetty/ws/jettytrunk/jetty-client/target/test-output/docroot/}>
2011-01-10 08:26:58.297:INFO::Started SelectChannelConnector@0.0.0.0:39630
2011-01-10 08:26:58.418:INFO::stopped o.e.j.s.ServletContextHandler{/,<https://hudson.eclipse.org/hudson/job/jetty/ws/jettytrunk/jetty-client/target/test-output/docroot/}>
Tests run: 4, Failures: 0, Errors: 0, Skipped: 0, Time elapsed: 0.504 sec

Results :

Tests run: 154, Failures: 0, Errors: 0, Skipped: 0

[INFO] 
[INFO] --- maven-jar-plugin:2.3:jar (default-jar) @ jetty-client ---
[INFO] Building jar: <https://hudson.eclipse.org/hudson/job/jetty/ws/jettytrunk/jetty-client/target/jetty-client-7.3.0-SNAPSHOT.jar>
[INFO] 
[INFO] --- maven-install-plugin:2.3.1:install (default-install) @ jetty-client ---
[INFO] Installing <https://hudson.eclipse.org/hudson/job/jetty/ws/jettytrunk/jetty-client/target/jetty-client-7.3.0-SNAPSHOT.jar> to /opt/users/hudsonbuild/.m2/repository/org/eclipse/jetty/jetty-client/7.3.0-SNAPSHOT/jetty-client-7.3.0-SNAPSHOT.jar
[INFO] Installing <https://hudson.eclipse.org/hudson/job/jetty/ws/jettytrunk/jetty-client/pom.xml> to /opt/users/hudsonbuild/.m2/repository/org/eclipse/jetty/jetty-client/7.3.0-SNAPSHOT/jetty-client-7.3.0-SNAPSHOT.pom
[INFO] Installing <https://hudson.eclipse.org/hudson/job/jetty/ws/jettytrunk/jetty-client/target/jetty-client-7.3.0-SNAPSHOT-sources.jar> to /opt/users/hudsonbuild/.m2/repository/org/eclipse/jetty/jetty-client/7.3.0-SNAPSHOT/jetty-client-7.3.0-SNAPSHOT-sources.jar
[INFO]                                                                         
[INFO] ------------------------------------------------------------------------
[INFO] Building Jetty :: XML utilities 7.3.0-SNAPSHOT
[INFO] ------------------------------------------------------------------------
[INFO] 
[INFO] --- maven-clean-plugin:2.4.1:clean (default-clean) @ jetty-xml ---
[INFO] 
[INFO] --- build-helper-maven-plugin:1.5:parse-version (set-osgi-version) @ jetty-xml ---
[INFO] 
[INFO] --- maven-enforcer-plugin:1.0-alpha-4:enforce (enforce-java) @ jetty-xml ---
[INFO] 
[INFO] --- maven-remote-resources-plugin:1.1:process (default) @ jetty-xml ---
[INFO] 
[INFO] --- maven-resources-plugin:2.4.2:resources (default-resources) @ jetty-xml ---
[INFO] Using 'UTF-8' encoding to copy filtered resources.
[INFO] Copying 1 resource
[INFO] Copying 1 resource
[INFO] 
[INFO] --- maven-compiler-plugin:2.3:compile (default-compile) @ jetty-xml ---
[INFO] Compiling 2 source files to <https://hudson.eclipse.org/hudson/job/jetty/ws/jettytrunk/jetty-xml/target/classes>
[INFO] 
[INFO] >>> maven-source-plugin:2.1.1:jar (attach-sources) @ jetty-xml >>>
[INFO] 
[INFO] --- build-helper-maven-plugin:1.5:parse-version (set-osgi-version) @ jetty-xml ---
[INFO] 
[INFO] --- maven-enforcer-plugin:1.0-alpha-4:enforce (enforce-java) @ jetty-xml ---
[INFO] 
[INFO] <<< maven-source-plugin:2.1.1:jar (attach-sources) @ jetty-xml <<<
[INFO] 
[INFO] --- maven-source-plugin:2.1.1:jar (attach-sources) @ jetty-xml ---
[INFO] Building jar: <https://hudson.eclipse.org/hudson/job/jetty/ws/jettytrunk/jetty-xml/target/jetty-xml-7.3.0-SNAPSHOT-sources.jar>
[INFO] 
[INFO] --- maven-bundle-plugin:2.0.0:manifest (default) @ jetty-xml ---
[WARNING] Warning in manifest for org.eclipse.jetty:jetty-xml:jar:7.3.0-SNAPSHOT : Superfluous export-package instructions: [org.eclipse.jetty, org, org.eclipse]
[INFO] 
[INFO] --- maven-resources-plugin:2.4.2:testResources (default-testResources) @ jetty-xml ---
[INFO] Using 'UTF-8' encoding to copy filtered resources.
[INFO] Copying 1 resource
[INFO] Copying 1 resource
[INFO] 
[INFO] --- maven-compiler-plugin:2.3:testCompile (default-testCompile) @ jetty-xml ---
[INFO] Compiling 2 source files to <https://hudson.eclipse.org/hudson/job/jetty/ws/jettytrunk/jetty-xml/target/test-classes>
[INFO] 
[INFO] --- maven-surefire-plugin:2.4.2:test (default-test) @ jetty-xml ---
[INFO] Surefire report directory: <https://hudson.eclipse.org/hudson/job/jetty/ws/jettytrunk/jetty-xml/target/surefire-reports>

-------------------------------------------------------
 T E S T S
-------------------------------------------------------
Running org.eclipse.jetty.xml.XmlConfigurationTest
Tests run: 2, Failures: 0, Errors: 0, Skipped: 0, Time elapsed: 0.152 sec
Running org.eclipse.jetty.xml.TestConfiguration
Tests run: 1, Failures: 0, Errors: 0, Skipped: 1, Time elapsed: 0.009 sec

Results :

Tests run: 3, Failures: 0, Errors: 0, Skipped: 1

[INFO] 
[INFO] --- maven-jar-plugin:2.3:jar (default-jar) @ jetty-xml ---
[INFO] Building jar: <https://hudson.eclipse.org/hudson/job/jetty/ws/jettytrunk/jetty-xml/target/jetty-xml-7.3.0-SNAPSHOT.jar>
[INFO] 
[INFO] --- maven-install-plugin:2.3.1:install (default-install) @ jetty-xml ---
[INFO] Installing <https://hudson.eclipse.org/hudson/job/jetty/ws/jettytrunk/jetty-xml/target/jetty-xml-7.3.0-SNAPSHOT.jar> to /opt/users/hudsonbuild/.m2/repository/org/eclipse/jetty/jetty-xml/7.3.0-SNAPSHOT/jetty-xml-7.3.0-SNAPSHOT.jar
[INFO] Installing <https://hudson.eclipse.org/hudson/job/jetty/ws/jettytrunk/jetty-xml/pom.xml> to /opt/users/hudsonbuild/.m2/repository/org/eclipse/jetty/jetty-xml/7.3.0-SNAPSHOT/jetty-xml-7.3.0-SNAPSHOT.pom
[INFO] Installing <https://hudson.eclipse.org/hudson/job/jetty/ws/jettytrunk/jetty-xml/target/jetty-xml-7.3.0-SNAPSHOT-sources.jar> to /opt/users/hudsonbuild/.m2/repository/org/eclipse/jetty/jetty-xml/7.3.0-SNAPSHOT/jetty-xml-7.3.0-SNAPSHOT-sources.jar
[INFO]                                                                         
[INFO] ------------------------------------------------------------------------
[INFO] Building Jetty :: JASPI Security 7.3.0-SNAPSHOT
[INFO] ------------------------------------------------------------------------
[INFO] 
[INFO] --- maven-clean-plugin:2.4.1:clean (default-clean) @ jetty-jaspi ---
[INFO] 
[INFO] --- build-helper-maven-plugin:1.5:parse-version (set-osgi-version) @ jetty-jaspi ---
[INFO] 
[INFO] --- maven-enforcer-plugin:1.0-alpha-4:enforce (enforce-java) @ jetty-jaspi ---
[INFO] 
[INFO] --- maven-remote-resources-plugin:1.1:process (default) @ jetty-jaspi ---
[INFO] 
[INFO] --- maven-resources-plugin:2.4.2:resources (default-resources) @ jetty-jaspi ---
[INFO] Using 'UTF-8' encoding to copy filtered resources.
[INFO] skip non existing resourceDirectory <https://hudson.eclipse.org/hudson/job/jetty/ws/jettytrunk/jetty-jaspi/src/main/resources>
[INFO] Copying 1 resource
[INFO] 
[INFO] --- maven-compiler-plugin:2.3:compile (default-compile) @ jetty-jaspi ---
[INFO] Compiling 12 source files to <https://hudson.eclipse.org/hudson/job/jetty/ws/jettytrunk/jetty-jaspi/target/classes>
[INFO] -------------------------------------------------------------
[ERROR] COMPILATION ERROR : 
[INFO] -------------------------------------------------------------
[ERROR] <https://hudson.eclipse.org/hudson/job/jetty/ws/jettytrunk/jetty-jaspi/src/main/java/org/eclipse/jetty/security/jaspi/JaspiAuthenticator.java>:[66,23] cannot find symbol
symbol  : constructor DeferredAuthentication(org.eclipse.jetty.security.jaspi.JaspiAuthenticator)
location: class org.eclipse.jetty.security.authentication.DeferredAuthentication

[INFO] 1error
[INFO] -------------------------------------------------------------
[INFO] ------------------------------------------------------------------------
[INFO] Reactor Summary:
[INFO] 
[INFO] Jetty :: Project .................................. SUCCESS [1.548s]
[INFO] Jetty :: Utilities ................................ SUCCESS [38.783s]
[INFO] Jetty :: JMX Management ........................... SUCCESS [4.025s]
[INFO] Jetty :: IO Utility ............................... SUCCESS [8.054s]
[INFO] Jetty :: Http Utility ............................. SUCCESS [7.063s]
[INFO] Jetty :: Continuation ............................. SUCCESS [4.925s]
[INFO] Jetty :: Server Core .............................. SUCCESS [2:41.574s]
[INFO] Jetty :: Websocket ................................ SUCCESS [10.841s]
[INFO] Jetty :: Security ................................. SUCCESS [14.417s]
[INFO] Jetty :: Servlet Handling ......................... SUCCESS [9.339s]
[INFO] Jetty :: Asynchronous HTTP Client ................. SUCCESS [1:19.185s]
[INFO] Jetty :: XML utilities ............................ SUCCESS [4.682s]
[INFO] Jetty :: JASPI Security ........................... FAILURE [2.238s]
[INFO] Jetty :: Webapp Application Support ............... SKIPPED
[INFO] Test :: Jetty Servlet Tester ...................... SKIPPED
[INFO] Jetty :: Utility Servlets and Filters ............. SKIPPED
[INFO] Jetty :: Jetty JSP Additions ...................... SKIPPED
[INFO] Jetty :: Deployers ................................ SKIPPED
[INFO] Jetty :: AJP ...................................... SKIPPED
[INFO] Jetty :: JNDI Naming .............................. SKIPPED
[INFO] Jetty :: Plus ..................................... SKIPPED
[INFO] Jetty :: Servlet Annotations ...................... SKIPPED
[INFO] Jetty :: Rewrite Handler .......................... SKIPPED
[INFO] Jetty :: Policy Tool .............................. SKIPPED
[INFO] Jetty :: Start .................................... SKIPPED
[INFO] Jetty :: OSGi ..................................... SKIPPED
[INFO] Jetty :: OSGi :: Boot ............................. SKIPPED
[INFO] Jetty :: OSGi :: Boot JSP ......................... SKIPPED
[INFO] Jetty :: OSGi :: Boot Logback ..................... SKIPPED
[INFO] Jetty :: OSGi :: Boot :: Warurl ................... SKIPPED
[INFO] Jetty :: OSGi :: HttpService ...................... SKIPPED
[INFO] Test :: Continuation .............................. SKIPPED
[INFO] Test :: Continuation - (Jetty 6) .................. SKIPPED
[INFO] Test :: Jetty Test Webapp ......................... SKIPPED
[INFO] Jetty :: Aggregate Project ........................ SKIPPED
[INFO] Jetty :: Aggregate :: HTTP Server ................. SKIPPED
[INFO] Jetty :: Aggregate :: HTTP Client ................. SKIPPED
[INFO] Jetty :: Aggregate :: Servlet Server .............. SKIPPED
[INFO] Jetty :: Aggregate :: WebApp Server ............... SKIPPED
[INFO] Jetty :: Aggregate :: Plus Server ................. SKIPPED
[INFO] Jetty :: Aggregate :: All Server .................. SKIPPED
[INFO] Jetty :: Aggregate :: All core Jetty .............. SKIPPED
[INFO] Example :: Jetty Embedded ......................... SKIPPED
[INFO] Jetty Tests :: Parent ............................. SKIPPED
[INFO] Jetty Tests :: WebApps :: Parent .................. SKIPPED
[INFO] Jetty Tests :: WebApp :: RFC2616 .................. SKIPPED
[INFO] Jetty Tests :: Integrations ....................... SKIPPED
[INFO] Jetty Tests :: Sessions :: Parent ................. SKIPPED
[INFO] Jetty Tests :: Sessions :: Common ................. SKIPPED
[INFO] Jetty Tests :: Sessions :: Hash ................... SKIPPED
[INFO] Jetty Tests :: Sessions :: JDBC ................... SKIPPED
[INFO] Jetty Tests :: Login Service ...................... SKIPPED
[INFO] Jetty :: Distribution Assemblies .................. SKIPPED
[INFO] ------------------------------------------------------------------------
[INFO] BUILD FAILURE
[INFO] ------------------------------------------------------------------------
[INFO] Total time: 5:48.481s
[INFO] Finished at: Mon Jan 10 08:27:07 EST 2011
[INFO] Final Memory: 49M/1060M
[INFO] ------------------------------------------------------------------------
[ERROR] Failed to execute goal org.apache.maven.plugins:maven-compiler-plugin:2.3:compile (default-compile) on project jetty-jaspi: Compilation failure
[ERROR] <https://hudson.eclipse.org/hudson/job/jetty/ws/jettytrunk/jetty-jaspi/src/main/java/org/eclipse/jetty/security/jaspi/JaspiAuthenticator.java>:[66,23] cannot find symbol
[ERROR] symbol  : constructor DeferredAuthentication(org.eclipse.jetty.security.jaspi.JaspiAuthenticator)
[ERROR] location: class org.eclipse.jetty.security.authentication.DeferredAuthentication
[ERROR] -> [Help 1]
[ERROR] 
[ERROR] To see the full stack trace of the errors, re-run Maven with the -e switch.
[ERROR] Re-run Maven using the -X switch to enable full debug logging.
[ERROR] 
[ERROR] For more information about the errors and possible solutions, please read the following articles:
[ERROR] [Help 1] http://cwiki.apache.org/confluence/display/MAVEN/MojoFailureException
[ERROR] 
[ERROR] After correcting the problems, you can resume the build with the command
[ERROR]   mvn <goals> -rf :jetty-jaspi



Back to the top