[Date Prev][Date Next][Thread Prev][Thread Next][Date Index][Thread Index] [List Home]
[jetty-build] Build failed in Hudson: jetty #1777

See <https://hudson.eclipse.org/hudson/job/jetty/1777/changes>

Changes:

[Joakim Erdfelt] Bug 370120 - jvm arguments added via start.ini and --exec are missing spaces

[Greg Wilkins] 369988: Add DoSFilter.RateTracker.isRateExceeded unit test

------------------------------------------
[...truncated 495 lines...]
[INFO] 
[INFO] --- maven-clean-plugin:2.4.1:clean (default-clean) @ test-webapps-parent ---
[INFO] Deleting /opt/public/jobs/jetty/workspace/tests/test-webapps/target
[INFO] 
[INFO] --- build-helper-maven-plugin:1.5:parse-version (set-osgi-version) @ test-webapps-parent ---
[INFO] 
[INFO] --- maven-enforcer-plugin:1.0:enforce (enforce-java) @ test-webapps-parent ---
[INFO] 
[INFO] --- maven-remote-resources-plugin:1.2:process (default) @ test-webapps-parent ---
[INFO] 
[INFO] --- jetty-version-maven-plugin:1.0.7:attach-version-text (attach-version) @ test-webapps-parent ---
[INFO] 
[INFO] >>> maven-pmd-plugin:2.5:check (named-logging-enforcement) @ test-webapps-parent >>>
[INFO] 
[INFO] --- maven-pmd-plugin:2.5:pmd (pmd) @ test-webapps-parent ---
[INFO] 
[INFO] <<< maven-pmd-plugin:2.5:check (named-logging-enforcement) @ test-webapps-parent <<<
[INFO] 
[INFO] --- maven-pmd-plugin:2.5:check (named-logging-enforcement) @ test-webapps-parent ---
[INFO] 
[INFO] >>> maven-source-plugin:2.1.2:jar (attach-sources) @ test-webapps-parent >>>
[INFO] 
[INFO] --- build-helper-maven-plugin:1.5:parse-version (set-osgi-version) @ test-webapps-parent ---
[INFO] 
[INFO] --- maven-enforcer-plugin:1.0:enforce (enforce-java) @ test-webapps-parent ---
[INFO] 
[INFO] <<< maven-source-plugin:2.1.2:jar (attach-sources) @ test-webapps-parent <<<
[INFO] 
[INFO] --- maven-source-plugin:2.1.2:jar (attach-sources) @ test-webapps-parent ---
[INFO] 
[INFO] --- maven-site-plugin:3.0-beta-3:attach-descriptor (attach-descriptor) @ test-webapps-parent ---
[INFO] 
[INFO] --- maven-install-plugin:2.3.1:install (default-install) @ test-webapps-parent ---
[INFO] Installing /opt/public/jobs/jetty/workspace/tests/test-webapps/pom.xml to /opt/users/hudsonbuild/.m2/repository/org/eclipse/jetty/tests/test-webapps-parent/7.6.1-SNAPSHOT/test-webapps-parent-7.6.1-SNAPSHOT.pom
[INFO]                                                                         
[INFO] ------------------------------------------------------------------------
[INFO] Skipping Jetty Tests :: WebApp :: RFC2616
[INFO] This project has been banned from the build due to previous failures.
[INFO] ------------------------------------------------------------------------
[INFO]                                                                         
[INFO] ------------------------------------------------------------------------
[INFO] Skipping Jetty Tests :: Integrations
[INFO] This project has been banned from the build due to previous failures.
[INFO] ------------------------------------------------------------------------
[INFO]                                                                         
[INFO] ------------------------------------------------------------------------
[INFO] Skipping Jetty Tests :: Sessions :: Hash
[INFO] This project has been banned from the build due to previous failures.
[INFO] ------------------------------------------------------------------------
[INFO]                                                                         
[INFO] ------------------------------------------------------------------------
[INFO] Skipping Jetty Tests :: Sessions :: JDBC
[INFO] This project has been banned from the build due to previous failures.
[INFO] ------------------------------------------------------------------------
[INFO]                                                                         
[INFO] ------------------------------------------------------------------------
[INFO] Skipping Jetty Tests :: Login Service
[INFO] This project has been banned from the build due to previous failures.
[INFO] ------------------------------------------------------------------------
[INFO]                                                                         
[INFO] ------------------------------------------------------------------------
[INFO] Skipping Jetty :: Aggregate :: HTTP Server
[INFO] This project has been banned from the build due to previous failures.
[INFO] ------------------------------------------------------------------------
[INFO]                                                                         
[INFO] ------------------------------------------------------------------------
[INFO] Skipping Jetty :: Aggregate :: HTTP Client
[INFO] This project has been banned from the build due to previous failures.
[INFO] ------------------------------------------------------------------------
[INFO]                                                                         
[INFO] ------------------------------------------------------------------------
[INFO] Skipping Jetty :: Aggregate :: Servlet Server
[INFO] This project has been banned from the build due to previous failures.
[INFO] ------------------------------------------------------------------------
[INFO]                                                                         
[INFO] ------------------------------------------------------------------------
[INFO] Skipping Jetty :: Aggregate :: WebApp Server
[INFO] This project has been banned from the build due to previous failures.
[INFO] ------------------------------------------------------------------------
[INFO]                                                                         
[INFO] ------------------------------------------------------------------------
[INFO] Skipping Jetty :: Aggregate :: Websocket
[INFO] This project has been banned from the build due to previous failures.
[INFO] ------------------------------------------------------------------------
[INFO]                                                                         
[INFO] ------------------------------------------------------------------------
[INFO] Skipping Jetty :: Aggregate :: Plus Server
[INFO] This project has been banned from the build due to previous failures.
[INFO] ------------------------------------------------------------------------
[INFO]                                                                         
[INFO] ------------------------------------------------------------------------
[INFO] Skipping Jetty :: Aggregate :: All Server
[INFO] This project has been banned from the build due to previous failures.
[INFO] ------------------------------------------------------------------------
[INFO]                                                                         
[INFO] ------------------------------------------------------------------------
[INFO] Building Jetty :: OSGi 7.6.1-SNAPSHOT
[INFO] ------------------------------------------------------------------------
[INFO] 
[INFO] --- maven-clean-plugin:2.4.1:clean (default-clean) @ jetty-osgi-project ---
[INFO] Deleting /opt/public/jobs/jetty/workspace/jetty-osgi/target
[INFO] 
[INFO] --- build-helper-maven-plugin:1.5:parse-version (set-osgi-version) @ jetty-osgi-project ---
[INFO] 
[INFO] --- maven-enforcer-plugin:1.0:enforce (enforce-java) @ jetty-osgi-project ---
[INFO] 
[INFO] --- maven-remote-resources-plugin:1.2:process (default) @ jetty-osgi-project ---
[INFO] 
[INFO] --- jetty-version-maven-plugin:1.0.7:attach-version-text (attach-version) @ jetty-osgi-project ---
[INFO] 
[INFO] >>> maven-pmd-plugin:2.5:check (named-logging-enforcement) @ jetty-osgi-project >>>
[INFO] 
[INFO] --- maven-pmd-plugin:2.5:pmd (pmd) @ jetty-osgi-project ---
[INFO] 
[INFO] <<< maven-pmd-plugin:2.5:check (named-logging-enforcement) @ jetty-osgi-project <<<
[INFO] 
[INFO] --- maven-pmd-plugin:2.5:check (named-logging-enforcement) @ jetty-osgi-project ---
[INFO] 
[INFO] >>> maven-source-plugin:2.1.2:jar (attach-sources) @ jetty-osgi-project >>>
[INFO] 
[INFO] --- build-helper-maven-plugin:1.5:parse-version (set-osgi-version) @ jetty-osgi-project ---
[INFO] 
[INFO] --- maven-enforcer-plugin:1.0:enforce (enforce-java) @ jetty-osgi-project ---
[INFO] 
[INFO] <<< maven-source-plugin:2.1.2:jar (attach-sources) @ jetty-osgi-project <<<
[INFO] 
[INFO] --- maven-source-plugin:2.1.2:jar (attach-sources) @ jetty-osgi-project ---
[INFO] 
[INFO] --- maven-site-plugin:3.0-beta-3:attach-descriptor (attach-descriptor) @ jetty-osgi-project ---
[INFO] 
[INFO] --- maven-install-plugin:2.3.1:install (default-install) @ jetty-osgi-project ---
[INFO] Installing /opt/public/jobs/jetty/workspace/jetty-osgi/pom.xml to /opt/users/hudsonbuild/.m2/repository/org/eclipse/jetty/osgi/jetty-osgi-project/7.6.1-SNAPSHOT/jetty-osgi-project-7.6.1-SNAPSHOT.pom
[INFO]                                                                         
[INFO] ------------------------------------------------------------------------
[INFO] Skipping Jetty :: OSGi :: Boot
[INFO] This project has been banned from the build due to previous failures.
[INFO] ------------------------------------------------------------------------
[INFO]                                                                         
[INFO] ------------------------------------------------------------------------
[INFO] Skipping Jetty :: OSGi :: Boot JSP
[INFO] This project has been banned from the build due to previous failures.
[INFO] ------------------------------------------------------------------------
[INFO]                                                                         
[INFO] ------------------------------------------------------------------------
[INFO] Skipping Jetty :: OSGi :: Boot Logback
[INFO] This project has been banned from the build due to previous failures.
[INFO] ------------------------------------------------------------------------
[INFO]                                                                         
[INFO] ------------------------------------------------------------------------
[INFO] Skipping Jetty :: OSGi :: Boot :: Warurl
[INFO] This project has been banned from the build due to previous failures.
[INFO] ------------------------------------------------------------------------
[INFO]                                                                         
[INFO] ------------------------------------------------------------------------
[INFO] Skipping Jetty :: OSGi :: HttpService
[INFO] This project has been banned from the build due to previous failures.
[INFO] ------------------------------------------------------------------------
[INFO]                                                                         
[INFO] ------------------------------------------------------------------------
[INFO] Skipping Jetty :: OSGi :: Example Equinox Tools
[INFO] This project has been banned from the build due to previous failures.
[INFO] ------------------------------------------------------------------------
[INFO]                                                                         
[INFO] ------------------------------------------------------------------------
[INFO] Skipping Jetty :: OSGi :: Test
[INFO] This project has been banned from the build due to previous failures.
[INFO] ------------------------------------------------------------------------
[INFO] ------------------------------------------------------------------------
[INFO] Reactor Summary:
[INFO] 
[INFO] Jetty :: Project .................................. SUCCESS [2.653s]
[INFO] Jetty :: Utilities ................................ FAILURE [0.070s]
[INFO] Jetty :: JMX Management ........................... SKIPPED
[INFO] Jetty :: IO Utility ............................... SKIPPED
[INFO] Jetty :: Http Utility ............................. SKIPPED
[INFO] Jetty :: Continuation ............................. SUCCESS [7.792s]
[INFO] Jetty :: Server Core .............................. SKIPPED
[INFO] Jetty :: Security ................................. SKIPPED
[INFO] Jetty :: Servlet Handling ......................... SKIPPED
[INFO] Jetty :: Websocket ................................ SKIPPED
[INFO] Jetty :: Asynchronous HTTP Client ................. SKIPPED
[INFO] Jetty :: XML utilities ............................ SKIPPED
[INFO] Jetty :: JASPI Security ........................... SKIPPED
[INFO] Jetty :: Webapp Application Support ............... SKIPPED
[INFO] Test :: Jetty Servlet Tester ...................... SKIPPED
[INFO] Jetty :: Utility Servlets and Filters ............. SKIPPED
[INFO] Jetty :: Deployers ................................ SKIPPED
[INFO] Jetty :: AJP ...................................... SKIPPED
[INFO] Jetty :: JNDI Naming .............................. SKIPPED
[INFO] Jetty :: Plus ..................................... SKIPPED
[INFO] Jetty :: Servlet Annotations ...................... SKIPPED
[INFO] Jetty :: Rewrite Handler .......................... SKIPPED
[INFO] Jetty :: Policy Tool .............................. SKIPPED
[INFO] Jetty :: Monitoring ............................... SKIPPED
[INFO] Jetty :: Start .................................... FAILURE [0.007s]
[INFO] Jetty :: Nested ................................... SKIPPED
[INFO] Jetty :: Overlay Deployer ......................... SKIPPED
[INFO] Jetty Tests :: Parent ............................. SUCCESS [0.154s]
[INFO] Jetty Tests :: Sessions :: Parent ................. SUCCESS [0.122s]
[INFO] Jetty Tests :: Sessions :: Common ................. SKIPPED
[INFO] Jetty :: NoSQL Session Managers ................... SKIPPED
[INFO] Jetty :: Http Service Provider Interface .......... SKIPPED
[INFO] Test :: Jetty Test Webapp ......................... SKIPPED
[INFO] Jetty :: Aggregate Project ........................ SUCCESS [0.122s]
[INFO] Jetty :: Aggregate :: All core Jetty .............. SKIPPED
[INFO] Jetty :: Distribution Assemblies .................. SKIPPED
[INFO] Test :: Continuation .............................. SKIPPED
[INFO] Jetty :: Nested Test .............................. SKIPPED
[INFO] Example :: Jetty Embedded ......................... SKIPPED
[INFO] Jetty Tests :: WebApps :: Parent .................. SUCCESS [0.126s]
[INFO] Jetty Tests :: WebApp :: RFC2616 .................. SKIPPED
[INFO] Jetty Tests :: Integrations ....................... SKIPPED
[INFO] Jetty Tests :: Sessions :: Hash ................... SKIPPED
[INFO] Jetty Tests :: Sessions :: JDBC ................... SKIPPED
[INFO] Jetty Tests :: Login Service ...................... SKIPPED
[INFO] Jetty :: Aggregate :: HTTP Server ................. SKIPPED
[INFO] Jetty :: Aggregate :: HTTP Client ................. SKIPPED
[INFO] Jetty :: Aggregate :: Servlet Server .............. SKIPPED
[INFO] Jetty :: Aggregate :: WebApp Server ............... SKIPPED
[INFO] Jetty :: Aggregate :: Websocket ................... SKIPPED
[INFO] Jetty :: Aggregate :: Plus Server ................. SKIPPED
[INFO] Jetty :: Aggregate :: All Server .................. SKIPPED
[INFO] Jetty :: OSGi ..................................... SUCCESS [0.119s]
[INFO] Jetty :: OSGi :: Boot ............................. SKIPPED
[INFO] Jetty :: OSGi :: Boot JSP ......................... SKIPPED
[INFO] Jetty :: OSGi :: Boot Logback ..................... SKIPPED
[INFO] Jetty :: OSGi :: Boot :: Warurl ................... SKIPPED
[INFO] Jetty :: OSGi :: HttpService ...................... SKIPPED
[INFO] Jetty :: OSGi :: Example Equinox Tools ............ SKIPPED
[INFO] Jetty :: OSGi :: Test ............................. SKIPPED
[INFO] ------------------------------------------------------------------------
[INFO] BUILD FAILURE
[INFO] ------------------------------------------------------------------------
[INFO] Total time: 13.556s
[INFO] Finished at: Mon Jan 30 19:12:28 EST 2012
[INFO] Final Memory: 58M/377M
[INFO] ------------------------------------------------------------------------
[ERROR] Failed to execute goal on project jetty-util: Could not resolve dependencies for project org.eclipse.jetty:jetty-util:jar:7.6.1-SNAPSHOT: Failure to find org.eclipse.jetty.toolchain:jetty-test-helper:jar:1.6.1 in http://repo1.maven.org/maven2 was cached in the local repository, resolution will not be reattempted until the update interval of central has elapsed or updates are forced -> [Help 1]
[ERROR] Failed to execute goal on project jetty-start: Could not resolve dependencies for project org.eclipse.jetty:jetty-start:jar:7.6.1-SNAPSHOT: Failure to find org.eclipse.jetty.toolchain:jetty-test-helper:jar:1.6.1 in http://repo1.maven.org/maven2 was cached in the local repository, resolution will not be reattempted until the update interval of central has elapsed or updates are forced -> [Help 1]
[ERROR] 
[ERROR] To see the full stack trace of the errors, re-run Maven with the -e switch.
[ERROR] Re-run Maven using the -X switch to enable full debug logging.
[ERROR] 
[ERROR] For more information about the errors and possible solutions, please read the following articles:
[ERROR] [Help 1] http://cwiki.apache.org/confluence/display/MAVEN/DependencyResolutionException
[ERROR] 
[ERROR] After correcting the problems, you can resume the build with the command
[ERROR]   mvn <goals> -rf :jetty-util
Recording test results