[Date Prev][Date Next][Thread Prev][Thread Next][Date Index][Thread Index] [List Home]
[jetty-build] Build failed in Hudson: jetty #1772

See <https://hudson.eclipse.org/hudson/job/jetty/1772/>

------------------------------------------
Started by user jmcconnell
Building remotely on hudson-slave5(IA64)
Checkout:jetty / <https://hudson.eclipse.org/hudson/job/jetty/ws/> - hudson.remoting.Channel@6036f74f:hudson-slave5(IA64)
Using strategy: Default
Last Built Revision: Revision cacc5aefa214fc3eae05eb93d964863bb71198a0 (origin/master)
Checkout:jetty / <https://hudson.eclipse.org/hudson/job/jetty/ws/> - hudson.remoting.LocalChannel@d7a272
Fetching changes from the remote Git repository
Fetching upstream changes from git://git.eclipse.org/gitroot/jetty/org.eclipse.jetty.project.git
Commencing build of Revision cacc5aefa214fc3eae05eb93d964863bb71198a0 (origin/master)
Checking out Revision cacc5aefa214fc3eae05eb93d964863bb71198a0 (origin/master)
[jetty] $ /shared/common/apache-maven-3.0.3/bin/mvn -Dmaven.test.error.ignore=true -Dmaven.test.failure.ignore=true -fae clean install
[WARN ] -XX:MaxPermSize=384m is not a valid VM option. Ignoring
[INFO] Scanning for projects...
Downloading: http://repo1.maven.org/maven2/org/eclipse/jetty/jetty-parent/19/jetty-parent-19.pom

[ERROR] The build could not read 1 project -> [Help 1]
[ERROR]   
[ERROR]   The project org.eclipse.jetty:jetty-project:7.6.1-SNAPSHOT (<https://hudson.eclipse.org/hudson/job/jetty/ws/pom.xml)> has 1 error
[ERROR]     Non-resolvable parent POM: Could not transfer artifact org.eclipse.jetty:jetty-parent:pom:19 from/to central (http://repo1.maven.org/maven2): Error transferring file: Connection timed out and 'parent.relativePath' points at wrong local POM @ line 3, column 11 -> [Help 2]
[ERROR] 
[ERROR] To see the full stack trace of the errors, re-run Maven with the -e switch.
[ERROR] Re-run Maven using the -X switch to enable full debug logging.
[ERROR] 
[ERROR] For more information about the errors and possible solutions, please read the following articles:
[ERROR] [Help 1] http://cwiki.apache.org/confluence/display/MAVEN/ProjectBuildingException
[ERROR] [Help 2] http://cwiki.apache.org/confluence/display/MAVEN/UnresolvableModelException
Recording test results