[Date Prev][Date Next][Thread Prev][Thread Next][Date Index][Thread Index] [List Home]
[jetty-build] Build failed in Hudson: jetty-nightly-8 #67

See <https://hudson.eclipse.org/hudson/job/jetty-nightly-8/67/>

------------------------------------------
[...truncated 87422 lines...]
	at com.google.inject.Scopes$1$1.get(Scopes.java:59)
	at com.google.inject.internal.InternalFactoryToProviderAdapter.get(InternalFactoryToProviderAdapter.java:40)
	at com.google.inject.internal.InjectorImpl$4$1.call(InjectorImpl.java:968)
	at com.google.inject.internal.InjectorImpl.callInContext(InjectorImpl.java:1021)
	at com.google.inject.internal.InjectorImpl$4.get(InjectorImpl.java:964)
	at org.sonatype.guice.bean.locators.LazyBeanEntry.getValue(LazyBeanEntry.java:79)
	at org.sonatype.guice.plexus.locators.LazyPlexusBean.getValue(LazyPlexusBean.java:53)
	at org.sonatype.guice.plexus.binders.PlexusRequirements$RequirementProvider.get(PlexusRequirements.java:221)
	at org.sonatype.guice.plexus.binders.ProvidedPropertyBinding.injectProperty(ProvidedPropertyBinding.java:49)
	at org.sonatype.guice.bean.inject.BeanInjector.doInjection(BeanInjector.java:105)
	at org.sonatype.guice.bean.inject.BeanInjector.injectMembers(BeanInjector.java:66)
	at com.google.inject.internal.MembersInjectorImpl.injectMembers(MembersInjectorImpl.java:120)
	at com.google.inject.internal.ConstructorInjector.construct(ConstructorInjector.java:94)
	at com.google.inject.internal.ConstructorBindingImpl$Factory.get(ConstructorBindingImpl.java:254)
	at com.google.inject.internal.InjectorImpl$4$1.call(InjectorImpl.java:968)
	at com.google.inject.internal.InjectorImpl.callInContext(InjectorImpl.java:1021)
	at com.google.inject.internal.InjectorImpl$4.get(InjectorImpl.java:964)
	at com.google.inject.internal.InjectorImpl.getInstance(InjectorImpl.java:1003)
	at org.sonatype.guice.bean.reflect.AbstractDeferredClass.get(AbstractDeferredClass.java:47)
	at com.google.inject.internal.InternalFactoryToProviderAdapter.get(InternalFactoryToProviderAdapter.java:40)
	at com.google.inject.internal.InjectorImpl$4$1.call(InjectorImpl.java:968)
	at com.google.inject.internal.InjectorImpl.callInContext(InjectorImpl.java:1014)
	at com.google.inject.internal.InjectorImpl$4.get(InjectorImpl.java:964)
	at com.google.inject.Scopes$1$1.get(Scopes.java:59)
	at org.sonatype.guice.bean.locators.LazyBeanEntry.getValue(LazyBeanEntry.java:79)
	at org.sonatype.guice.plexus.locators.LazyPlexusBean.getValue(LazyPlexusBean.java:53)
	at org.codehaus.plexus.DefaultPlexusContainer.lookup(DefaultPlexusContainer.java:243)
	at org.codehaus.plexus.DefaultPlexusContainer.lookup(DefaultPlexusContainer.java:235)
	at org.apache.maven.plugin.internal.DefaultMavenPluginManager.getConfiguredMojo(DefaultMavenPluginManager.java:455)
	at org.apache.maven.plugin.DefaultBuildPluginManager.executeMojo(DefaultBuildPluginManager.java:92)
	at org.apache.maven.lifecycle.internal.MojoExecutor.execute(MojoExecutor.java:209)
	at org.apache.maven.lifecycle.internal.MojoExecutor.execute(MojoExecutor.java:153)
	at org.apache.maven.lifecycle.internal.MojoExecutor.execute(MojoExecutor.java:145)
	at org.apache.maven.lifecycle.internal.LifecycleModuleBuilder.buildProject(LifecycleModuleBuilder.java:84)
	at org.apache.maven.lifecycle.internal.LifecycleModuleBuilder.buildProject(LifecycleModuleBuilder.java:59)
	at org.apache.maven.lifecycle.internal.LifecycleStarter.singleThreadedBuild(LifecycleStarter.java:183)
	at org.apache.maven.lifecycle.internal.LifecycleStarter.execute(LifecycleStarter.java:161)
	at org.apache.maven.DefaultMaven.doExecute(DefaultMaven.java:319)
	at org.apache.maven.DefaultMaven.execute(DefaultMaven.java:156)
	at org.apache.maven.cli.MavenCli.execute(MavenCli.java:537)
	at org.apache.maven.cli.MavenCli.doMain(MavenCli.java:196)
	at org.apache.maven.cli.MavenCli.main(MavenCli.java:141)
	at sun.reflect.NativeMethodAccessorImpl.invoke0(Native Method)
	at sun.reflect.NativeMethodAccessorImpl.invoke(NativeMethodAccessorImpl.java:39)
	at sun.reflect.DelegatingMethodAccessorImpl.invoke(DelegatingMethodAccessorImpl.java:25)
	at java.lang.reflect.Method.invoke(Method.java:597)
	at org.codehaus.plexus.classworlds.launcher.Launcher.launchEnhanced(Launcher.java:290)
	at org.codehaus.plexus.classworlds.launcher.Launcher.launch(Launcher.java:230)
	at org.codehaus.plexus.classworlds.launcher.Launcher.mainWithExitCode(Launcher.java:409)
	at org.codehaus.plexus.classworlds.launcher.Launcher.main(Launcher.java:352)
Caused by: java.lang.ClassNotFoundException: org.codehaus.plexus.components.io.resources.PlexusIoResourceCollection
	at org.codehaus.plexus.classworlds.strategy.SelfFirstStrategy.loadClass(SelfFirstStrategy.java:50)
	at org.codehaus.plexus.classworlds.realm.ClassRealm.loadClass(ClassRealm.java:244)
	at org.codehaus.plexus.classworlds.realm.ClassRealm.loadClass(ClassRealm.java:230)
	... 73 more
Dec 2, 2011 1:24:19 AM org.sonatype.guice.bean.reflect.LoadedClass
WARNING: Error injecting: org.apache.maven.plugin.war.WarMojo
com.google.inject.ProvisionException: Guice provision errors:

1) Error injecting: org.codehaus.plexus.archiver.manager.DefaultArchiverManager
  at ClassRealm[plugin>org.apache.maven.plugins:maven-war-plugin:2.1.1, parent: sun.misc.Launcher$AppClassLoader@32f4a24a]
  at ClassRealm[plugin>org.apache.maven.plugins:maven-war-plugin:2.1.1, parent: sun.misc.Launcher$AppClassLoader@32f4a24a]
  while locating org.codehaus.plexus.archiver.manager.ArchiverManager
  while locating org.apache.maven.plugin.war.WarMojo

1 error
	at com.google.inject.internal.InjectorImpl$4.get(InjectorImpl.java:977)
	at com.google.inject.internal.InjectorImpl.getInstance(InjectorImpl.java:1003)
	at org.sonatype.guice.bean.reflect.AbstractDeferredClass.get(AbstractDeferredClass.java:47)
	at com.google.inject.internal.InternalFactoryToProviderAdapter.get(InternalFactoryToProviderAdapter.java:40)
	at com.google.inject.internal.InjectorImpl$4$1.call(InjectorImpl.java:968)
	at com.google.inject.internal.InjectorImpl.callInContext(InjectorImpl.java:1014)
	at com.google.inject.internal.InjectorImpl$4.get(InjectorImpl.java:964)
	at com.google.inject.Scopes$1$1.get(Scopes.java:59)
	at org.sonatype.guice.bean.locators.LazyBeanEntry.getValue(LazyBeanEntry.java:79)
	at org.sonatype.guice.plexus.locators.LazyPlexusBean.getValue(LazyPlexusBean.java:53)
	at org.codehaus.plexus.DefaultPlexusContainer.lookup(DefaultPlexusContainer.java:243)
	at org.codehaus.plexus.DefaultPlexusContainer.lookup(DefaultPlexusContainer.java:235)
	at org.apache.maven.plugin.internal.DefaultMavenPluginManager.getConfiguredMojo(DefaultMavenPluginManager.java:455)
	at org.apache.maven.plugin.DefaultBuildPluginManager.executeMojo(DefaultBuildPluginManager.java:92)
	at org.apache.maven.lifecycle.internal.MojoExecutor.execute(MojoExecutor.java:209)
	at org.apache.maven.lifecycle.internal.MojoExecutor.execute(MojoExecutor.java:153)
	at org.apache.maven.lifecycle.internal.MojoExecutor.execute(MojoExecutor.java:145)
	at org.apache.maven.lifecycle.internal.LifecycleModuleBuilder.buildProject(LifecycleModuleBuilder.java:84)
	at org.apache.maven.lifecycle.internal.LifecycleModuleBuilder.buildProject(LifecycleModuleBuilder.java:59)
	at org.apache.maven.lifecycle.internal.LifecycleStarter.singleThreadedBuild(LifecycleStarter.java:183)
	at org.apache.maven.lifecycle.internal.LifecycleStarter.execute(LifecycleStarter.java:161)
	at org.apache.maven.DefaultMaven.doExecute(DefaultMaven.java:319)
	at org.apache.maven.DefaultMaven.execute(DefaultMaven.java:156)
	at org.apache.maven.cli.MavenCli.execute(MavenCli.java:537)
	at org.apache.maven.cli.MavenCli.doMain(MavenCli.java:196)
	at org.apache.maven.cli.MavenCli.main(MavenCli.java:141)
	at sun.reflect.NativeMethodAccessorImpl.invoke0(Native Method)
	at sun.reflect.NativeMethodAccessorImpl.invoke(NativeMethodAccessorImpl.java:39)
	at sun.reflect.DelegatingMethodAccessorImpl.invoke(DelegatingMethodAccessorImpl.java:25)
	at java.lang.reflect.Method.invoke(Method.java:597)
	at org.codehaus.plexus.classworlds.launcher.Launcher.launchEnhanced(Launcher.java:290)
	at org.codehaus.plexus.classworlds.launcher.Launcher.launch(Launcher.java:230)
	at org.codehaus.plexus.classworlds.launcher.Launcher.mainWithExitCode(Launcher.java:409)
	at org.codehaus.plexus.classworlds.launcher.Launcher.main(Launcher.java:352)
Caused by: java.lang.NoClassDefFoundError: org/codehaus/plexus/components/io/resources/PlexusIoResourceCollection
	at java.lang.Class.getDeclaredMethods0(Native Method)
	at java.lang.Class.privateGetDeclaredMethods(Class.java:2427)
	at java.lang.Class.getDeclaredMethods(Class.java:1791)
	at com.google.inject.spi.InjectionPoint.getInjectionPoints(InjectionPoint.java:662)
	at com.google.inject.spi.InjectionPoint.forInstanceMethodsAndFields(InjectionPoint.java:356)
	at com.google.inject.internal.ConstructorBindingImpl.getInternalDependencies(ConstructorBindingImpl.java:151)
	at com.google.inject.internal.InjectorImpl.getInternalDependencies(InjectorImpl.java:584)
	at com.google.inject.internal.InjectorImpl.cleanup(InjectorImpl.java:542)
	at com.google.inject.internal.InjectorImpl.initializeJitBinding(InjectorImpl.java:528)
	at com.google.inject.internal.InjectorImpl.createJustInTimeBinding(InjectorImpl.java:837)
	at com.google.inject.internal.InjectorImpl.createJustInTimeBindingRecursive(InjectorImpl.java:769)
	at com.google.inject.internal.InjectorImpl.getJustInTimeBinding(InjectorImpl.java:254)
	at com.google.inject.internal.InjectorImpl.getBindingOrThrow(InjectorImpl.java:205)
	at com.google.inject.internal.InjectorImpl.getInternalFactory(InjectorImpl.java:843)
	at com.google.inject.internal.InjectorImpl.getProviderOrThrow(InjectorImpl.java:957)
	at com.google.inject.internal.InjectorImpl.getProvider(InjectorImpl.java:990)
	at com.google.inject.internal.InjectorImpl.getProvider(InjectorImpl.java:951)
	at com.google.inject.internal.InjectorImpl.getInstance(InjectorImpl.java:1003)
	at org.sonatype.guice.bean.reflect.AbstractDeferredClass.get(AbstractDeferredClass.java:47)
	at com.google.inject.internal.InternalFactoryToProviderAdapter.get(InternalFactoryToProviderAdapter.java:40)
	at com.google.inject.internal.ProviderToInternalFactoryAdapter$1.call(ProviderToInternalFactoryAdapter.java:46)
	at com.google.inject.internal.InjectorImpl.callInContext(InjectorImpl.java:1021)
	at com.google.inject.internal.ProviderToInternalFactoryAdapter.get(ProviderToInternalFactoryAdapter.java:40)
	at com.google.inject.Scopes$1$1.get(Scopes.java:59)
	at com.google.inject.internal.InternalFactoryToProviderAdapter.get(InternalFactoryToProviderAdapter.java:40)
	at com.google.inject.internal.InjectorImpl$4$1.call(InjectorImpl.java:968)
	at com.google.inject.internal.InjectorImpl.callInContext(InjectorImpl.java:1021)
	at com.google.inject.internal.InjectorImpl$4.get(InjectorImpl.java:964)
	at org.sonatype.guice.bean.locators.LazyBeanEntry.getValue(LazyBeanEntry.java:79)
	at org.sonatype.guice.plexus.locators.LazyPlexusBean.getValue(LazyPlexusBean.java:53)
	at org.sonatype.guice.plexus.binders.PlexusRequirements$RequirementProvider.get(PlexusRequirements.java:221)
	at org.sonatype.guice.plexus.binders.ProvidedPropertyBinding.injectProperty(ProvidedPropertyBinding.java:49)
	at org.sonatype.guice.bean.inject.BeanInjector.doInjection(BeanInjector.java:105)
	at org.sonatype.guice.bean.inject.BeanInjector.injectMembers(BeanInjector.java:66)
	at com.google.inject.internal.MembersInjectorImpl.injectMembers(MembersInjectorImpl.java:120)
	at com.google.inject.internal.ConstructorInjector.construct(ConstructorInjector.java:94)
	at com.google.inject.internal.ConstructorBindingImpl$Factory.get(ConstructorBindingImpl.java:254)
	at com.google.inject.internal.InjectorImpl$4$1.call(InjectorImpl.java:968)
	at com.google.inject.internal.InjectorImpl.callInContext(InjectorImpl.java:1021)
	at com.google.inject.internal.InjectorImpl$4.get(InjectorImpl.java:964)
	... 33 more
Caused by: java.lang.ClassNotFoundException: org.codehaus.plexus.components.io.resources.PlexusIoResourceCollection
	at org.codehaus.plexus.classworlds.strategy.SelfFirstStrategy.loadClass(SelfFirstStrategy.java:50)
	at org.codehaus.plexus.classworlds.realm.ClassRealm.loadClass(ClassRealm.java:244)
	at org.codehaus.plexus.classworlds.realm.ClassRealm.loadClass(ClassRealm.java:230)
	... 73 more
[INFO] ------------------------------------------------------------------------
[INFO] Reactor Summary:
[INFO] 
[INFO] Jetty :: Project .................................. SUCCESS [3:49.777s]
[INFO] Jetty :: Utilities ................................ SUCCESS [57.710s]
[INFO] Jetty :: JMX Management ........................... SUCCESS [4.417s]
[INFO] Jetty :: IO Utility ............................... SUCCESS [6.786s]
[INFO] Jetty :: Http Utility ............................. SUCCESS [7.276s]
[INFO] Jetty :: Continuation ............................. SUCCESS [5.104s]
[INFO] Jetty :: Server Core .............................. SUCCESS [15.154s]
[INFO] Jetty :: Websocket ................................ SUCCESS [6.170s]
[INFO] Jetty :: Security ................................. SUCCESS [5.560s]
[INFO] Jetty :: Servlet Handling ......................... SUCCESS [6.107s]
[INFO] Jetty :: Asynchronous HTTP Client ................. SUCCESS [18.972s]
[INFO] Jetty :: XML utilities ............................ SUCCESS [3.861s]
[INFO] Jetty :: JASPI Security ........................... SUCCESS [6.914s]
[INFO] Jetty :: Webapp Application Support ............... SUCCESS [6.969s]
[INFO] Test :: Jetty Servlet Tester ...................... SUCCESS [5.801s]
[INFO] Jetty :: Utility Servlets and Filters ............. SUCCESS [5.524s]
[INFO] Jetty :: Deployers ................................ SUCCESS [5.151s]
[INFO] Jetty :: AJP ...................................... SUCCESS [4.341s]
[INFO] Jetty :: JNDI Naming .............................. SUCCESS [5.590s]
[INFO] Jetty :: Plus ..................................... SUCCESS [10.598s]
[INFO] Jetty :: Servlet Annotations ...................... SUCCESS [8.489s]
[INFO] Jetty :: Rewrite Handler .......................... SUCCESS [4.299s]
[INFO] Jetty :: Policy Tool .............................. SUCCESS [4.075s]
[INFO] Jetty :: Monitoring ............................... SUCCESS [5.621s]
[INFO] Jetty :: Start .................................... SUCCESS [4.236s]
[INFO] Jetty :: Nested ................................... SUCCESS [3.261s]
[INFO] Jetty :: Overlay Deployer ......................... SUCCESS [5.747s]
[INFO] Jetty :: OSGi ..................................... SUCCESS [0.154s]
[INFO] Jetty :: OSGi :: Boot ............................. SUCCESS [22.129s]
[INFO] Jetty :: OSGi :: Boot JSP ......................... SUCCESS [13.740s]
[INFO] Jetty :: OSGi :: Boot :: Warurl ................... SUCCESS [4.451s]
[INFO] Jetty :: OSGi :: HttpService ...................... SUCCESS [5.163s]
[INFO] Test :: Jetty Test Webapp ......................... FAILURE [12.555s]
[INFO] Jetty :: OSGi :: Test ............................. SKIPPED
[INFO] Jetty Tests :: Parent ............................. SKIPPED
[INFO] Jetty Tests :: Sessions :: Parent ................. SKIPPED
[INFO] Jetty Tests :: Sessions :: Common ................. SKIPPED
[INFO] Jetty :: NoSQL Session Managers ................... SKIPPED
[INFO] Jetty :: Http Service Provider Interface .......... SKIPPED
[INFO] Jetty :: Aggregate Project ........................ SKIPPED
[INFO] Jetty :: Aggregate :: All core Jetty .............. SKIPPED
[INFO] Jetty :: Distribution Assemblies .................. SKIPPED
[INFO] Test :: Continuation .............................. SKIPPED
[INFO] Test :: Continuation - (Jetty 6) .................. SKIPPED
[INFO] Jetty :: Nested Test .............................. SKIPPED
[INFO] Example :: Jetty Embedded ......................... SKIPPED
[INFO] Example Async Rest ................................ SKIPPED
[INFO] Example Async Rest :: Jar ......................... SKIPPED
[INFO] Example Async Rest :: Webapp ...................... SKIPPED
[INFO] Jetty Tests :: WebApps :: Parent .................. SKIPPED
[INFO] Jetty Tests :: WebApp :: RFC2616 .................. SKIPPED
[INFO] Jetty Tests :: Integrations ....................... SKIPPED
[INFO] Jetty Tests :: Sessions :: Hash ................... SKIPPED
[INFO] Jetty Tests :: Sessions :: JDBC ................... SKIPPED
[INFO] Jetty Tests :: Login Service ...................... SKIPPED
[INFO] Jetty :: Aggregate :: HTTP Server ................. SKIPPED
[INFO] Jetty :: Aggregate :: HTTP Client ................. SKIPPED
[INFO] Jetty :: Aggregate :: Servlet Server .............. SKIPPED
[INFO] Jetty :: Aggregate :: WebApp Server ............... SKIPPED
[INFO] Jetty :: Aggregate :: Plus Server ................. SKIPPED
[INFO] Jetty :: Aggregate :: All Server .................. SKIPPED
[INFO] ------------------------------------------------------------------------
[INFO] BUILD FAILURE
[INFO] ------------------------------------------------------------------------
[INFO] Total time: 9:16.677s
[INFO] Finished at: Fri Dec 02 01:24:19 EST 2011
[INFO] Final Memory: 75M/654M
[INFO] ------------------------------------------------------------------------
[ERROR] Failed to execute goal org.apache.maven.plugins:maven-war-plugin:2.1.1:war (default-war) on project test-jetty-webapp: Execution default-war of goal org.apache.maven.plugins:maven-war-plugin:2.1.1:war failed: Unable to load the mojo 'war' in the plugin 'org.apache.maven.plugins:maven-war-plugin:2.1.1'. A required class is missing: org/codehaus/plexus/components/io/resources/PlexusIoResourceCollection
[ERROR] -----------------------------------------------------
[ERROR] realm =    plugin>org.apache.maven.plugins:maven-war-plugin:2.1.1
[ERROR] strategy = org.codehaus.plexus.classworlds.strategy.SelfFirstStrategy
[ERROR] urls[0] = file:/tmp/jetty-builds/jetty8/localRepo/org/apache/maven/plugins/maven-war-plugin/2.1.1/maven-war-plugin-2.1.1.jar
[ERROR] urls[1] = file:/tmp/jetty-builds/jetty8/localRepo/org/apache/maven/reporting/maven-reporting-api/2.0.6/maven-reporting-api-2.0.6.jar
[ERROR] urls[2] = file:/tmp/jetty-builds/jetty8/localRepo/org/apache/maven/doxia/doxia-sink-api/1.0-alpha-7/doxia-sink-api-1.0-alpha-7.jar
[ERROR] urls[3] = file:/tmp/jetty-builds/jetty8/localRepo/commons-cli/commons-cli/1.0/commons-cli-1.0.jar
[ERROR] urls[4] = file:/tmp/jetty-builds/jetty8/localRepo/org/codehaus/plexus/plexus-interactivity-api/1.0-alpha-4/plexus-interactivity-api-1.0-alpha-4.jar
[ERROR] urls[5] = file:/tmp/jetty-builds/jetty8/localRepo/org/apache/maven/maven-archiver/2.4.1/maven-archiver-2.4.1.jar
[ERROR] urls[6] = file:/tmp/jetty-builds/jetty8/localRepo/org/codehaus/plexus/plexus-archiver/1.2/plexus-archiver-1.2.jar
[ERROR] urls[7] = file:/tmp/jetty-builds/jetty8/localRepo/org/codehaus/plexus/plexus-interpolation/1.13/plexus-interpolation-1.13.jar
[ERROR] urls[8] = file:/tmp/jetty-builds/jetty8/localRepo/junit/junit/3.8.1/junit-3.8.1.jar
[ERROR] urls[9] = file:/tmp/jetty-builds/jetty8/localRepo/com/thoughtworks/xstream/xstream/1.3.1/xstream-1.3.1.jar
[ERROR] urls[10] = file:/tmp/jetty-builds/jetty8/localRepo/xpp3/xpp3_min/1.1.4c/xpp3_min-1.1.4c.jar
[ERROR] urls[11] = file:/tmp/jetty-builds/jetty8/localRepo/org/codehaus/plexus/plexus-utils/2.0.5/plexus-utils-2.0.5.jar
[ERROR] urls[12] = file:/tmp/jetty-builds/jetty8/localRepo/org/apache/maven/shared/maven-filtering/1.0-beta-2/maven-filtering-1.0-beta-2.jar
[ERROR] Number of foreign imports: 1
[ERROR] import: Entry[import  from realm ClassRealm[project>org.eclipse.jetty:jetty-util:8.1.0-SNAPSHOT, parent: ClassRealm[maven.api, parent: null]]]
[ERROR] 
[ERROR] -----------------------------------------------------: org.codehaus.plexus.components.io.resources.PlexusIoResourceCollection
[ERROR] -> [Help 1]
[ERROR] 
[ERROR] To see the full stack trace of the errors, re-run Maven with the -e switch.
[ERROR] Re-run Maven using the -X switch to enable full debug logging.
[ERROR] 
[ERROR] For more information about the errors and possible solutions, please read the following articles:
[ERROR] [Help 1] http://cwiki.apache.org/confluence/display/MAVEN/PluginContainerException
[ERROR] 
[ERROR] After correcting the problems, you can resume the build with the command
[ERROR]   mvn <goals> -rf :test-jetty-webapp