[Date Prev][Date Next][Thread Prev][Thread Next][Date Index][Thread Index] [List Home]
[gmf-releng] [continuous] gmf Build Failed

View results here -> http://gmf-dev.borland.com/cruisecontrol/buildresults/gmf?log=log20051027120048

BUILD FAILED
Ant Error Message:D:\gmfbuild\org.eclipse.gmf.releng.builder\scripts\buildAll.xml:11: The following error occurred while executing this line: D:\gmfbuild\org.eclipse.gmf.releng.builder\scripts\build.xml:24: The following error occurred while executing this line: D:\gmfbuild\org.eclipse.releng.basebuilder\plugins\org.eclipse.pde.build_3.1.0\scripts\build.xml:23: The following error occurred while executing this line: D:\gmfbuild\org.eclipse.releng.basebuilder\plugins\org.eclipse.pde.build_3.1.0\scripts\build.xml:63: The following error occurred while executing this line: D:\gmfbuild\org.eclipse.gmf.releng.builder\runtime\customTargets.xml:10: The following error occurred while executing this line: D:\gmfbuild\org.eclipse.releng.basebuilder\plugins\org.eclipse.pde.build_3.1.0\scripts\genericTargets.xml:67: org.eclipse.core.runtime.CoreException: Unable to find plug-in: org.eclipse.gmf.runtime.diagram.core_0.0.0. Please check the error log for more details.
Date of build:10/27/2005 12:00:48
Time to build:4 minutes 57 seconds
Last changed:10/27/2005 06:26:27
Last log entry:checkout

 Errors/Warnings: (6)
Building runtime...
cvs checkout: Updating org.eclipse.gmf.releng
cvs checkout: Updating org.eclipse.gmf.releng/maps
cvs checkout: Updating org.eclipse.gmf.releng/psf
cvs [export aborted]: connect to dev.eclipse.org(206.191.52.50):2401 failed: Connection timed out
cvs [export aborted]: connect to dev.eclipse.org(206.191.52.50):2401 failed: Connection timed out

 Unit Tests: (401)
error testChangeBoundsAllTests
error testChangeColorsAllTests
failure testCodeCompilationAllTests
failure testRunTimeModelTransformAllTests
 
 Unit Test Error Details: (4)
Test: testChangeBounds
Class: AllTests
Type: org.osgi.framework.BundleException
Message: The bundle could not be resolved. Reason: missing required bundle org.eclipse.gmf.runtime.gef_0.0.0
org.osgi.framework.BundleException: The bundle could not be resolved. Reason: missing required bundle org.eclipse.gmf.runtime.gef_0.0.0
at org.eclipse.osgi.framework.internal.core.BundleHost.startWorker(BundleHost.java:296)
at org.eclipse.osgi.framework.internal.core.AbstractBundle.start(AbstractBundle.java:266)
at org.eclipse.gmf.tests.setup.GenProjectSetup.init(GenProjectSetup.java:43)
at org.eclipse.gmf.tests.SessionSetup.getGenProject(SessionSetup.java:48)
at org.eclipse.gmf.tests.gef.DiagramNodeTest.setUp(DiagramNodeTest.java:72)
at org.eclipse.test.EclipseTestRunner.run(EclipseTestRunner.java:313)
at org.eclipse.test.EclipseTestRunner.run(EclipseTestRunner.java:199)
at org.eclipse.test.CoreTestApplication.runTests(CoreTestApplication.java:35)
at org.eclipse.test.CoreTestApplication.run(CoreTestApplication.java:31)
at org.eclipse.core.internal.runtime.PlatformActivator$1.run(PlatformActivator.java:226)
at org.eclipse.core.runtime.adaptor.EclipseStarter.run(EclipseStarter.java:376)
at org.eclipse.core.runtime.adaptor.EclipseStarter.run(EclipseStarter.java:163)
at org.eclipse.core.launcher.Main.invokeFramework(Main.java:334)
at org.eclipse.core.launcher.Main.basicRun(Main.java:278)
at org.eclipse.core.launcher.Main.run(Main.java:973)
at org.eclipse.core.launcher.Main.main(Main.java:948)
Test: testChangeColors
Class: AllTests
Type: java.lang.ClassNotFoundException
Message: Cannot load "file:/D:/gmfbuild/build/eclipse/gmf_folder/sample.d300.h6.m21.gmf.editor/" because the bundle "samplemodel.edit.parts.EditPartFactoryImpl" cannot be resolved.
java.lang.ClassNotFoundException: Cannot load "file:/D:/gmfbuild/build/eclipse/gmf_folder/sample.d300.h6.m21.gmf.editor/" because the bundle "samplemodel.edit.parts.EditPartFactoryImpl" cannot be resolved.
at org.eclipse.osgi.framework.internal.core.BundleHost.loadClass(BundleHost.java:226)
at org.eclipse.osgi.framework.internal.core.AbstractBundle.loadClass(AbstractBundle.java:1259)
at org.eclipse.gmf.tests.gef.DiagramNodeTest.setUp(DiagramNodeTest.java:74)
at org.eclipse.test.EclipseTestRunner.run(EclipseTestRunner.java:313)
at org.eclipse.test.EclipseTestRunner.run(EclipseTestRunner.java:199)
at org.eclipse.test.CoreTestApplication.runTests(CoreTestApplication.java:35)
at org.eclipse.test.CoreTestApplication.run(CoreTestApplication.java:31)
at org.eclipse.core.internal.runtime.PlatformActivator$1.run(PlatformActivator.java:226)
at org.eclipse.core.runtime.adaptor.EclipseStarter.run(EclipseStarter.java:376)
at org.eclipse.core.runtime.adaptor.EclipseStarter.run(EclipseStarter.java:163)
at org.eclipse.core.launcher.Main.invokeFramework(Main.java:334)
at org.eclipse.core.launcher.Main.basicRun(Main.java:278)
at org.eclipse.core.launcher.Main.run(Main.java:973)
at org.eclipse.core.launcher.Main.main(Main.java:948)
Test: testCodeCompilation
Class: AllTests
Type: junit.framework.AssertionFailedError
Message: No sample model to run tests against
junit.framework.AssertionFailedError: No sample model to run tests against
at org.eclipse.gmf.tests.gen.CompilationTest.testCodeCompilation(CompilationTest.java:48)
at org.eclipse.test.EclipseTestRunner.run(EclipseTestRunner.java:313)
at org.eclipse.test.EclipseTestRunner.run(EclipseTestRunner.java:199)
at org.eclipse.test.CoreTestApplication.runTests(CoreTestApplication.java:35)
at org.eclipse.test.CoreTestApplication.run(CoreTestApplication.java:31)
at org.eclipse.core.internal.runtime.PlatformActivator$1.run(PlatformActivator.java:226)
at org.eclipse.core.runtime.adaptor.EclipseStarter.run(EclipseStarter.java:376)
at org.eclipse.core.runtime.adaptor.EclipseStarter.run(EclipseStarter.java:163)
at org.eclipse.core.launcher.Main.invokeFramework(Main.java:334)
at org.eclipse.core.launcher.Main.basicRun(Main.java:278)
at org.eclipse.core.launcher.Main.run(Main.java:973)
at org.eclipse.core.launcher.Main.main(Main.java:948)
Test: testRunTimeModelTransform
Class: AllTests
Type: junit.framework.AssertionFailedError
Message: Fix runtime properties in new runtime/notation model
junit.framework.AssertionFailedError: Fix runtime properties in new runtime/notation model
at org.eclipse.gmf.tests.tr.RunTimeModelTransformerTest.doTestRunTimeModelPropertiesTransform(RunTimeModelTransformerTest.java:69)
at org.eclipse.gmf.tests.tr.RunTimeModelTransformerTest.testRunTimeModelTransform(RunTimeModelTransformerTest.java:45)
at org.eclipse.test.EclipseTestRunner.run(EclipseTestRunner.java:313)
at org.eclipse.test.EclipseTestRunner.run(EclipseTestRunner.java:199)
at org.eclipse.test.CoreTestApplication.runTests(CoreTestApplication.java:35)
at org.eclipse.test.CoreTestApplication.run(CoreTestApplication.java:31)
at org.eclipse.core.internal.runtime.PlatformActivator$1.run(PlatformActivator.java:226)
at org.eclipse.core.runtime.adaptor.EclipseStarter.run(EclipseStarter.java:376)
at org.eclipse.core.runtime.adaptor.EclipseStarter.run(EclipseStarter.java:163)
at org.eclipse.core.launcher.Main.invokeFramework(Main.java:334)
at org.eclipse.core.launcher.Main.basicRun(Main.java:278)
at org.eclipse.core.launcher.Main.run(Main.java:973)
at org.eclipse.core.launcher.Main.main(Main.java:948)
 

 Modifications since last successful build:  (1)
addcc-checkoutlog20051027062627Lbuild.5checkout