Skip to main content

[Date Prev][Date Next][Thread Prev][Thread Next][Date Index][Thread Index] [List Home]
[egit-build] Build failed in Jenkins: egit #4805

See <https://ci.eclipse.org/egit/job/egit/4805/display/redirect?page=changes>

Changes:

[Thomas Wolf] History table: let the user define which columns are shown

------------------------------------------
[...truncated 463.93 KB...]
testImportWizardGeneralProjectWithWorkingSet(org.eclipse.egit.ui.view.repositories.GitRepositoriesViewTest)  Time elapsed: 2.19 sec
testImportWizardGeneralProject(org.eclipse.egit.ui.view.repositories.GitRepositoriesViewTest)  Time elapsed: 2.064 sec
testContextMenuRepository(org.eclipse.egit.ui.view.repositories.GitRepositoriesViewTest)  Time elapsed: 2.074 sec
testDeleteMultipleBranches(org.eclipse.egit.ui.view.repositories.GitRepositoriesViewTest)  Time elapsed: 3.889 sec
Running org.eclipse.egit.ui.view.repositories.GitRepositoriesViewRepoDeletionTest
Tests run: 4, Failures: 0, Errors: 0, Skipped: 0, Time elapsed: 20.754 sec - in org.eclipse.egit.ui.view.repositories.GitRepositoriesViewRepoDeletionTest
testDeleteRepositoryKeepProjectsBug479964(org.eclipse.egit.ui.view.repositories.GitRepositoriesViewRepoDeletionTest)  Time elapsed: 3.107 sec
testRemoveRepositoryRemoveFromCachesBug483664(org.eclipse.egit.ui.view.repositories.GitRepositoriesViewRepoDeletionTest)  Time elapsed: 10.789 sec
testDeleteSubmoduleRepository(org.eclipse.egit.ui.view.repositories.GitRepositoriesViewRepoDeletionTest)  Time elapsed: 3.927 sec
testDeleteRepositoryWithContentOk(org.eclipse.egit.ui.view.repositories.GitRepositoriesViewRepoDeletionTest)  Time elapsed: 2.922 sec
Running org.eclipse.egit.ui.view.repositories.GitRepositoriesViewRepoHandlingTest
Tests run: 11, Failures: 0, Errors: 0, Skipped: 0, Time elapsed: 38.089 sec - in org.eclipse.egit.ui.view.repositories.GitRepositoriesViewRepoHandlingTest
testAddRepoButton(org.eclipse.egit.ui.view.repositories.GitRepositoriesViewRepoHandlingTest)  Time elapsed: 3.596 sec
testCreateRepository(org.eclipse.egit.ui.view.repositories.GitRepositoriesViewRepoHandlingTest)  Time elapsed: 5.029 sec
testPasteRepoPath(org.eclipse.egit.ui.view.repositories.GitRepositoriesViewRepoHandlingTest)  Time elapsed: 3.554 sec
testRemoveRepositoryWithProjectsYes(org.eclipse.egit.ui.view.repositories.GitRepositoriesViewRepoHandlingTest)  Time elapsed: 2.889 sec
testRemoveRepositoryWithoutProjects(org.eclipse.egit.ui.view.repositories.GitRepositoriesViewRepoHandlingTest)  Time elapsed: 2.788 sec
testSearchDirectoryWithBareRepos(org.eclipse.egit.ui.view.repositories.GitRepositoriesViewRepoHandlingTest)  Time elapsed: 2.426 sec
testCopyPathToClipboard(org.eclipse.egit.ui.view.repositories.GitRepositoriesViewRepoHandlingTest)  Time elapsed: 1.45 sec
testCloneRepoButton(org.eclipse.egit.ui.view.repositories.GitRepositoriesViewRepoHandlingTest)  Time elapsed: 5.974 sec
testRemoveRepositoryWithProjectsNo(org.eclipse.egit.ui.view.repositories.GitRepositoriesViewRepoHandlingTest)  Time elapsed: 3.045 sec
testRemoveRepositoryWithProjectsCancel(org.eclipse.egit.ui.view.repositories.GitRepositoriesViewRepoHandlingTest)  Time elapsed: 2.094 sec
testShowIn(org.eclipse.egit.ui.view.repositories.GitRepositoriesViewRepoHandlingTest)  Time elapsed: 5.2 sec
Running org.eclipse.egit.ui.variables.DynamicVariablesTest
Tests run: 4, Failures: 0, Errors: 0, Skipped: 0, Time elapsed: 4.426 sec - in org.eclipse.egit.ui.variables.DynamicVariablesTest
testGitBranch(org.eclipse.egit.ui.variables.DynamicVariablesTest)  Time elapsed: 1.183 sec
testGitPath(org.eclipse.egit.ui.variables.DynamicVariablesTest)  Time elapsed: 1.074 sec
testGitWorkTree(org.eclipse.egit.ui.variables.DynamicVariablesTest)  Time elapsed: 1.091 sec
testGitDir(org.eclipse.egit.ui.variables.DynamicVariablesTest)  Time elapsed: 1.077 sec
Running org.eclipse.egit.ui.gitflow.FeatureFinishKeepBranchHandlerTest
Tests run: 1, Failures: 0, Errors: 0, Skipped: 0, Time elapsed: 2.795 sec - in org.eclipse.egit.ui.gitflow.FeatureFinishKeepBranchHandlerTest
testFeatureFinishKeepBranch(org.eclipse.egit.ui.gitflow.FeatureFinishKeepBranchHandlerTest)  Time elapsed: 2.788 sec
Running org.eclipse.egit.ui.gitflow.InitHandlerTest
Tests run: 3, Failures: 0, Errors: 0, Skipped: 0, Time elapsed: 4.918 sec - in org.eclipse.egit.ui.gitflow.InitHandlerTest
testInit(org.eclipse.egit.ui.gitflow.InitHandlerTest)  Time elapsed: 1.112 sec
testInitEmptyRepoMissingMaster(org.eclipse.egit.ui.gitflow.InitHandlerTest)  Time elapsed: 2.273 sec
testInitMissingMaster(org.eclipse.egit.ui.gitflow.InitHandlerTest)  Time elapsed: 1.521 sec
Running org.eclipse.egit.ui.gitflow.FeatureFinishSquashHandlerTest
Tests run: 1, Failures: 0, Errors: 0, Skipped: 0, Time elapsed: 2.878 sec - in org.eclipse.egit.ui.gitflow.FeatureFinishSquashHandlerTest
testFeatureFinishSquash(org.eclipse.egit.ui.gitflow.FeatureFinishSquashHandlerTest)  Time elapsed: 2.872 sec
Running org.eclipse.egit.ui.gitflow.CommandEnablementTest
Tests run: 2, Failures: 0, Errors: 0, Skipped: 0, Time elapsed: 2.329 sec - in org.eclipse.egit.ui.gitflow.CommandEnablementTest
testPackageExplorerStartFinishEnablement(org.eclipse.egit.ui.gitflow.CommandEnablementTest)  Time elapsed: 1.01 sec
testRepositoryViewStartFinishEnablement(org.eclipse.egit.ui.gitflow.CommandEnablementTest)  Time elapsed: 1.311 sec
Running org.eclipse.egit.ui.gitflow.FeatureStartFinishHandlerTest
Tests run: 1, Failures: 0, Errors: 0, Skipped: 0, Time elapsed: 2.93 sec - in org.eclipse.egit.ui.gitflow.FeatureStartFinishHandlerTest
testFeatureStart(org.eclipse.egit.ui.gitflow.FeatureStartFinishHandlerTest)  Time elapsed: 2.923 sec
Running org.eclipse.egit.ui.gitflow.FeatureRebaseHandlerTest
Tests run: 2, Failures: 0, Errors: 0, Skipped: 0, Time elapsed: 3.25 sec - in org.eclipse.egit.ui.gitflow.FeatureRebaseHandlerTest
testRebaseFailOnConflict(org.eclipse.egit.ui.gitflow.FeatureRebaseHandlerTest)  Time elapsed: 1.741 sec
testRebaseFailOnDirtyWorkingDirectory(org.eclipse.egit.ui.gitflow.FeatureRebaseHandlerTest)  Time elapsed: 1.495 sec
Running org.eclipse.egit.ui.wizards.pull.PullWizardTest
Tests run: 1, Failures: 0, Errors: 0, Skipped: 0, Time elapsed: 3.045 sec - in org.eclipse.egit.ui.wizards.pull.PullWizardTest
pullFromProjectRepo(org.eclipse.egit.ui.wizards.pull.PullWizardTest)  Time elapsed: 3.039 sec
Running org.eclipse.egit.ui.wizards.clone.GitCloneWizardTest
Tests run: 8, Failures: 0, Errors: 0, Skipped: 2, Time elapsed: 8.326 sec - in org.eclipse.egit.ui.wizards.clone.GitCloneWizardTest
canCloneARemoteRepo(org.eclipse.egit.ui.wizards.clone.GitCloneWizardTest)  Time elapsed: 1.384 sec
invalidPortFreezesDialog(org.eclipse.egit.ui.wizards.clone.GitCloneWizardTest) skipped
updatesParameterFieldsInImportDialogWhenURIIsUpdated(org.eclipse.egit.ui.wizards.clone.GitCloneWizardTest)  Time elapsed: 1.251 sec
clonedRepositoryShouldExistOnFileSystem(org.eclipse.egit.ui.wizards.clone.GitCloneWizardTest)  Time elapsed: 2.254 sec
alteringSomeParametersDuringClone(org.eclipse.egit.ui.wizards.clone.GitCloneWizardTest)  Time elapsed: 1.833 sec
gitStyleUriSelectsSshProtocol(org.eclipse.egit.ui.wizards.clone.GitCloneWizardTest)  Time elapsed: 0.627 sec
invalidHostnameFreezesDialog(org.eclipse.egit.ui.wizards.clone.GitCloneWizardTest) skipped
acceptCloneCommandAsURI(org.eclipse.egit.ui.wizards.clone.GitCloneWizardTest)  Time elapsed: 0.688 sec
Running org.eclipse.egit.ui.wizards.clone.GitCloneWizardHttpsTest
2018-08-01 20:37:50.264:INFO:oejs.Server:WorkbenchTestable: jetty-9.4.8.v20171121, build timestamp: 2017-11-21T16:27:37-05:00, git hash: 82b8fb23f757335bb3329d540ce37a2a2615f0a8
2018-08-01 20:37:50.266:INFO:oejsh.ContextHandler:WorkbenchTestable: Started o.e.j.s.ServletContextHandler@7a3f2cd2{/sbasic,null,AVAILABLE}
2018-08-01 20:37:50.268:INFO:oejs.AbstractConnector:WorkbenchTestable: Started ServerConnector@30fe2ab1{HTTP/1.1,[http/1.1]}{127.0.0.1:54749}
2018-08-01 20:37:50.279:INFO:oejus.SslContextFactory:WorkbenchTestable: x509=X509@4208c8e9(hipp1.eclipse.org,h=[],w=[]) for SslContextFactory@76ce0bda[provider=null,keyStore=file:///jobs/genie.egit/jks8662357355908584461/keystore.jks,trustStore=file:///jobs/genie.egit/jks8662357355908584461/keystore.jks]
2018-08-01 20:37:50.474:INFO:oejs.AbstractConnector:WorkbenchTestable: Started ServerConnector@35d33462{SSL,[ssl, http/1.1]}{127.0.0.1:34985}
2018-08-01 20:37:50.474:INFO:oejs.Server:WorkbenchTestable: Started @1153711ms
2018-08-01 20:37:54.455:INFO:oejs.AbstractConnector:WorkbenchTestable: Stopped ServerConnector@30fe2ab1{HTTP/1.1,[http/1.1]}{127.0.0.1:0}
2018-08-01 20:37:54.459:INFO:oejs.AbstractConnector:WorkbenchTestable: Stopped ServerConnector@35d33462{SSL,[ssl, http/1.1]}{127.0.0.1:0}
2018-08-01 20:37:54.459:INFO:oejsh.ContextHandler:WorkbenchTestable: Stopped o.e.j.s.ServletContextHandler@7a3f2cd2{/sbasic,null,UNAVAILABLE}
Tests run: 1, Failures: 0, Errors: 0, Skipped: 0, Time elapsed: 5.13 sec - in org.eclipse.egit.ui.wizards.clone.GitCloneWizardHttpsTest
canCloneARemoteRepo(org.eclipse.egit.ui.wizards.clone.GitCloneWizardHttpsTest)  Time elapsed: 3.977 sec
Running org.eclipse.egit.ui.wizards.clone.GitCloneSourceProviderExtensionTest
Tests run: 1, Failures: 0, Errors: 0, Skipped: 0, Time elapsed: 0.002 sec - in org.eclipse.egit.ui.wizards.clone.GitCloneSourceProviderExtensionTest
testGetRepositoryImports(org.eclipse.egit.ui.wizards.clone.GitCloneSourceProviderExtensionTest)  Time elapsed: 0.001 sec
Running org.eclipse.egit.ui.wizards.clone.GitCloneWizardHttpTest
2018-08-01 20:37:54.657:INFO:oejs.Server:WorkbenchTestable: jetty-9.4.8.v20171121, build timestamp: 2017-11-21T16:27:37-05:00, git hash: 82b8fb23f757335bb3329d540ce37a2a2615f0a8
2018-08-01 20:37:54.659:INFO:oejsh.ContextHandler:WorkbenchTestable: Started o.e.j.s.ServletContextHandler@64f0d23c{/sbasic,null,AVAILABLE}
2018-08-01 20:37:54.660:INFO:oejs.AbstractConnector:WorkbenchTestable: Started ServerConnector@281b61e4{HTTP/1.1,[http/1.1]}{127.0.0.1:36145}
2018-08-01 20:37:54.660:INFO:oejs.Server:WorkbenchTestable: Started @1157897ms
2018-08-01 20:37:57.119:INFO:oejs.AbstractConnector:WorkbenchTestable: Stopped ServerConnector@281b61e4{HTTP/1.1,[http/1.1]}{127.0.0.1:0}
2018-08-01 20:37:57.119:INFO:oejsh.ContextHandler:WorkbenchTestable: Stopped o.e.j.s.ServletContextHandler@64f0d23c{/sbasic,null,UNAVAILABLE}
Tests run: 1, Failures: 0, Errors: 0, Skipped: 0, Time elapsed: 2.65 sec - in org.eclipse.egit.ui.wizards.clone.GitCloneWizardHttpTest
canCloneARemoteRepo(org.eclipse.egit.ui.wizards.clone.GitCloneWizardHttpTest)  Time elapsed: 2.455 sec
Running org.eclipse.egit.ui.wizards.share.SharingWizardTest
Tests run: 3, Failures: 0, Errors: 0, Skipped: 0, Time elapsed: 5.658 sec - in org.eclipse.egit.ui.wizards.share.SharingWizardTest
shareProjectWithExternalRepo(org.eclipse.egit.ui.wizards.share.SharingWizardTest)  Time elapsed: 2.752 sec
shareProjectWithAlreadyCreatedRepos(org.eclipse.egit.ui.wizards.share.SharingWizardTest)  Time elapsed: 1.82 sec
shareProjectAndCreateRepo(org.eclipse.egit.ui.wizards.share.SharingWizardTest)  Time elapsed: 1.079 sec
Running org.eclipse.egit.ui.operations.GitScopeUtilTest
Tests run: 5, Failures: 0, Errors: 0, Skipped: 0, Time elapsed: 4.816 sec - in org.eclipse.egit.ui.operations.GitScopeUtilTest
relatedChangesWithPrompt(org.eclipse.egit.ui.operations.GitScopeUtilTest)  Time elapsed: 2.041 sec
modelProviderWithExtensionFiles(org.eclipse.egit.ui.operations.GitScopeUtilTest)  Time elapsed: 0.694 sec
relatedChangesWithInvalidParams(org.eclipse.egit.ui.operations.GitScopeUtilTest)  Time elapsed: 0.654 sec
relatedChangesWithNullResources(org.eclipse.egit.ui.operations.GitScopeUtilTest)  Time elapsed: 0.59 sec
relatedChangesWithEmptyResources(org.eclipse.egit.ui.operations.GitScopeUtilTest)  Time elapsed: 0.834 sec
Running org.eclipse.egit.ui.submodule.SubmoduleSyncTest
Tests run: 1, Failures: 0, Errors: 0, Skipped: 0, Time elapsed: 5.401 sec - in org.eclipse.egit.ui.submodule.SubmoduleSyncTest
syncSubmodule(org.eclipse.egit.ui.submodule.SubmoduleSyncTest)  Time elapsed: 5.377 sec
Running org.eclipse.egit.ui.submodule.SubmoduleUpdateTest
Tests run: 1, Failures: 0, Errors: 0, Skipped: 0, Time elapsed: 4.7 sec - in org.eclipse.egit.ui.submodule.SubmoduleUpdateTest
updateSubmodule(org.eclipse.egit.ui.submodule.SubmoduleUpdateTest)  Time elapsed: 4.692 sec
Running org.eclipse.egit.ui.submodule.SubmoduleAddTest
Tests run: 1, Failures: 0, Errors: 0, Skipped: 0, Time elapsed: 3.995 sec - in org.eclipse.egit.ui.submodule.SubmoduleAddTest
addAtRoot(org.eclipse.egit.ui.submodule.SubmoduleAddTest)  Time elapsed: 3.987 sec
Running org.eclipse.egit.ui.prefpages.configuration.GlobalConfigurationPageTest

!ENTRY org.eclipse.ui 2 2 2018-08-01 20:38:21.772
!MESSAGE Invalid preference category path: org.eclipse.ui.net.NetPreferences (bundle: org.eclipse.jsch.ui, page: org.eclipse.jsch.ui.SSHPreferences)
Tests run: 11, Failures: 0, Errors: 0, Skipped: 0, Time elapsed: 4.215 sec - in org.eclipse.egit.ui.prefpages.configuration.GlobalConfigurationPageTest
testAddSubSectionEntry(org.eclipse.egit.ui.prefpages.configuration.GlobalConfigurationPageTest)  Time elapsed: 0.429 sec
testAddSectionEntry(org.eclipse.egit.ui.prefpages.configuration.GlobalConfigurationPageTest)  Time elapsed: 0.365 sec
testCanCreateSameEntryValue(org.eclipse.egit.ui.prefpages.configuration.GlobalConfigurationPageTest)  Time elapsed: 0.348 sec
testNodes(org.eclipse.egit.ui.prefpages.configuration.GlobalConfigurationPageTest)  Time elapsed: 0.239 sec
testRemoveValue(org.eclipse.egit.ui.prefpages.configuration.GlobalConfigurationPageTest)  Time elapsed: 0.26 sec
testAddSubSectionEntryWithSuggestion(org.eclipse.egit.ui.prefpages.configuration.GlobalConfigurationPageTest)  Time elapsed: 0.353 sec
testOpenEditor(org.eclipse.egit.ui.prefpages.configuration.GlobalConfigurationPageTest)  Time elapsed: 0.452 sec
testSubsectionWithDot(org.eclipse.egit.ui.prefpages.configuration.GlobalConfigurationPageTest)  Time elapsed: 0.347 sec
testChecksForKey(org.eclipse.egit.ui.prefpages.configuration.GlobalConfigurationPageTest)  Time elapsed: 0.384 sec
testRemoveSubSection(org.eclipse.egit.ui.prefpages.configuration.GlobalConfigurationPageTest)  Time elapsed: 0.349 sec
testRemoveSection(org.eclipse.egit.ui.prefpages.configuration.GlobalConfigurationPageTest)  Time elapsed: 0.338 sec
Running org.eclipse.egit.ui.search.CommitSearchDialogTest
Tests run: 1, Failures: 0, Errors: 0, Skipped: 0, Time elapsed: 2.073 sec - in org.eclipse.egit.ui.search.CommitSearchDialogTest
openCommitTabOnSearchDialog(org.eclipse.egit.ui.search.CommitSearchDialogTest)  Time elapsed: 2.067 sec
Running org.eclipse.egit.ui.search.CommitSearchQueryTest
Tests run: 7, Failures: 0, Errors: 0, Skipped: 0, Time elapsed: 4.351 sec - in org.eclipse.egit.ui.search.CommitSearchQueryTest
testQuery(org.eclipse.egit.ui.search.CommitSearchQueryTest)  Time elapsed: 0.584 sec
testMatchMessage(org.eclipse.egit.ui.search.CommitSearchQueryTest)  Time elapsed: 0.627 sec
testCaseInsensitive(org.eclipse.egit.ui.search.CommitSearchQueryTest)  Time elapsed: 0.6 sec
testMatchCommit(org.eclipse.egit.ui.search.CommitSearchQueryTest)  Time elapsed: 0.632 sec
testMatchParent(org.eclipse.egit.ui.search.CommitSearchQueryTest)  Time elapsed: 0.655 sec
testMatchTree(org.eclipse.egit.ui.search.CommitSearchQueryTest)  Time elapsed: 0.589 sec
testEmptyMatches(org.eclipse.egit.ui.search.CommitSearchQueryTest)  Time elapsed: 0.639 sec

Results :

Tests in error: 
org.eclipse.egit.ui.test.team.actions.BranchAndResetActionTest.testCreateDeleteBranch(org.eclipse.egit.ui.test.team.actions.BranchAndResetActionTest)
  Run 1: BranchAndResetActionTest.testCreateDeleteBranch:303
  Run 2: BranchAndResetActionTest>LocalRepositoryTestCase.resetWorkspace:240 ยป Timeout ...


Tests run: 462, Failures: 0, Errors: 1, Skipped: 12


!ENTRY org.eclipse.core.resources 2 10035 2018-08-01 20:38:34.057
!MESSAGE The workspace will exit with unsaved changes in this session.
[INFO] ------------------------------------------------------------------------
[INFO] Reactor Summary:
[INFO] 
[INFO] EGit Parent ........................................ SUCCESS [ 37.289 s]
[INFO] EGit Target Platform Definition .................... SUCCESS [  5.992 s]
[INFO] Eclipse EGit ....................................... SUCCESS [ 11.312 s]
[INFO] Git Team Provider (Core) ........................... SUCCESS [ 49.094 s]
[INFO] Git Team Provider (UI) ............................. SUCCESS [02:00 min]
[INFO] Git Team Provider (auto-import wizard) ............. SUCCESS [ 13.855 s]
[INFO] EGit Mylyn UI ...................................... SUCCESS [ 15.516 s]
[INFO] Git Team Provider (Documentation) .................. SUCCESS [ 15.851 s]
[INFO] Eclipse EGit Feature ............................... SUCCESS [  3.354 s]
[INFO] EGit Mylyn Feature ................................. SUCCESS [  1.630 s]
[INFO] Git Flow ........................................... SUCCESS [ 10.398 s]
[INFO] Git Flow UI ........................................ SUCCESS [ 20.290 s]
[INFO] Eclipse EGit Gitflow Feature ....................... SUCCESS [  4.705 s]
[INFO] EGit Core Test Plug-in ............................. SUCCESS [06:17 min]
[INFO] GitFlow Test Plug-in ............................... SUCCESS [01:42 min]
[INFO] Eclipse EGit Source Feature ........................ SUCCESS [  8.543 s]
[INFO] EGit P2 Repository ................................. SUCCESS [ 58.822 s]
[INFO] EGit UI Test Plug-in ............................... FAILURE [20:12 min]
[INFO] EGit Mylyn UI Test Plug-in ......................... SKIPPED
[INFO] Git Team Provider (experimental auto-import wizard, incubation) SKIPPED
[INFO] ------------------------------------------------------------------------
[INFO] BUILD FAILURE
[INFO] ------------------------------------------------------------------------
[INFO] Total time: 37:50 min
[INFO] Finished at: 2018-08-01T20:38:35-04:00
[INFO] Final Memory: 188M/863M
[INFO] ------------------------------------------------------------------------
[ERROR] Failed to execute goal org.eclipse.tycho:tycho-surefire-plugin:1.2.0:test (default-test) on project org.eclipse.egit.ui.test: There are test failures.
[ERROR] 
[ERROR] Please refer to /jobs/genie.egit/egit/workspace/org.eclipse.egit.ui.test/target/surefire-reports for the individual test results.
[ERROR] -> [Help 1]
org.apache.maven.lifecycle.LifecycleExecutionException: Failed to execute goal org.eclipse.tycho:tycho-surefire-plugin:1.2.0:test (default-test) on project org.eclipse.egit.ui.test: There are test failures.

Please refer to /jobs/genie.egit/egit/workspace/org.eclipse.egit.ui.test/target/surefire-reports for the individual test results.
    at org.apache.maven.lifecycle.internal.MojoExecutor.execute (MojoExecutor.java:213)
    at org.apache.maven.lifecycle.internal.MojoExecutor.execute (MojoExecutor.java:154)
    at org.apache.maven.lifecycle.internal.MojoExecutor.execute (MojoExecutor.java:146)
    at org.apache.maven.lifecycle.internal.LifecycleModuleBuilder.buildProject (LifecycleModuleBuilder.java:117)
    at org.apache.maven.lifecycle.internal.LifecycleModuleBuilder.buildProject (LifecycleModuleBuilder.java:81)
    at org.apache.maven.lifecycle.internal.builder.singlethreaded.SingleThreadedBuilder.build (SingleThreadedBuilder.java:51)
    at org.apache.maven.lifecycle.internal.LifecycleStarter.execute (LifecycleStarter.java:128)
    at org.apache.maven.DefaultMaven.doExecute (DefaultMaven.java:309)
    at org.apache.maven.DefaultMaven.doExecute (DefaultMaven.java:194)
    at org.apache.maven.DefaultMaven.execute (DefaultMaven.java:107)
    at org.apache.maven.cli.MavenCli.execute (MavenCli.java:955)
    at org.apache.maven.cli.MavenCli.doMain (MavenCli.java:290)
    at org.apache.maven.cli.MavenCli.main (MavenCli.java:194)
    at sun.reflect.NativeMethodAccessorImpl.invoke0 (Native Method)
    at sun.reflect.NativeMethodAccessorImpl.invoke (NativeMethodAccessorImpl.java:62)
    at sun.reflect.DelegatingMethodAccessorImpl.invoke (DelegatingMethodAccessorImpl.java:43)
    at java.lang.reflect.Method.invoke (Method.java:498)
    at org.codehaus.plexus.classworlds.launcher.Launcher.launchEnhanced (Launcher.java:289)
    at org.codehaus.plexus.classworlds.launcher.Launcher.launch (Launcher.java:229)
    at org.codehaus.plexus.classworlds.launcher.Launcher.mainWithExitCode (Launcher.java:415)
    at org.codehaus.plexus.classworlds.launcher.Launcher.main (Launcher.java:356)
Caused by: org.apache.maven.plugin.MojoFailureException: There are test failures.

Please refer to /jobs/genie.egit/egit/workspace/org.eclipse.egit.ui.test/target/surefire-reports for the individual test results.
    at org.eclipse.tycho.surefire.TestMojo.runTest (TestMojo.java:1028)
    at org.eclipse.tycho.surefire.TestMojo.execute (TestMojo.java:678)
    at org.apache.maven.plugin.DefaultBuildPluginManager.executeMojo (DefaultBuildPluginManager.java:134)
    at org.apache.maven.lifecycle.internal.MojoExecutor.execute (MojoExecutor.java:208)
    at org.apache.maven.lifecycle.internal.MojoExecutor.execute (MojoExecutor.java:154)
    at org.apache.maven.lifecycle.internal.MojoExecutor.execute (MojoExecutor.java:146)
    at org.apache.maven.lifecycle.internal.LifecycleModuleBuilder.buildProject (LifecycleModuleBuilder.java:117)
    at org.apache.maven.lifecycle.internal.LifecycleModuleBuilder.buildProject (LifecycleModuleBuilder.java:81)
    at org.apache.maven.lifecycle.internal.builder.singlethreaded.SingleThreadedBuilder.build (SingleThreadedBuilder.java:51)
    at org.apache.maven.lifecycle.internal.LifecycleStarter.execute (LifecycleStarter.java:128)
    at org.apache.maven.DefaultMaven.doExecute (DefaultMaven.java:309)
    at org.apache.maven.DefaultMaven.doExecute (DefaultMaven.java:194)
    at org.apache.maven.DefaultMaven.execute (DefaultMaven.java:107)
    at org.apache.maven.cli.MavenCli.execute (MavenCli.java:955)
    at org.apache.maven.cli.MavenCli.doMain (MavenCli.java:290)
    at org.apache.maven.cli.MavenCli.main (MavenCli.java:194)
    at sun.reflect.NativeMethodAccessorImpl.invoke0 (Native Method)
    at sun.reflect.NativeMethodAccessorImpl.invoke (NativeMethodAccessorImpl.java:62)
    at sun.reflect.DelegatingMethodAccessorImpl.invoke (DelegatingMethodAccessorImpl.java:43)
    at java.lang.reflect.Method.invoke (Method.java:498)
    at org.codehaus.plexus.classworlds.launcher.Launcher.launchEnhanced (Launcher.java:289)
    at org.codehaus.plexus.classworlds.launcher.Launcher.launch (Launcher.java:229)
    at org.codehaus.plexus.classworlds.launcher.Launcher.mainWithExitCode (Launcher.java:415)
    at org.codehaus.plexus.classworlds.launcher.Launcher.main (Launcher.java:356)
[ERROR] 
[ERROR] Re-run Maven using the -X switch to enable full debug logging.
[ERROR] 
[ERROR] For more information about the errors and possible solutions, please read the following articles:
[ERROR] [Help 1] http://cwiki.apache.org/confluence/display/MAVEN/MojoFailureException
[ERROR] 
[ERROR] After correcting the problems, you can resume the build with the command
[ERROR]   mvn <goals> -rf :org.eclipse.egit.ui.test
Build step 'Invoke top-level Maven targets' marked build as failure
Terminating xvnc.
[FINDBUGS] Skipping publisher since build result is FAILURE
[DRY] Skipping publisher since build result is FAILURE
Not sending mail to unregistered user thomas.wolf@xxxxxxxxxx


Back to the top