[Date Prev][Date Next][Thread Prev][Thread Next][Date Index][Thread Index] [List Home]
[eclipse-dev] N-N20031103-200311030800 jdtdebug build test failures


All tests completed on Linux but the debug tests hung on Windows.  We reran the jdtdebug tests and captured the following thread dump on the Windows test machine...

org.eclipse.core.runtime.CoreException: The archive: /DebugTests/src/A.jar which is referenced by the classpath, does not exist.
                at org.eclipse.jdt.launching.JavaRuntime.abort(JavaRuntime.java:1079)
                at org.eclipse.jdt.launching.JavaRuntime.abort(JavaRuntime.java:1065)
                at org.eclipse.jdt.launching.JavaRuntime.resolveRuntimeClasspathEntry(JavaRuntime.java:737)
                at org.eclipse.jdt.launching.StandardClasspathProvider.resolveClasspath(StandardClasspathProvider.java:71)
                at org.eclipse.jdt.launching.JavaRuntime.resolveRuntimeClasspath(JavaRuntime.java:971)
                at org.eclipse.jdt.launching.AbstractJavaLaunchConfigurationDelegate.getClasspath(AbstractJavaLaunchConfigurationDelegate.java:233)
                at org.eclipse.jdt.internal.launching.JavaLocalApplicationLaunchConfigurationDelegate.launch(JavaLocalApplicationLaunchConfigurationDelegate.java:85)
                at org.eclipse.debug.internal.core.LaunchConfiguration.launch(LaunchConfiguration.java:156)
                at org.eclipse.jdt.debug.tests.AbstractDebugTest.launchAndWait(AbstractDebugTest.java:185)
                at org.eclipse.jdt.debug.tests.AbstractDebugTest.launchAndSuspend(AbstractDebugTest.java:225)
                at org.eclipse.jdt.debug.tests.core.LaunchConfigurationArgumentTests.testOutput(LaunchConfigurationArgumentTests.java:275)
                at org.eclipse.jdt.debug.tests.core.LaunchConfigurationArgumentTests.testWithVMArg(LaunchConfigurationArgumentTests.java:236)
                at org.eclipse.jdt.debug.tests.core.LaunchConfigurationArgumentTests.testVMArgSingle(LaunchConfigurationArgumentTests.java:118)
                at sun.reflect.NativeMethodAccessorImpl.invoke0(Native Method)
                at sun.reflect.NativeMethodAccessorImpl.invoke(NativeMethodAccessorImpl.java:39)
                at sun.reflect.DelegatingMethodAccessorImpl.invoke(DelegatingMethodAccessorImpl.java:25)
                at java.lang.reflect.Method.invoke(Method.java:324)
                at junit.framework.TestCase.runTest(TestCase.java:154)
                at junit.framework.TestCase.runBare(TestCase.java:127)
                at junit.framework.TestResult$1.protect(TestResult.java:106)
                at junit.framework.TestResult.runProtected(TestResult.java:124)
                at junit.framework.TestResult.run(TestResult.java:109)
                at junit.framework.TestCase.run(TestCase.java:118)
                at junit.framework.TestSuite.runTest(TestSuite.java:208)
                at junit.framework.TestSuite.run(TestSuite.java:203)
                at junit.framework.TestSuite.runTest(TestSuite.java:208)
                at org.eclipse.jdt.debug.tests.AutomatedSuite$1.run(AutomatedSuite.java:173)
                at java.lang.Thread.run(Thread.java:534)
org.eclipse.core.runtime.CoreException: The archive: /DebugTests/src/A.jar which is referenced by the classpath, does not exist.
                at org.eclipse.jdt.launching.JavaRuntime.abort(JavaRuntime.java:1079)
                at org.eclipse.jdt.launching.JavaRuntime.abort(JavaRuntime.java:1065)
                at org.eclipse.jdt.launching.JavaRuntime.resolveRuntimeClasspathEntry(JavaRuntime.java:737)
                at org.eclipse.jdt.launching.StandardClasspathProvider.resolveClasspath(StandardClasspathProvider.java:71)
                at org.eclipse.jdt.launching.JavaRuntime.resolveRuntimeClasspath(JavaRuntime.java:971)
                at org.eclipse.jdt.launching.AbstractJavaLaunchConfigurationDelegate.getClasspath(AbstractJavaLaunchConfigurationDelegate.java:233)
                at org.eclipse.jdt.internal.launching.JavaLocalApplicationLaunchConfigurationDelegate.launch(JavaLocalApplicationLaunchConfigurationDelegate.java:85)
                at org.eclipse.debug.internal.core.LaunchConfiguration.launch(LaunchConfiguration.java:156)
                at org.eclipse.jdt.debug.tests.AbstractDebugTest.launchAndWait(AbstractDebugTest.java:185)
                at org.eclipse.jdt.debug.tests.AbstractDebugTest.launchAndSuspend(AbstractDebugTest.java:225)
                at org.eclipse.jdt.debug.tests.core.LaunchConfigurationArgumentTests.testOutput(LaunchConfigurationArgumentTests.java:275)
                at org.eclipse.jdt.debug.tests.core.LaunchConfigurationArgumentTests.testWithVMArg(LaunchConfigurationArgumentTests.java:236)
                at org.eclipse.jdt.debug.tests.core.LaunchConfigurationArgumentTests.testVMArgSimpleQuotes(LaunchConfigurationArgumentTests.java:125)
                at sun.reflect.NativeMethodAccessorImpl.invoke0(Native Method)
                at sun.reflect.NativeMethodAccessorImpl.invoke(NativeMethodAccessorImpl.java:39)
                at sun.reflect.DelegatingMethodAccessorImpl.invoke(DelegatingMethodAccessorImpl.java:25)
                at java.lang.reflect.Method.invoke(Method.java:324)
                at junit.framework.TestCase.runTest(TestCase.java:154)
                at junit.framework.TestCase.runBare(TestCase.java:127)
                at junit.framework.TestResult$1.protect(TestResult.java:106)
                at junit.framework.TestResult.runProtected(TestResult.java:124)
                at junit.framework.TestResult.run(TestResult.java:109)
                at junit.framework.TestCase.run(TestCase.java:118)
                at junit.framework.TestSuite.runTest(TestSuite.java:208)
                at junit.framework.TestSuite.run(TestSuite.java:203)
                at junit.framework.TestSuite.runTest(TestSuite.java:208)
                at org.eclipse.jdt.debug.tests.AutomatedSuite$1.run(AutomatedSuite.java:173)
                at java.lang.Thread.run(Thread.java:534)
org.eclipse.core.runtime.CoreException: The archive: /DebugTests/src/A.jar which is referenced by the classpath, does not exist.
                at org.eclipse.jdt.launching.JavaRuntime.abort(JavaRuntime.java:1079)
                at org.eclipse.jdt.launching.JavaRuntime.abort(JavaRuntime.java:1065)
                at org.eclipse.jdt.launching.JavaRuntime.resolveRuntimeClasspathEntry(JavaRuntime.java:737)
                at org.eclipse.jdt.launching.StandardClasspathProvider.resolveClasspath(StandardClasspathProvider.java:71)
                at org.eclipse.jdt.launching.JavaRuntime.resolveRuntimeClasspath(JavaRuntime.java:971)
                at org.eclipse.jdt.launching.AbstractJavaLaunchConfigurationDelegate.getClasspath(AbstractJavaLaunchConfigurationDelegate.java:233)
                at org.eclipse.jdt.internal.launching.JavaLocalApplicationLaunchConfigurationDelegate.launch(JavaLocalApplicationLaunchConfigurationDelegate.java:85)
                at org.eclipse.debug.internal.core.LaunchConfiguration.launch(LaunchConfiguration.java:156)
                at org.eclipse.jdt.debug.tests.AbstractDebugTest.launchAndWait(AbstractDebugTest.java:185)
                at org.eclipse.jdt.debug.tests.AbstractDebugTest.launchAndSuspend(AbstractDebugTest.java:225)
                at org.eclipse.jdt.debug.tests.core.LaunchConfigurationArgumentTests.testOutput(LaunchConfigurationArgumentTests.java:275)
                at org.eclipse.jdt.debug.tests.core.LaunchConfigurationArgumentTests.testWithVMArg(LaunchConfigurationArgumentTests.java:236)
                at org.eclipse.jdt.debug.tests.core.LaunchConfigurationArgumentTests.testVMArgStandardQuotes(LaunchConfigurationArgumentTests.java:133)
                at sun.reflect.NativeMethodAccessorImpl.invoke0(Native Method)
                at sun.reflect.NativeMethodAccessorImpl.invoke(NativeMethodAccessorImpl.java:39)
                at sun.reflect.DelegatingMethodAccessorImpl.invoke(DelegatingMethodAccessorImpl.java:25)
                at java.lang.reflect.Method.invoke(Method.java:324)
                at junit.framework.TestCase.runTest(TestCase.java:154)
                at junit.framework.TestCase.runBare(TestCase.java:127)
                at junit.framework.TestResult$1.protect(TestResult.java:106)
                at junit.framework.TestResult.runProtected(TestResult.java:124)
                at junit.framework.TestResult.run(TestResult.java:109)
                at junit.framework.TestCase.run(TestCase.java:118)
                at junit.framework.TestSuite.runTest(TestSuite.java:208)
                at junit.framework.TestSuite.run(TestSuite.java:203)
                at junit.framework.TestSuite.runTest(TestSuite.java:208)
                at org.eclipse.jdt.debug.tests.AutomatedSuite$1.run(AutomatedSuite.java:173)
                at java.lang.Thread.run(Thread.java:534)
org.eclipse.core.runtime.CoreException: The archive: /DebugTests/src/A.jar which is referenced by the classpath, does not exist.
                at org.eclipse.jdt.launching.JavaRuntime.abort(JavaRuntime.java:1079)
                at org.eclipse.jdt.launching.JavaRuntime.abort(JavaRuntime.java:1065)
                at org.eclipse.jdt.launching.JavaRuntime.resolveRuntimeClasspathEntry(JavaRuntime.java:737)
                at org.eclipse.jdt.launching.StandardClasspathProvider.resolveClasspath(StandardClasspathProvider.java:71)
                at org.eclipse.jdt.launching.JavaRuntime.resolveRuntimeClasspath(JavaRuntime.java:971)
                at org.eclipse.jdt.launching.AbstractJavaLaunchConfigurationDelegate.getClasspath(AbstractJavaLaunchConfigurationDelegate.java:233)
                at org.eclipse.jdt.internal.launching.JavaLocalApplicationLaunchConfigurationDelegate.launch(JavaLocalApplicationLaunchConfigurationDelegate.java:85)
                at org.eclipse.debug.internal.core.LaunchConfiguration.launch(LaunchConfiguration.java:156)
                at org.eclipse.jdt.debug.tests.AbstractDebugTest.launchAndWait(AbstractDebugTest.java:185)
                at org.eclipse.jdt.debug.tests.AbstractDebugTest.launchAndSuspend(AbstractDebugTest.java:225)
                at org.eclipse.jdt.debug.tests.core.LaunchConfigurationArgumentTests.testOutput(LaunchConfigurationArgumentTests.java:275)
                at org.eclipse.jdt.debug.tests.core.LaunchConfigurationArgumentTests.testWithVMArg(LaunchConfigurationArgumentTests.java:236)
                at org.eclipse.jdt.debug.tests.core.LaunchConfigurationArgumentTests.testVMArgStandardEmbeddedQuotes(LaunchConfigurationArgumentTests.java:140)
                at sun.reflect.NativeMethodAccessorImpl.invoke0(Native Method)
                at sun.reflect.NativeMethodAccessorImpl.invoke(NativeMethodAccessorImpl.java:39)
                at sun.reflect.DelegatingMethodAccessorImpl.invoke(DelegatingMethodAccessorImpl.java:25)
                at java.lang.reflect.Method.invoke(Method.java:324)
                at junit.framework.TestCase.runTest(TestCase.java:154)
                at junit.framework.TestCase.runBare(TestCase.java:127)
                at junit.framework.TestResult$1.protect(TestResult.java:106)
                at junit.framework.TestResult.runProtected(TestResult.java:124)
                at junit.framework.TestResult.run(TestResult.java:109)
                at junit.framework.TestCase.run(TestCase.java:118)
                at junit.framework.TestSuite.runTest(TestSuite.java:208)
                at junit.framework.TestSuite.run(TestSuite.java:203)
                at junit.framework.TestSuite.runTest(TestSuite.java:208)
                at org.eclipse.jdt.debug.tests.AutomatedSuite$1.run(AutomatedSuite.java:173)
                at java.lang.Thread.run(Thread.java:534)
org.eclipse.core.runtime.CoreException: The archive: /DebugTests/src/A.jar which is referenced by the classpath, does not exist.
                at org.eclipse.jdt.launching.JavaRuntime.abort(JavaRuntime.java:1079)
                at org.eclipse.jdt.launching.JavaRuntime.abort(JavaRuntime.java:1065)
                at org.eclipse.jdt.launching.JavaRuntime.resolveRuntimeClasspathEntry(JavaRuntime.java:737)
                at org.eclipse.jdt.launching.StandardClasspathProvider.resolveClasspath(StandardClasspathProvider.java:71)
                at org.eclipse.jdt.launching.JavaRuntime.resolveRuntimeClasspath(JavaRuntime.java:971)
                at org.eclipse.jdt.launching.AbstractJavaLaunchConfigurationDelegate.getClasspath(AbstractJavaLaunchConfigurationDelegate.java:233)
                at org.eclipse.jdt.internal.launching.JavaLocalApplicationLaunchConfigurationDelegate.launch(JavaLocalApplicationLaunchConfigurationDelegate.java:85)
                at org.eclipse.debug.internal.core.LaunchConfiguration.launch(LaunchConfiguration.java:156)
                at org.eclipse.jdt.debug.tests.AbstractDebugTest.launchAndWait(AbstractDebugTest.java:185)
                at org.eclipse.jdt.debug.tests.AbstractDebugTest.launchAndSuspend(AbstractDebugTest.java:225)
                at org.eclipse.jdt.debug.tests.core.LaunchConfigurationArgumentTests.testOutput(LaunchConfigurationArgumentTests.java:275)
                at org.eclipse.jdt.debug.tests.core.LaunchConfigurationArgumentTests.testWithVMArg(LaunchConfigurationArgumentTests.java:236)
                at org.eclipse.jdt.debug.tests.core.LaunchConfigurationArgumentTests.testVMArgWorkaroundQuotes(LaunchConfigurationArgumentTests.java:148)
                at sun.reflect.NativeMethodAccessorImpl.invoke0(Native Method)
                at sun.reflect.NativeMethodAccessorImpl.invoke(NativeMethodAccessorImpl.java:39)
                at sun.reflect.DelegatingMethodAccessorImpl.invoke(DelegatingMethodAccessorImpl.java:25)
                at java.lang.reflect.Method.invoke(Method.java:324)
                at junit.framework.TestCase.runTest(TestCase.java:154)
                at junit.framework.TestCase.runBare(TestCase.java:127)
                at junit.framework.TestResult$1.protect(TestResult.java:106)
                at junit.framework.TestResult.runProtected(TestResult.java:124)
                at junit.framework.TestResult.run(TestResult.java:109)
                at junit.framework.TestCase.run(TestCase.java:118)
                at junit.framework.TestSuite.runTest(TestSuite.java:208)
                at junit.framework.TestSuite.run(TestSuite.java:203)
                at junit.framework.TestSuite.runTest(TestSuite.java:208)
                at org.eclipse.jdt.debug.tests.AutomatedSuite$1.run(AutomatedSuite.java:173)
                at java.lang.Thread.run(Thread.java:534)
org.eclipse.core.runtime.CoreException: The archive: /DebugTests/src/A.jar which is referenced by the classpath, does not exist.
                at org.eclipse.jdt.launching.JavaRuntime.abort(JavaRuntime.java:1079)
                at org.eclipse.jdt.launching.JavaRuntime.abort(JavaRuntime.java:1065)
                at org.eclipse.jdt.launching.JavaRuntime.resolveRuntimeClasspathEntry(JavaRuntime.java:737)
                at org.eclipse.jdt.launching.StandardClasspathProvider.resolveClasspath(StandardClasspathProvider.java:71)
                at org.eclipse.jdt.launching.JavaRuntime.resolveRuntimeClasspath(JavaRuntime.java:971)
                at org.eclipse.jdt.launching.AbstractJavaLaunchConfigurationDelegate.getClasspath(AbstractJavaLaunchConfigurationDelegate.java:233)
                at org.eclipse.jdt.internal.launching.JavaLocalApplicationLaunchConfigurationDelegate.launch(JavaLocalApplicationLaunchConfigurationDelegate.java:85)
                at org.eclipse.debug.internal.core.LaunchConfiguration.launch(LaunchConfiguration.java:156)
                at org.eclipse.jdt.debug.tests.AbstractDebugTest.launchAndWait(AbstractDebugTest.java:185)
                at org.eclipse.jdt.debug.tests.AbstractDebugTest.launchAndSuspend(AbstractDebugTest.java:225)
                at org.eclipse.jdt.debug.tests.core.LaunchConfigurationArgumentTests.testOutput(LaunchConfigurationArgumentTests.java:275)
                at org.eclipse.jdt.debug.tests.core.LaunchConfigurationArgumentTests.testWithVMArg(LaunchConfigurationArgumentTests.java:236)
                at org.eclipse.jdt.debug.tests.core.LaunchConfigurationArgumentTests.testVMArgCreativeQuotes(LaunchConfigurationArgumentTests.java:156)
                at sun.reflect.NativeMethodAccessorImpl.invoke0(Native Method)
                at sun.reflect.NativeMethodAccessorImpl.invoke(NativeMethodAccessorImpl.java:39)
                at sun.reflect.DelegatingMethodAccessorImpl.invoke(DelegatingMethodAccessorImpl.java:25)
                at java.lang.reflect.Method.invoke(Method.java:324)
                at junit.framework.TestCase.runTest(TestCase.java:154)
                at junit.framework.TestCase.runBare(TestCase.java:127)
                at junit.framework.TestResult$1.protect(TestResult.java:106)
                at junit.framework.TestResult.runProtected(TestResult.java:124)
                at junit.framework.TestResult.run(TestResult.java:109)
                at junit.framework.TestCase.run(TestCase.java:118)
                at junit.framework.TestSuite.runTest(TestSuite.java:208)
                at junit.framework.TestSuite.run(TestSuite.java:203)
                at junit.framework.TestSuite.runTest(TestSuite.java:208)
                at org.eclipse.jdt.debug.tests.AutomatedSuite$1.run(AutomatedSuite.java:173)
                at java.lang.Thread.run(Thread.java:534)