[Date Prev][Date Next][Thread Prev][Thread Next][Date Index][Thread Index] [List Home]
[ecf-dev] New topic in forum Eclipse Communications Framework (ECF), called BIRT - Girid is not working while deploying , by Thirumal m

Title: Eclipse Community Forums
Subject: BIRT - Girid is not working while deploying Author: Thirumal m Date: Mon, 21 September 2015 05:14
I generated report using girid in eclipse and it worked properly the same template not generating in deploy mode through runtime.


[TestNG] Running:
C:\Users\Enkindle3\AppData\Local\Temp\testng-eclipse--765533619\testng-customsuite.xml

Sep 21, 2015 2:36:46 PM org.eclipse.birt.report.engine.util.ResourceLocatorWrapper findResource
WARNING: Scripts/util.js is not accessible.
Sep 21, 2015 2:36:47 PM org.eclipse.birt.report.engine.api.impl.EngineTask handleFatalExceptions
SEVERE: An error happened while running the report. Cause:
java.lang.IndexOutOfBoundsException: Index: 1, Size: 1
at java.util.ArrayList.rangeCheck(ArrayList.java:604)
at java.util.ArrayList.get(ArrayList.java:382)
at org.eclipse.birt.report.model.elements.GridItem.getCellPositionInColumn(GridItem.java:393)
at org.eclipse.birt.report.model.elements.GridItem.cacheValues(GridItem.java:267)
at org.eclipse.birt.report.model.elements.ReportDesignImpl.doCacheValues(ReportDesignImpl.java:392)
at org.eclipse.birt.report.model.elements.ReportDesignImpl.cacheValues(ReportDesignImpl.java:379)
at org.eclipse.birt.report.model.api.ReportDesignHandleImpl.cacheValues(ReportDesignHandleImpl.java:1541)
at org.eclipse.birt.report.model.api.ReportDesignHandle.cacheValues(ReportDesignHandle.java:1)
at org.eclipse.birt.report.engine.parser.EngineIRVisitor.translate(EngineIRVisitor.java:275)
at org.eclipse.birt.report.engine.parser.ReportParser.parse(ReportParser.java:178)
at org.eclipse.birt.report.engine.executor.ExecutionContext.getReport(ExecutionContext.java:2214)
at org.eclipse.birt.report.engine.executor.ReportExecutor.<init>(ReportExecutor.java:86)
at org.eclipse.birt.report.engine.api.impl.RunAndRenderTask.doRun(RunAndRenderTask.java:107)
at org.eclipse.birt.report.engine.api.impl.RunAndRenderTask.run(RunAndRenderTask.java:77)
at com.essg.core.resource.services.BirtReportAdapterService.generateReport(BirtReportAdapterService.java:75)
at com.essg.core.resource.services.BirtReportAdapterServiceTest.generateReportTest(BirtReportAdapterServiceTest.java:40)
at sun.reflect.NativeMethodAccessorImpl.invoke0(Native Method)
at sun.reflect.NativeMethodAccessorImpl.invoke(NativeMethodAccessorImpl.java:57)
at sun.reflect.DelegatingMethodAccessorImpl.invoke(DelegatingMethodAccessorImpl.java:43)
at java.lang.reflect.Method.invoke(Method.java:606)
at org.testng.internal.MethodInvocationHelper.invokeMethod(MethodInvocationHelper.java:84)
at org.testng.internal.Invoker.invokeMethod(Invoker.java:714)
at org.testng.internal.Invoker.invokeTestMethod(Invoker.java:901)
at org.testng.internal.Invoker.invokeTestMethods(Invoker.java:1231)
at org.testng.internal.TestMethodWorker.invokeTestMethods(TestMethodWorker.java:127)
at org.testng.internal.TestMethodWorker.run(TestMethodWorker.java:111)
at org.testng.TestRunner.privateRun(TestRunner.java:767)
at org.testng.TestRunner.run(TestRunner.java:617)
at org.testng.SuiteRunner.runTest(SuiteRunner.java:334)
at org.testng.SuiteRunner.runSequentially(SuiteRunner.java:329)
at org.testng.SuiteRunner.privateRun(SuiteRunner.java:291)
at org.testng.SuiteRunner.run(SuiteRunner.java:240)
at org.testng.SuiteRunnerWorker.runSuite(SuiteRunnerWorker.java:52)
at org.testng.SuiteRunnerWorker.run(SuiteRunnerWorker.java:86)
at org.testng.TestNG.runSuitesSequentially(TestNG.java:1224)
at org.testng.TestNG.runSuitesLocally(TestNG.java:1149)
at org.testng.TestNG.run(TestNG.java:1057)
at org.testng.remote.RemoteTestNG.run(RemoteTestNG.java:111)
at org.testng.remote.RemoteTestNG.initAndRun(RemoteTestNG.java:204)
at org.testng.remote.RemoteTestNG.main(RemoteTestNG.java:175)

FAILED: generateReportTest
java.lang.RuntimeException: There is no HTTP Context available from here.
at play.mvc.Http$Context.current(Http.java:30)
at com.essg.core.resource.exception.BaseCmsException.<init>(BaseCmsException.java:10)
at com.essg.core.persistence.exception.CMSRequestException.<init>(CMSRequestException.java:13)
at com.essg.core.resource.exception.ErrorFactory.buildException(ErrorFactory.java:174)
at com.essg.core.resource.services.BirtReportAdapterService.generateReport(BirtReportAdapterService.java:81)
at com.essg.core.resource.services.BirtReportAdapterServiceTest.generateReportTest(BirtReportAdapterServiceTest.java:40)
at sun.reflect.NativeMethodAccessorImpl.invoke0(Native Method)
at sun.reflect.NativeMethodAccessorImpl.invoke(NativeMethodAccessorImpl.java:57)
at sun.reflect.DelegatingMethodAccessorImpl.invoke(DelegatingMethodAccessorImpl.java:43)
at java.lang.reflect.Method.invoke(Method.java:606)
at org.testng.internal.MethodInvocationHelper.invokeMethod(MethodInvocationHelper.java:84)
at org.testng.internal.Invoker.invokeMethod(Invoker.java:714)
at org.testng.internal.Invoker.invokeTestMethod(Invoker.java:901)
at org.testng.internal.Invoker.invokeTestMethods(Invoker.java:1231)
at org.testng.internal.TestMethodWorker.invokeTestMethods(TestMethodWorker.java:127)
at org.testng.internal.TestMethodWorker.run(TestMethodWorker.java:111)
at org.testng.TestRunner.privateRun(TestRunner.java:767)
at org.testng.TestRunner.run(TestRunner.java:617)
at org.testng.SuiteRunner.runTest(SuiteRunner.java:334)
at org.testng.SuiteRunner.runSequentially(SuiteRunner.java:329)
at org.testng.SuiteRunner.privateRun(SuiteRunner.java:291)
at org.testng.SuiteRunner.run(SuiteRunner.java:240)
at org.testng.SuiteRunnerWorker.runSuite(SuiteRunnerWorker.java:52)
at org.testng.SuiteRunnerWorker.run(SuiteRunnerWorker.java:86)
at org.testng.TestNG.runSuitesSequentially(TestNG.java:1224)
at org.testng.TestNG.runSuitesLocally(TestNG.java:1149)
at org.testng.TestNG.run(TestNG.java:1057)
at org.testng.remote.RemoteTestNG.run(RemoteTestNG.java:111)
at org.testng.remote.RemoteTestNG.initAndRun(RemoteTestNG.java:204)
at org.testng.remote.RemoteTestNG.main(RemoteTestNG.java:175)


===============================================
Default test
Tests run: 1, Failures: 1, Skips: 0
===============================================


===============================================
Default suite
Total tests run: 1, Failures: 1, Skips: 0
===============================================

[TestNG] Time taken by org.testng.reporters.jq.Main@62dba79e: 127 ms
[TestNG] Time taken by org.testng.reporters.XMLReporter@50625c49: 21 ms
[TestNG] Time taken by [FailedReporter passed=0 failed=0 skipped=0]: 18 ms
[TestNG] Time taken by org.testng.reporters.EmailableReporter2@547ab2e8: 20 ms
[TestNG] Time taken by org.testng.reporters.JUnitReportReporter@2de7753a: 18 ms
[TestNG] Time taken by org.testng.reporters.SuiteHTMLReporter@7f1e1a8e: 131 ms
[ Reply ][ Quote ][ View Topic/Message ][ Unsubscribe from this forum ]