[Date Prev][Date Next][Thread Prev][Thread Next][Date Index][Thread Index] [List Home]
[atf-dev] Build failed in Hudson: cbi-atf-0.3-nightly #1315

See <https://hudson.eclipse.org/hudson/job/cbi-atf-0.3-nightly/1315/>

------------------------------------------
Started by timer
Building remotely on Fastlane
Checkout:cbi-atf-0.3-nightly / <https://hudson.eclipse.org/hudson/job/cbi-atf-0.3-nightly/ws/> - hudson.remoting.Channel@28ee1c42:Fastlane
Using strategy: Default
Last Built Revision: Revision 24f48ce28827d342050362522499e09234a26052 (origin/master)
Checkout:cbi-atf-0.3-nightly / <https://hudson.eclipse.org/hudson/job/cbi-atf-0.3-nightly/ws/> - hudson.remoting.LocalChannel@6eee44aa
Fetching changes from the remote Git repository
Fetching upstream changes from git://git.eclipse.org/gitroot/atf/org.eclipse.atf.git
Commencing build of Revision 24f48ce28827d342050362522499e09234a26052 (origin/master)
Checking out Revision 24f48ce28827d342050362522499e09234a26052 (origin/master)
Deleting old artifacts from #1313
[cbi-atf-0.3-nightly] $ /bin/sh -xe /tmp/hudson4942159768971924631.sh
+ export BUILDTYPE=N
+ BUILDTYPE=N
+ export 'EXTRAFLAGS=-localSourceCheckoutDir <https://hudson.eclipse.org/hudson/job/cbi-atf-0.3-nightly/ws/components'>
+ EXTRAFLAGS='-localSourceCheckoutDir <https://hudson.eclipse.org/hudson/job/cbi-atf-0.3-nightly/ws/components'>
+ . <https://hudson.eclipse.org/hudson/job/cbi-atf-0.3-nightly/ws/components/releng/org.eclipse.atf.releng/hudson/atf.sh>
+++ date '+%Y/%m/%d %H:%M'
++ echo '[2012/06/04 19:15] Hudson job  build #1315 (2012-06-04_19-15-30) started.'
[2012/06/04 19:15] Hudson job  build #1315 (2012-06-04_19-15-30) started.
+++ date +%Y%m%d%H%M
++ buildTimestamp=201206041915
++ projectid=tools.atf
++ version=0.3.0
++ projRelengRoot='-projRelengRoot :pserver:anonymous@xxxxxxxxxxxxxxx:/cvsroot/tools'
++ projRelengPath='-projRelengPath org.eclipse.atf/components/releng/org.eclipse.atf.releng'
++ cvsProjectBaseDir=/opt/public/cbi/build
++ [[ ! -d /opt/public/cbi/build ]]
++ [[ ! -d /opt/public/cbi/build ]]
++ thirdPartyJarsDir=/opt/public/cbi/build/3rdPartyJars
++ [[ ! -d /opt/public/cbi/build/3rdPartyJars ]]
++ [[ ! -d /opt/public/cbi/build/3rdPartyJars ]]
++ [[ -n N ]]
++ buildType=N
++ writableBuildRoot=<https://hudson.eclipse.org/hudson/job/cbi-atf-0.3-nightly/ws/build>
++ [[ -d <https://hudson.eclipse.org/hudson/job/cbi-atf-0.3-nightly/ws/build> ]]
++ rm -fr <https://hudson.eclipse.org/hudson/job/cbi-atf-0.3-nightly/ws/build>
++ downloadsDir=<https://hudson.eclipse.org/hudson/job/cbi-atf-0.3-nightly/ws/build/downloads>
++ signingDir=<https://hudson.eclipse.org/hudson/job/cbi-atf-0.3-nightly/ws/build/signing>
++ buildDir=<https://hudson.eclipse.org/hudson/job/cbi-atf-0.3-nightly/1315/artifact/build/N201206041915>
++ mkdir -p <https://hudson.eclipse.org/hudson/job/cbi-atf-0.3-nightly/ws/build/downloads> <https://hudson.eclipse.org/hudson/job/cbi-atf-0.3-nightly/ws/build/signing> <https://hudson.eclipse.org/hudson/job/cbi-atf-0.3-nightly/1315/artifact/build/N201206041915>
++ touch <https://hudson.eclipse.org/hudson/job/cbi-atf-0.3-nightly/ws/build/.cvspass>
++ relengBaseBuilderDir=<https://hudson.eclipse.org/hudson/job/cbi-atf-0.3-nightly/ws/build/org.eclipse.releng.basebuilder>
++ relengCommonBuilderDir=<https://hudson.eclipse.org/hudson/job/cbi-atf-0.3-nightly/ws/build/org.eclipse.dash.common.releng>
++ ln -s /opt/public/cbi/build/org.eclipse.releng.basebuilder <https://hudson.eclipse.org/hudson/job/cbi-atf-0.3-nightly/ws/build/>
++ ln -s /opt/public/cbi/build/org.eclipse.dash.common.releng <https://hudson.eclipse.org/hudson/job/cbi-atf-0.3-nightly/ws/build/>
++ ln -s /opt/public/cbi/build/3rdPartyJars <https://hudson.eclipse.org/hudson/job/cbi-atf-0.3-nightly/ws/build/>
++ thirdPartyJarsDir=<https://hudson.eclipse.org/hudson/job/cbi-atf-0.3-nightly/ws/build/3rdPartyJars>
++ cd <https://hudson.eclipse.org/hudson/job/cbi-atf-0.3-nightly/ws/build/org.eclipse.dash.common.releng/tools/scripts>
++ ./start.sh -projectid tools.atf -version 0.3.0 -buildType N -buildTimestamp 201206041915 -writableBuildRoot <https://hudson.eclipse.org/hudson/job/cbi-atf-0.3-nightly/ws/build> -thirdPartyJarsDir <https://hudson.eclipse.org/hudson/job/cbi-atf-0.3-nightly/ws/build/3rdPartyJars> -downloadsDir <https://hudson.eclipse.org/hudson/job/cbi-atf-0.3-nightly/ws/build/downloads> -buildDir <https://hudson.eclipse.org/hudson/job/cbi-atf-0.3-nightly/1315/artifact/build/N201206041915> -projRelengRoot :pserver:anonymous@xxxxxxxxxxxxxxx:/cvsroot/tools -projRelengPath org.eclipse.atf/components/releng/org.eclipse.atf.releng -localSourceCheckoutDir <https://hudson.eclipse.org/hudson/job/cbi-atf-0.3-nightly/ws/components>
Found cvs: /usr/bin/cvs /usr/bin/X11/cvs /usr/share/cvs /usr/share/man/man1/cvs.1.gz /usr/share/man/man5/cvs.5.gz
Found svn in PATH=
/bin:/usr/bin/:/usr/local/bin
Found wget: /usr/bin/wget /usr/bin/X11/wget /usr/share/man/man1/wget.1.gz
Found vncserver in PATH=
/bin:/usr/bin/:/usr/local/bin
Found Xvfb in PATH=
/bin:/usr/bin/:/usr/local/bin
Found Xvnc in PATH=
/bin:/usr/bin/:/usr/local/bin
WARNING: You may require 1 or more of the following tools for this build to proceed:
  javac
[start] [19:15:38] Started on 20120604 with these options:
   -projectid tools.atf
   -version 0.3.0
   -buildType N
   -buildTimestamp 201206041915
   -writableBuildRoot <https://hudson.eclipse.org/hudson/job/cbi-atf-0.3-nightly/ws/build>
   -thirdPartyJarsDir <https://hudson.eclipse.org/hudson/job/cbi-atf-0.3-nightly/ws/build/3rdPartyJars>
   -downloadsDir <https://hudson.eclipse.org/hudson/job/cbi-atf-0.3-nightly/ws/build/downloads>
   -buildDir <https://hudson.eclipse.org/hudson/job/cbi-atf-0.3-nightly/1315/artifact/build/N201206041915>
   -projRelengRoot :pserver:anonymous@xxxxxxxxxxxxxxx:/cvsroot/tools
   -projRelengPath org.eclipse.atf/components/releng/org.eclipse.atf.releng
   -localSourceCheckoutDir <https://hudson.eclipse.org/hudson/job/cbi-atf-0.3-nightly/ws/components>

[start] Create build directory <https://hudson.eclipse.org/hudson/job/cbi-atf-0.3-nightly/1315/artifact/build/N201206041915>

  cvs -d :pserver:anonymous@xxxxxxxxxxxxxxx:/cvsroot/tools -Q ex -r HEAD -d org.eclipse.atf.releng org.eclipse.atf/components/releng/org.eclipse.atf.releng
[start] [19:15:38] Export done.

[start] Export skipped: org.eclipse.dash.common.releng already exists.

[start] Export skipped: org.eclipse.releng.basebuilder already exists.

Environment variables:
  HOME      = <https://hudson.eclipse.org/hudson/job/cbi-atf-0.3-nightly/ws/build>
  JAVA_HOME = /shared/common/jdk-1.5.0-22.x86_64
  ANT_HOME  = /opt/public/common/apache-ant-1.7.1
  ANT       = /opt/public/common/apache-ant-1.7.1/bin/ant

[start] mapVersionTag: HEAD
[start] [19:15:39] Invoke Eclipse build
 
[19:15:39]
  /shared/common/jdk-1.5.0-22.x86_64/bin/java 
  -enableassertions
  -cp <https://hudson.eclipse.org/hudson/job/cbi-atf-0.3-nightly/ws/build/org.eclipse.releng.basebuilder/plugins/org.eclipse.equinox.launcher_1.0.200.v20090520.jar> org.eclipse.equinox.launcher.Main
  -application org.eclipse.ant.core.antRunner
  -f <https://hudson.eclipse.org/hudson/job/cbi-atf-0.3-nightly/ws/build/org.eclipse.dash.common.releng/buildAll.xml> run
  -Dprojectid=tools.atf
  -DbuildTimestamp=201206041915
  -DbuildType=N
  -Dversion=0.3.0
  -DwritableBuildRoot=<https://hudson.eclipse.org/hudson/job/cbi-atf-0.3-nightly/ws/build>
  -DdownloadsDir=<https://hudson.eclipse.org/hudson/job/cbi-atf-0.3-nightly/ws/build/downloads>
  -DthirdPartyJarsDir=<https://hudson.eclipse.org/hudson/job/cbi-atf-0.3-nightly/ws/build/3rdPartyJars>
  -DbuildDir=<https://hudson.eclipse.org/hudson/job/cbi-atf-0.3-nightly/1315/artifact/build/N201206041915>
  -DrelengBuilderDir=<https://hudson.eclipse.org/hudson/job/cbi-atf-0.3-nightly/ws/build/org.eclipse.atf.releng>
  -DrelengCommonBuilderDir=<https://hudson.eclipse.org/hudson/job/cbi-atf-0.3-nightly/ws/build/org.eclipse.dash.common.releng>
  -DrelengBaseBuilderDir=<https://hudson.eclipse.org/hudson/job/cbi-atf-0.3-nightly/ws/build/org.eclipse.releng.basebuilder>
  -DJAVA_HOME=/shared/common/jdk-1.5.0-22.x86_64
  -DmapVersionTag=HEAD
  -DlocalSourceCheckoutDir=<https://hudson.eclipse.org/hudson/job/cbi-atf-0.3-nightly/ws/components>
Buildfile: <https://hudson.eclipse.org/hudson/job/cbi-atf-0.3-nightly/ws/build/org.eclipse.dash.common.releng/buildAll.xml>

init:

check.ant-contrib:

resolvepaths:

init:

genBuildCfgInit:
Trying to override old definition of task resolvepath

projectid2names:

genBuildCfg:
Trying to override old definition of task resolvepath

createBuildConfigFile:
Trying to override old definition of task resolvepath

initCommandlineArgsList:
Trying to override old definition of task resolvepath

load.properties:
     [echo] Load properties from <https://hudson.eclipse.org/hudson/job/cbi-atf-0.3-nightly/ws/build/org.eclipse.atf.releng/build.properties>
     [echo] 
     [echo] Loaded JAVA*_HOME and bootclasspath values:
     [echo]         JAVA_HOME = /shared/common/jdk-1.5.0-22.x86_64
     [echo]       JAVA14_HOME = /shared/common/jdk-1.5.0-22.x86_64, J2SE-1.4 = /shared/common/jdk-1.5.0-22.x86_64/lib/vm.jar:/shared/common/jdk-1.5.0-22.x86_64/jre/lib/vm.jar:/shared/common/jdk-1.5.0-22.x86_64/lib/dt.jar:/shared/common/jdk-1.5.0-22.x86_64/jre/lib/dt.jar:/shared/common/jdk-1.5.0-22.x86_64/lib/rt.jar:/shared/common/jdk-1.5.0-22.x86_64/jre/lib/rt.jar:/shared/common/jdk-1.5.0-22.x86_64/lib/core.jar:/shared/common/jdk-1.5.0-22.x86_64/jre/lib/core.jar:/shared/common/jdk-1.5.0-22.x86_64/lib/xml.jar:/shared/common/jdk-1.5.0-22.x86_64/jre/lib/xml.jar:/shared/common/jdk-1.5.0-22.x86_64/lib/graphics.jar:/shared/common/jdk-1.5.0-22.x86_64/jre/lib/graphics.jar:/shared/common/jdk-1.5.0-22.x86_64/lib/server.jar:/shared/common/jdk-1.5.0-22.x86_64/jre/lib/server.jar:/shared/common/jdk-1.5.0-22.x86_64/lib/ibmorbapi.jar:/shared/common/jdk-1.5.0-22.x86_64/jre/lib/ibmorbapi.jar:/shared/common/jdk-1.5.0-22.x86_64/lib/security.jar:/shared/common/jdk-1.5.0-22.x86_64/jre/lib/security.jar:/shared/common/jdk-1.5.0-22.x86_64/lib/classes.jar:/shared/common/jdk-1.5.0-22.x86_64/jre/lib/classes.jar:/shared/common/jdk-1.5.0-22.x86_64/jre/lib/jce.jar:/shared/common/jdk-1.5.0-22.x86_64/lib/jsse.jar:/shared/common/jdk-1.5.0-22.x86_64/jre/lib/jsse.jar:/shared/common/jdk-1.5.0-22.x86_64/../Classes/dt.jar:/shared/common/jdk-1.5.0-22.x86_64/../Classes/classes.jar:/shared/common/jdk-1.5.0-22.x86_64/../Classes/jsse.jar:/shared/common/jdk-1.5.0-22.x86_64/../Classes/jce.jar
     [echo]       JAVA50_HOME = /shared/common/jdk-1.5.0-22.x86_64, J2SE-1.5 = /shared/common/jdk-1.5.0-22.x86_64/jre/lib/rt.jar:/shared/common/jdk-1.5.0-22.x86_64/jre/lib/vm.jar:/shared/common/jdk-1.5.0-22.x86_64/jre/lib/core.jar:/shared/common/jdk-1.5.0-22.x86_64/jre/lib/xml.jar:/shared/common/jdk-1.5.0-22.x86_64/jre/lib/graphics.jar:/shared/common/jdk-1.5.0-22.x86_64/jre/lib/server.jar:/shared/common/jdk-1.5.0-22.x86_64/jre/lib/ibmorbapi.jar:/shared/common/jdk-1.5.0-22.x86_64/jre/lib/security.jar:/shared/common/jdk-1.5.0-22.x86_64/jre/lib/classes.jar:/shared/common/jdk-1.5.0-22.x86_64/jre/lib/jsse.jar:/shared/common/jdk-1.5.0-22.x86_64/jre/lib/jce.jar:/shared/common/jdk-1.5.0-22.x86_64/jre/lib/ibmjcefw.jar:/shared/common/jdk-1.5.0-22.x86_64/../Classes/dt.jar:/shared/common/jdk-1.5.0-22.x86_64/../Classes/classes.jar:/shared/common/jdk-1.5.0-22.x86_64/../Classes/jsse.jar:/shared/common/jdk-1.5.0-22.x86_64/../Classes/jce.jar
     [echo]       JAVA60_HOME = /shared/common/jdk-1.6.x86_64, JavaSE-1.6 = /shared/common/jdk-1.6.x86_64/jre/lib/rt.jar:/shared/common/jdk-1.6.x86_64/jre/lib/core.jar:/shared/common/jdk-1.6.x86_64/jre/lib/annotation.jar:/shared/common/jdk-1.6.x86_64/jre/lib/beans.jar:/shared/common/jdk-1.6.x86_64/jre/lib/ibmorbapi.jar:/shared/common/jdk-1.6.x86_64/jre/lib/java.util.jar:/shared/common/jdk-1.6.x86_64/jre/lib/jlm.jar:/shared/common/jdk-1.6.x86_64/jre/lib/logging.jar:/shared/common/jdk-1.6.x86_64/jre/lib/resources.jar:/shared/common/jdk-1.6.x86_64/jre/lib/security.jar:/shared/common/jdk-1.6.x86_64/jre/lib/sql.jar:/shared/common/jdk-1.6.x86_64/jre/lib/vm.jar:/shared/common/jdk-1.6.x86_64/jre/lib/xmldsigfw.jar:/shared/common/jdk-1.6.x86_64/jre/lib/xml.jar:/shared/common/jdk-1.6.x86_64/jre/lib/graphics.jar:/shared/common/jdk-1.6.x86_64/jre/lib/server.jar:/shared/common/jdk-1.6.x86_64/jre/lib/jce.jar:/shared/common/jdk-1.6.x86_64/jre/lib/jsse.jar:/shared/common/jdk-1.6.x86_64/jre/lib/ibmjcefw.jar:/shared/common/jdk-1.6.x86_64/lib/dt.jar:/shared/common/jdk-1.6.x86_64/../Classes/dt.jar:/shared/common/jdk-1.6.x86_64/../Classes/classes.jar:/shared/common/jdk-1.6.x86_64/../Classes/jsse.jar:/shared/common/jdk-1.6.x86_64/../Classes/jce.jar
     [echo] Created <https://hudson.eclipse.org/hudson/job/cbi-atf-0.3-nightly/1315/artifact/build/N201206041915/build.cfg>
Trying to override old definition of task resolvepath

collectMapTypes:
     [echo] Found these map entry types: local
Trying to override old definition of task resolvepath

collectURLs:

getZip:
      [get] Getting: http://download.eclipse.org/eclipse/downloads/drops/R-3.6.2-201102101200/eclipse-SDK-3.6.2-linux-gtk-x86_64.tar.gz
      [get] To: <https://hudson.eclipse.org/hudson/job/cbi-atf-0.3-nightly/ws/build/downloads/eclipse-SDK-3.6.2-linux-gtk-x86_64.tar.gz>
      [get] Error opening connection java.io.FileNotFoundException: http://download.eclipse.org/eclipse/downloads/drops/R-3.6.2-201102101200/eclipse-SDK-3.6.2-linux-gtk-x86_64.tar.gz
      [get] Error opening connection java.io.FileNotFoundException: http://download.eclipse.org/eclipse/downloads/drops/R-3.6.2-201102101200/eclipse-SDK-3.6.2-linux-gtk-x86_64.tar.gz
      [get] Error opening connection java.io.FileNotFoundException: http://download.eclipse.org/eclipse/downloads/drops/R-3.6.2-201102101200/eclipse-SDK-3.6.2-linux-gtk-x86_64.tar.gz
      [get] Can't get http://download.eclipse.org/eclipse/downloads/drops/R-3.6.2-201102101200/eclipse-SDK-3.6.2-linux-gtk-x86_64.tar.gz to <https://hudson.eclipse.org/hudson/job/cbi-atf-0.3-nightly/ws/build/downloads/eclipse-SDK-3.6.2-linux-gtk-x86_64.tar.gz>

BUILD FAILED
<https://hudson.eclipse.org/hudson/job/cbi-atf-0.3-nightly/ws/build/org.eclipse.dash.common.releng/tools/scripts/buildAllHelper.xml>:2831: The following error occurred while executing this line:
<https://hudson.eclipse.org/hudson/job/cbi-atf-0.3-nightly/ws/build/org.eclipse.dash.common.releng/tools/scripts/buildAllHelper.xml>:3035: The following error occurred while executing this line:
<https://hudson.eclipse.org/hudson/job/cbi-atf-0.3-nightly/ws/build/org.eclipse.dash.common.releng/tools/scripts/buildAllHelper.xml>:3202: Can't get http://download.eclipse.org/eclipse/downloads/drops/R-3.6.2-201102101200/eclipse-SDK-3.6.2-linux-gtk-x86_64.tar.gz to <https://hudson.eclipse.org/hudson/job/cbi-atf-0.3-nightly/ws/build/downloads/eclipse-SDK-3.6.2-linux-gtk-x86_64.tar.gz>

Total time: 2 seconds
[start] [19:15:48] start.sh finished.

++ rm -f <https://hudson.eclipse.org/hudson/job/cbi-atf-0.3-nightly/ws/build/.cvspass>
+++ date '+%Y/%m/%d %H:%M'
++ echo '[2012/06/04 19:15] Hudson job  build #1315 (2012-06-04_19-15-30) done.'
[2012/06/04 19:15] Hudson job  build #1315 (2012-06-04_19-15-30) done.
Recording test results
No test report files were found. Configuration error?
Archiving artifacts