[Date Prev][Date Next][Thread Prev][Thread Next][Date Index][Thread Index] [List Home]
[atf-dev] Build failed in Hudson: cbi-atf-0.3-nightly #484

See <https://build.eclipse.org/hudson/job/cbi-atf-0.3-nightly/484/>

------------------------------------------
[...truncated 516 lines...]
   [p2.dir] java.lang.ClassNotFoundException: org.eclipse.core.internal.runtime.PlatformActivator
   [p2.dir] 	at org.eclipse.osgi.internal.loader.BundleLoader.findClassInternal(BundleLoader.java:489)
   [p2.dir] 	at org.eclipse.osgi.internal.loader.BundleLoader.findClass(BundleLoader.java:405)
   [p2.dir] 	at org.eclipse.osgi.internal.loader.BundleLoader.findClass(BundleLoader.java:393)
   [p2.dir] 	at org.eclipse.osgi.internal.baseadaptor.DefaultClassLoader.loadClass(DefaultClassLoader.java:105)
   [p2.dir] 	at java.lang.ClassLoader.loadClass(ClassLoader.java:595)
   [p2.dir] 	at org.eclipse.osgi.internal.loader.BundleLoader.loadClass(BundleLoader.java:321)
   [p2.dir] 	at org.eclipse.osgi.framework.internal.core.BundleHost.loadClass(BundleHost.java:231)
   [p2.dir] 	at org.eclipse.osgi.framework.internal.core.AbstractBundle.loadBundleActivator(AbstractBundle.java:150)
   [p2.dir] 	at org.eclipse.osgi.framework.internal.core.BundleContextImpl.start(BundleContextImpl.java:750)
   [p2.dir] 	at org.eclipse.osgi.framework.internal.core.BundleHost.startWorker(BundleHost.java:352)
   [p2.dir] 	at org.eclipse.osgi.framework.internal.core.AbstractBundle.resume(AbstractBundle.java:370)
   [p2.dir] 	at org.eclipse.osgi.framework.internal.core.Framework.resumeBundle(Framework.java:1068)
   [p2.dir] 	at org.eclipse.osgi.framework.internal.core.StartLevelManager.setBundleSL(StartLevelManager.java:691)
   [p2.dir] 	at org.eclipse.osgi.framework.internal.core.StartLevelManager.dispatchEvent(StartLevelManager.java:442)
   [p2.dir] 	at org.eclipse.osgi.framework.eventmgr.EventManager.dispatchEvent(EventManager.java:220)
   [p2.dir] 	at org.eclipse.osgi.framework.eventmgr.EventManager$EventThread.run(EventManager.java:330)
   [p2.dir] 
   [p2.dir] !ENTRY org.eclipse.equinox.p2.reconciler.dropins 4 0 2010-05-17 19:16:55.240
   [p2.dir] !MESSAGE 
   [p2.dir] !STACK 0
   [p2.dir] java.util.zip.ZipException: No such file or directory <https://build.eclipse.org/hudson/job/cbi-atf-0.3-nightly/484/artifact/build/N201005171916/eclipse/plugins/org.eclipse.equinox.p2.reconciler.dropins_1.0.100.v20090520-1905.jar>
   [p2.dir] 	at java.util.zip.ZipFile.open(Native Method)
   [p2.dir] 	at java.util.zip.ZipFile.<init>(ZipFile.java:238)
   [p2.dir] 	at java.util.zip.ZipFile.<init>(ZipFile.java:268)
   [p2.dir] 	at org.eclipse.osgi.framework.util.SecureAction.getZipFile(SecureAction.java:251)
   [p2.dir] 	at org.eclipse.osgi.baseadaptor.bundlefile.ZipBundleFile.basicOpen(ZipBundleFile.java:88)
   [p2.dir] 	at org.eclipse.osgi.baseadaptor.bundlefile.ZipBundleFile.getZipFile(ZipBundleFile.java:101)
   [p2.dir] 	at org.eclipse.osgi.baseadaptor.bundlefile.ZipBundleFile.checkedOpen(ZipBundleFile.java:74)
   [p2.dir] 	at org.eclipse.osgi.baseadaptor.bundlefile.ZipBundleFile.getEntry(ZipBundleFile.java:246)
   [p2.dir] 	at org.eclipse.osgi.baseadaptor.loader.ClasspathManager.findClassImpl(ClasspathManager.java:527)
   [p2.dir] 	at org.eclipse.osgi.baseadaptor.loader.ClasspathManager.findLocalClassImpl(ClasspathManager.java:477)
   [p2.dir] 	at org.eclipse.osgi.baseadaptor.loader.ClasspathManager.findLocalClass_LockClassLoader(ClasspathManager.java:465)
   [p2.dir] 	at org.eclipse.osgi.baseadaptor.loader.ClasspathManager.findLocalClass(ClasspathManager.java:445)
   [p2.dir] 	at org.eclipse.osgi.internal.baseadaptor.DefaultClassLoader.findLocalClass(DefaultClassLoader.java:211)
   [p2.dir] 	at org.eclipse.osgi.internal.loader.BundleLoader.findLocalClass(BundleLoader.java:376)
   [p2.dir] 	at org.eclipse.osgi.internal.loader.BundleLoader.findClassInternal(BundleLoader.java:452)
   [p2.dir] 	at org.eclipse.osgi.internal.loader.BundleLoader.findClass(BundleLoader.java:405)
   [p2.dir] 	at org.eclipse.osgi.internal.loader.BundleLoader.findClass(BundleLoader.java:393)
   [p2.dir] 	at org.eclipse.osgi.internal.baseadaptor.DefaultClassLoader.loadClass(DefaultClassLoader.java:105)
   [p2.dir] 	at java.lang.ClassLoader.loadClass(ClassLoader.java:595)
   [p2.dir] 	at org.eclipse.osgi.internal.loader.BundleLoader.loadClass(BundleLoader.java:321)
   [p2.dir] 	at org.eclipse.osgi.framework.internal.core.BundleHost.loadClass(BundleHost.java:231)
   [p2.dir] 	at org.eclipse.osgi.framework.internal.core.AbstractBundle.loadBundleActivator(AbstractBundle.java:150)
   [p2.dir] 	at org.eclipse.osgi.framework.internal.core.BundleContextImpl.start(BundleContextImpl.java:750)
   [p2.dir] 	at org.eclipse.osgi.framework.internal.core.BundleHost.startWorker(BundleHost.java:352)
   [p2.dir] 	at org.eclipse.osgi.framework.internal.core.AbstractBundle.resume(AbstractBundle.java:370)
   [p2.dir] 	at org.eclipse.osgi.framework.internal.core.Framework.resumeBundle(Framework.java:1068)
   [p2.dir] 	at org.eclipse.osgi.framework.internal.core.StartLevelManager.setBundleSL(StartLevelManager.java:691)
   [p2.dir] 	at org.eclipse.osgi.framework.internal.core.StartLevelManager.dispatchEvent(StartLevelManager.java:442)
   [p2.dir] 	at org.eclipse.osgi.framework.eventmgr.EventManager.dispatchEvent(EventManager.java:220)
   [p2.dir] 	at org.eclipse.osgi.framework.eventmgr.EventManager$EventThread.run(EventManager.java:330)
   [p2.dir] 
   [p2.dir] !ENTRY org.eclipse.equinox.p2.reconciler.dropins 4 0 2010-05-17 19:16:55.243
   [p2.dir] !MESSAGE 
   [p2.dir] !STACK 0
   [p2.dir] org.osgi.framework.BundleException: The activator org.eclipse.equinox.internal.p2.reconciler.dropins.Activator for bundle org.eclipse.equinox.p2.reconciler.dropins is invalid
   [p2.dir] 	at org.eclipse.osgi.framework.internal.core.AbstractBundle.loadBundleActivator(AbstractBundle.java:157)
   [p2.dir] 	at org.eclipse.osgi.framework.internal.core.BundleContextImpl.start(BundleContextImpl.java:750)
   [p2.dir] 	at org.eclipse.osgi.framework.internal.core.BundleHost.startWorker(BundleHost.java:352)
   [p2.dir] 	at org.eclipse.osgi.framework.internal.core.AbstractBundle.resume(AbstractBundle.java:370)
   [p2.dir] 	at org.eclipse.osgi.framework.internal.core.Framework.resumeBundle(Framework.java:1068)
   [p2.dir] 	at org.eclipse.osgi.framework.internal.core.StartLevelManager.setBundleSL(StartLevelManager.java:691)
   [p2.dir] 	at org.eclipse.osgi.framework.internal.core.StartLevelManager.dispatchEvent(StartLevelManager.java:442)
   [p2.dir] 	at org.eclipse.osgi.framework.eventmgr.EventManager.dispatchEvent(EventManager.java:220)
   [p2.dir] 	at org.eclipse.osgi.framework.eventmgr.EventManager$EventThread.run(EventManager.java:330)
   [p2.dir] Caused by: java.lang.ClassNotFoundException: org.eclipse.equinox.internal.p2.reconciler.dropins.Activator
   [p2.dir] 	at org.eclipse.osgi.internal.loader.BundleLoader.findClassInternal(BundleLoader.java:489)
   [p2.dir] 	at org.eclipse.osgi.internal.loader.BundleLoader.findClass(BundleLoader.java:405)
   [p2.dir] 	at org.eclipse.osgi.internal.loader.BundleLoader.findClass(BundleLoader.java:393)
   [p2.dir] 	at org.eclipse.osgi.internal.baseadaptor.DefaultClassLoader.loadClass(DefaultClassLoader.java:105)
   [p2.dir] 	at java.lang.ClassLoader.loadClass(ClassLoader.java:595)
   [p2.dir] 	at org.eclipse.osgi.internal.loader.BundleLoader.loadClass(BundleLoader.java:321)
   [p2.dir] 	at org.eclipse.osgi.framework.internal.core.BundleHost.loadClass(BundleHost.java:231)
   [p2.dir] 	at org.eclipse.osgi.framework.internal.core.AbstractBundle.loadBundleActivator(AbstractBundle.java:150)
   [p2.dir] 	... 8 more
   [p2.dir] Root exception:
   [p2.dir] java.lang.ClassNotFoundException: org.eclipse.equinox.internal.p2.reconciler.dropins.Activator
   [p2.dir] 	at org.eclipse.osgi.internal.loader.BundleLoader.findClassInternal(BundleLoader.java:489)
   [p2.dir] 	at org.eclipse.osgi.internal.loader.BundleLoader.findClass(BundleLoader.java:405)
   [p2.dir] 	at org.eclipse.osgi.internal.loader.BundleLoader.findClass(BundleLoader.java:393)
   [p2.dir] 	at org.eclipse.osgi.internal.baseadaptor.DefaultClassLoader.loadClass(DefaultClassLoader.java:105)
   [p2.dir] 	at java.lang.ClassLoader.loadClass(ClassLoader.java:595)
   [p2.dir] 	at org.eclipse.osgi.internal.loader.BundleLoader.loadClass(BundleLoader.java:321)
   [p2.dir] 	at org.eclipse.osgi.framework.internal.core.BundleHost.loadClass(BundleHost.java:231)
   [p2.dir] 	at org.eclipse.osgi.framework.internal.core.AbstractBundle.loadBundleActivator(AbstractBundle.java:150)
   [p2.dir] 	at org.eclipse.osgi.framework.internal.core.BundleContextImpl.start(BundleContextImpl.java:750)
   [p2.dir] 	at org.eclipse.osgi.framework.internal.core.BundleHost.startWorker(BundleHost.java:352)
   [p2.dir] 	at org.eclipse.osgi.framework.internal.core.AbstractBundle.resume(AbstractBundle.java:370)
   [p2.dir] 	at org.eclipse.osgi.framework.internal.core.Framework.resumeBundle(Framework.java:1068)
   [p2.dir] 	at org.eclipse.osgi.framework.internal.core.StartLevelManager.setBundleSL(StartLevelManager.java:691)
   [p2.dir] 	at org.eclipse.osgi.framework.internal.core.StartLevelManager.dispatchEvent(StartLevelManager.java:442)
   [p2.dir] 	at org.eclipse.osgi.framework.eventmgr.EventManager.dispatchEvent(EventManager.java:220)
   [p2.dir] 	at org.eclipse.osgi.framework.eventmgr.EventManager$EventThread.run(EventManager.java:330)
   [p2.dir] 
   [p2.dir] !ENTRY org.eclipse.osgi 4 0 2010-05-17 19:16:55.246
   [p2.dir] !MESSAGE Application error
   [p2.dir] !STACK 1
   [p2.dir] java.lang.IllegalStateException: Unable to acquire application service. Ensure that the org.eclipse.core.runtime bundle is resolved and started (see config.ini).
   [p2.dir] 	at org.eclipse.core.runtime.internal.adaptor.EclipseAppLauncher.start(EclipseAppLauncher.java:74)
   [p2.dir] 	at org.eclipse.core.runtime.adaptor.EclipseStarter.run(EclipseStarter.java:368)
   [p2.dir] 	at org.eclipse.core.runtime.adaptor.EclipseStarter.run(EclipseStarter.java:179)
   [p2.dir] 	at sun.reflect.NativeMethodAccessorImpl.invoke0(Native Method)
   [p2.dir] 	at sun.reflect.NativeMethodAccessorImpl.invoke(NativeMethodAccessorImpl.java:79)
   [p2.dir] 	at sun.reflect.DelegatingMethodAccessorImpl.invoke(DelegatingMethodAccessorImpl.java:43)
   [p2.dir] 	at java.lang.reflect.Method.invoke(Method.java:618)
   [p2.dir] 	at org.eclipse.equinox.launcher.Main.invokeFramework(Main.java:559)
   [p2.dir] 	at org.eclipse.equinox.launcher.Main.basicRun(Main.java:514)
   [p2.dir] 	at org.eclipse.equinox.launcher.Main.run(Main.java:1311)
   [p2.dir] 	at org.eclipse.equinox.launcher.Main.main(Main.java:1287)
   [p2.dir] 
   [p2.dir] !ENTRY org.eclipse.osgi 2 0 2010-05-17 19:16:55.330
   [p2.dir] !MESSAGE The following is a complete list of bundles which are not resolved, see the prior log entry for the root cause if it exists:
   [p2.dir] !SUBENTRY 1 org.eclipse.osgi 2 0 2010-05-17 19:16:55.330
   [p2.dir] !MESSAGE Bundle org.eclipse.jdt.apt.pluggable.core_1.0.200.v20090526-2130 [100] was not resolved.
   [p2.dir] !SUBENTRY 2 org.eclipse.jdt.apt.pluggable.core 2 0 2010-05-17 19:16:55.330
   [p2.dir] !MESSAGE Missing imported package org.eclipse.jdt.internal.compiler.tool_0.0.0.
   [p2.dir] !SUBENTRY 2 org.eclipse.jdt.apt.pluggable.core 2 0 2010-05-17 19:16:55.331
   [p2.dir] !MESSAGE Missing imported package org.eclipse.jdt.internal.compiler.apt.dispatch_0.0.0.
   [p2.dir] !SUBENTRY 2 org.eclipse.jdt.apt.pluggable.core 2 0 2010-05-17 19:16:55.331
   [p2.dir] !MESSAGE Missing imported package org.eclipse.jdt.internal.compiler.apt.model_0.0.0.
   [p2.dir] !SUBENTRY 2 org.eclipse.jdt.apt.pluggable.core 2 0 2010-05-17 19:16:55.331
   [p2.dir] !MESSAGE Missing imported package org.eclipse.jdt.internal.compiler.apt.util_0.0.0.
   [p2.dir] !SUBENTRY 1 org.eclipse.osgi 2 0 2010-05-17 19:16:55.332
   [p2.dir] !MESSAGE Bundle org.eclipse.jdt.compiler.apt_1.0.200.v20090528-1135 [102] was not resolved.
   [p2.dir] !SUBENTRY 2 org.eclipse.jdt.compiler.apt 2 0 2010-05-17 19:16:55.332
   [p2.dir] !MESSAGE Missing imported package org.eclipse.jdt.internal.compiler.tool_0.0.0.
   [p2.dir] !SUBENTRY 1 org.eclipse.osgi 2 0 2010-05-17 19:16:55.332
   [p2.dir] !MESSAGE Bundle org.eclipse.jdt.compiler.tool_1.0.100.v_963 [103] was not resolved.
   [p2.dir] !SUBENTRY 2 org.eclipse.jdt.compiler.tool 2 0 2010-05-17 19:16:55.333
   [p2.dir] !MESSAGE Missing Constraint: Bundle-RequiredExecutionEnvironment: JavaSE-1.6
   [p2.dir] 
   [p2.dir] !ENTRY org.eclipse.osgi 4 0 2010-05-17 19:16:55.498
   [p2.dir] !MESSAGE 
   [p2.dir] !STACK 0
   [p2.dir] java.io.IOException: No such file or directory
   [p2.dir] 	at java.io.File.checkAndCreate(File.java:1380)
   [p2.dir] 	at java.io.File.createTempFile(File.java:1469)
   [p2.dir] 	at org.eclipse.osgi.storagemanager.StorageManager.createTempFile(StorageManager.java:712)
   [p2.dir] 	at org.eclipse.osgi.storagemanager.StorageManager.getOutputStream(StorageManager.java:774)
   [p2.dir] 	at org.eclipse.osgi.internal.baseadaptor.BaseStorage.saveBundleDatas(BaseStorage.java:540)
   [p2.dir] 	at org.eclipse.osgi.internal.baseadaptor.BaseStorage.saveAllData(BaseStorage.java:433)
   [p2.dir] 	at org.eclipse.osgi.internal.baseadaptor.BaseStorage.access$1(BaseStorage.java:423)
   [p2.dir] 	at org.eclipse.osgi.internal.baseadaptor.BaseStorage$StateSaver.run(BaseStorage.java:1199)
   [p2.dir] 	at java.lang.Thread.run(Thread.java:810)
   [p2.dir] 
   [p2.dir] !ENTRY org.eclipse.osgi 4 0 2010-05-17 19:16:55.499
   [p2.dir] !MESSAGE 
   [p2.dir] !STACK 0
   [p2.dir] java.io.IOException: No such file or directory
   [p2.dir] 	at java.io.File.checkAndCreate(File.java:1380)
   [p2.dir] 	at java.io.File.createTempFile(File.java:1469)
   [p2.dir] 	at org.eclipse.osgi.internal.baseadaptor.BaseStorage.saveStateData(BaseStorage.java:595)
   [p2.dir] 	at org.eclipse.osgi.internal.baseadaptor.BaseStorage.saveAllData(BaseStorage.java:434)
   [p2.dir] 	at org.eclipse.osgi.internal.baseadaptor.BaseStorage.access$1(BaseStorage.java:423)
   [p2.dir] 	at org.eclipse.osgi.internal.baseadaptor.BaseStorage$StateSaver.run(BaseStorage.java:1199)
   [p2.dir] 	at java.lang.Thread.run(Thread.java:810)
   [p2.dir] 
   [p2.dir] !ENTRY org.eclipse.osgi 4 0 2010-05-17 19:16:55.500
   [p2.dir] !MESSAGE 
   [p2.dir] !STACK 0
   [p2.dir] java.io.IOException: No such file or directory
   [p2.dir] 	at java.io.File.checkAndCreate(File.java:1380)
   [p2.dir] 	at java.io.File.createTempFile(File.java:1469)
   [p2.dir] 	at org.eclipse.osgi.storagemanager.StorageManager.createTempFile(StorageManager.java:712)
   [p2.dir] 	at org.eclipse.osgi.storagemanager.StorageManager.getOutputStream(StorageManager.java:774)
   [p2.dir] 	at org.eclipse.osgi.internal.baseadaptor.BaseStorage.saveBundleDatas(BaseStorage.java:540)
   [p2.dir] 	at org.eclipse.osgi.internal.baseadaptor.BaseStorage.saveAllData(BaseStorage.java:433)
   [p2.dir] 	at org.eclipse.osgi.internal.baseadaptor.BaseStorage.frameworkStop(BaseStorage.java:834)
   [p2.dir] 	at org.eclipse.osgi.baseadaptor.BaseAdaptor.frameworkStop(BaseAdaptor.java:262)
   [p2.dir] 	at org.eclipse.osgi.framework.internal.core.SystemBundleActivator.stop(SystemBundleActivator.java:72)
   [p2.dir] 	at org.eclipse.osgi.framework.internal.core.BundleContextImpl$2.run(BundleContextImpl.java:840)
   [p2.dir] 	at java.security.AccessController.doPrivileged(AccessController.java:246)
   [p2.dir] 	at org.eclipse.osgi.framework.internal.core.BundleContextImpl.stop(BundleContextImpl.java:833)
   [p2.dir] 	at org.eclipse.osgi.framework.internal.core.StartLevelManager.suspendAllBundles(StartLevelManager.java:623)
   [p2.dir] 	at org.eclipse.osgi.framework.internal.core.StartLevelManager.doSetStartLevel(StartLevelManager.java:265)
   [p2.dir] 	at org.eclipse.osgi.framework.internal.core.StartLevelManager.shutdown(StartLevelManager.java:216)
   [p2.dir] 	at org.eclipse.osgi.framework.internal.core.InternalSystemBundle.suspend(InternalSystemBundle.java:266)
   [p2.dir] 	at org.eclipse.osgi.framework.internal.core.Framework.shutdown(Framework.java:685)
   [p2.dir] 	at org.eclipse.osgi.framework.internal.core.Framework.close(Framework.java:583)
   [p2.dir] 	at org.eclipse.core.runtime.adaptor.EclipseStarter.shutdown(EclipseStarter.java:409)
   [p2.dir] 	at org.eclipse.core.runtime.adaptor.EclipseStarter.run(EclipseStarter.java:200)
   [p2.dir] 	at sun.reflect.NativeMethodAccessorImpl.invoke0(Native Method)
   [p2.dir] 	at sun.reflect.NativeMethodAccessorImpl.invoke(NativeMethodAccessorImpl.java:79)
   [p2.dir] 	at sun.reflect.DelegatingMethodAccessorImpl.invoke(DelegatingMethodAccessorImpl.java:43)
   [p2.dir] 	at java.lang.reflect.Method.invoke(Method.java:618)
   [p2.dir] 	at org.eclipse.equinox.launcher.Main.invokeFramework(Main.java:559)
   [p2.dir] 	at org.eclipse.equinox.launcher.Main.basicRun(Main.java:514)
   [p2.dir] 	at org.eclipse.equinox.launcher.Main.run(Main.java:1311)
   [p2.dir] 	at org.eclipse.equinox.launcher.Main.main(Main.java:1287)
   [p2.dir] 
   [p2.dir] !ENTRY org.eclipse.osgi 4 0 2010-05-17 19:16:55.501
   [p2.dir] !MESSAGE 
   [p2.dir] !STACK 0
   [p2.dir] java.io.IOException: No such file or directory
   [p2.dir] 	at java.io.File.checkAndCreate(File.java:1380)
   [p2.dir] 	at java.io.File.createTempFile(File.java:1469)
   [p2.dir] 	at org.eclipse.osgi.internal.baseadaptor.BaseStorage.saveStateData(BaseStorage.java:595)
   [p2.dir] 	at org.eclipse.osgi.internal.baseadaptor.BaseStorage.saveAllData(BaseStorage.java:434)
   [p2.dir] 	at org.eclipse.osgi.internal.baseadaptor.BaseStorage.frameworkStop(BaseStorage.java:834)
   [p2.dir] 	at org.eclipse.osgi.baseadaptor.BaseAdaptor.frameworkStop(BaseAdaptor.java:262)
   [p2.dir] 	at org.eclipse.osgi.framework.internal.core.SystemBundleActivator.stop(SystemBundleActivator.java:72)
   [p2.dir] 	at org.eclipse.osgi.framework.internal.core.BundleContextImpl$2.run(BundleContextImpl.java:840)
   [p2.dir] 	at java.security.AccessController.doPrivileged(AccessController.java:246)
   [p2.dir] 	at org.eclipse.osgi.framework.internal.core.BundleContextImpl.stop(BundleContextImpl.java:833)
   [p2.dir] 	at org.eclipse.osgi.framework.internal.core.StartLevelManager.suspendAllBundles(StartLevelManager.java:623)
   [p2.dir] 	at org.eclipse.osgi.framework.internal.core.StartLevelManager.doSetStartLevel(StartLevelManager.java:265)
   [p2.dir] 	at org.eclipse.osgi.framework.internal.core.StartLevelManager.shutdown(StartLevelManager.java:216)
   [p2.dir] 	at org.eclipse.osgi.framework.internal.core.InternalSystemBundle.suspend(InternalSystemBundle.java:266)
   [p2.dir] 	at org.eclipse.osgi.framework.internal.core.Framework.shutdown(Framework.java:685)
   [p2.dir] 	at org.eclipse.osgi.framework.internal.core.Framework.close(Framework.java:583)
   [p2.dir] 	at org.eclipse.core.runtime.adaptor.EclipseStarter.shutdown(EclipseStarter.java:409)
   [p2.dir] 	at org.eclipse.core.runtime.adaptor.EclipseStarter.run(EclipseStarter.java:200)
   [p2.dir] 	at sun.reflect.NativeMethodAccessorImpl.invoke0(Native Method)
   [p2.dir] 	at sun.reflect.NativeMethodAccessorImpl.invoke(NativeMethodAccessorImpl.java:79)
   [p2.dir] 	at sun.reflect.DelegatingMethodAccessorImpl.invoke(DelegatingMethodAccessorImpl.java:43)
   [p2.dir] 	at java.lang.reflect.Method.invoke(Method.java:618)
   [p2.dir] 	at org.eclipse.equinox.launcher.Main.invokeFramework(Main.java:559)
   [p2.dir] 	at org.eclipse.equinox.launcher.Main.basicRun(Main.java:514)
   [p2.dir] 	at org.eclipse.equinox.launcher.Main.run(Main.java:1311)
   [p2.dir] 	at org.eclipse.equinox.launcher.Main.main(Main.java:1287)
      [for] org.eclipse.gef+org.eclipse.emf+org.eclipse.xsd+org.mozilla.xpcom.feature+org.mozilla.xulrunner.feature+org.eclipse.wst.xml_ui.feature+org.eclipse.wst.jsdt.feature: The following error occurred while executing this line:
      [for] <https://build.eclipse.org/hudson/job/cbi-atf-0.3-nightly/ws/build/org.eclipse.dash.common.releng/builder/all/customTargets.xml>:257: The following error occurred while executing this line:
      [for] <https://build.eclipse.org/hudson/job/cbi-atf-0.3-nightly/ws/build/org.eclipse.dash.common.releng/tools/scripts/buildAllHelper.xml>:1569: Java returned: 13
      [for] featureIDsToInstall: The following error occurred while executing this line:
      [for] <https://build.eclipse.org/hudson/job/cbi-atf-0.3-nightly/ws/build/org.eclipse.dash.common.releng/builder/all/customTargets.xml>:230: Keepgoing execution: 1 of 1 iterations failed.

BUILD FAILED
<https://build.eclipse.org/hudson/job/cbi-atf-0.3-nightly/ws/build/org.eclipse.dash.common.releng/buildAll.xml>:374: The following error occurred while executing this line:
<https://build.eclipse.org/hudson/job/cbi-atf-0.3-nightly/ws/build/org.eclipse.dash.common.releng/buildAll.xml>:415: The following error occurred while executing this line:
<https://build.eclipse.org/hudson/job/cbi-atf-0.3-nightly/ws/build/org.eclipse.dash.common.releng/tools/scripts/buildAllHelper.xml>:807: The following error occurred while executing this line:
<https://build.eclipse.org/hudson/job/cbi-atf-0.3-nightly/ws/build/org.eclipse.dash.common.releng/tools/scripts/buildAllHelper.xml>:1216: The following error occurred while executing this line:
<https://build.eclipse.org/hudson/job/cbi-atf-0.3-nightly/ws/build/org.eclipse.dash.common.releng/build.xml>:199: The following error occurred while executing this line:
/opt/public/cbi/build/org.eclipse.releng.basebuilder_r35x_v20090811/plugins/org.eclipse.pde.build_3.5.0.v20090527-1800/scripts/build.xml:32: The following error occurred while executing this line:
/opt/public/cbi/build/org.eclipse.releng.basebuilder_r35x_v20090811/plugins/org.eclipse.pde.build_3.5.0.v20090527-1800/scripts/build.xml:53: The following error occurred while executing this line:
<https://build.eclipse.org/hudson/job/cbi-atf-0.3-nightly/ws/build/org.eclipse.dash.common.releng/builder/all/customTargets.xml>:208: Keepgoing execution: 1 of 3 iterations failed.

Total time: 42 seconds
[start] [19:16:56] start.sh finished.

++ rm -f <https://build.eclipse.org/hudson/job/cbi-atf-0.3-nightly/ws/build/.cvspass>
+++ date '+%Y/%m/%d %H:%M'
++ echo '[2010/05/17 19:16] Hudson job  build #484 (2010-05-17_19-15-47) done.'
[2010/05/17 19:16] Hudson job  build #484 (2010-05-17_19-15-47) done.
Archiving artifacts
ERROR: No artifacts found that match the file pattern "build/?20*/**". Configuration error?
Checking console output
/opt/users/hudsonbuild/.hudson/jobs/cbi-atf-0.3-nightly/builds/2010-05-17_19-15-47/log:
BUILD FAILED