[Date Prev][Date Next][Thread Prev][Thread Next][Date Index][Thread Index] [List Home]
[aether-build] [Hudson] Build failed in Hudson: aether-core-nightly  hudson-slave1 #362

See <https://hudson.eclipse.org/hudson/job/aether-core-nightly/./label=hudson-slave1/362/>

------------------------------------------
[...truncated 577 lines...]
Tests run: 27, Failures: 0, Errors: 0, Skipped: 0, Time elapsed: 0.331 sec

Results :

Tests run: 27, Failures: 0, Errors: 0, Skipped: 0

[INFO] 
[INFO] --- maven-jar-plugin:2.3.2:jar (default-jar) @ aether-transport-classpath ---
[INFO] Building jar: <https://hudson.eclipse.org/hudson/job/aether-core-nightly/./label=hudson-slave1/ws/aether-transport-classpath/target/aether-transport-classpath-1.1.0-SNAPSHOT.jar>
[INFO] 
[INFO] --- maven-enforcer-plugin:1.2:enforce (qa) @ aether-transport-classpath ---
[INFO]                                                                         
[INFO] ------------------------------------------------------------------------
[INFO] Building Aether Transport File 1.1.0-SNAPSHOT
[INFO] ------------------------------------------------------------------------
[INFO] 
[INFO] --- maven-clean-plugin:2.5:clean (default-clean) @ aether-transport-file ---
[INFO] Deleting <https://hudson.eclipse.org/hudson/job/aether-core-nightly/./label=hudson-slave1/ws/aether-transport-file/target>
[INFO] 
[INFO] --- build-helper-maven-plugin:1.7:timestamp-property (osgi-timestamp) @ aether-transport-file ---
[INFO] Setting property 'bundle.osgiTimestamp' to '20150325-1117'.
[INFO] 
[INFO] --- build-helper-maven-plugin:1.7:regex-property (osgi-version) @ aether-transport-file ---
[INFO] Setting property 'bundle.osgiVersion' to '1.1.0.20150325-1117'.
[INFO] 
[INFO] --- maven-resources-plugin:2.6:resources (default-resources) @ aether-transport-file ---
[INFO] Using 'UTF-8' encoding to copy filtered resources.
[INFO] Copying 1 resource
[INFO] 
[INFO] --- maven-compiler-plugin:2.5.1:compile (default-compile) @ aether-transport-file ---
[INFO] Compiling 5 source files to <https://hudson.eclipse.org/hudson/job/aether-core-nightly/./label=hudson-slave1/ws/aether-transport-file/target/classes>
[INFO] 
[INFO] --- animal-sniffer-maven-plugin:1.9:check (check-java-1.5-compat) @ aether-transport-file ---
[INFO] Checking unresolved references to org.codehaus.mojo.signature:java15:1.0
[INFO] 
[INFO] --- sisu-maven-plugin:0.0.0.M2:main-index (generate-index) @ aether-transport-file ---
[INFO] 
[INFO] --- maven-resources-plugin:2.6:testResources (default-testResources) @ aether-transport-file ---
[INFO] Using 'UTF-8' encoding to copy filtered resources.
[INFO] skip non existing resourceDirectory <https://hudson.eclipse.org/hudson/job/aether-core-nightly/./label=hudson-slave1/ws/aether-transport-file/src/test/resources>
[INFO] 
[INFO] --- maven-compiler-plugin:2.5.1:testCompile (default-testCompile) @ aether-transport-file ---
[INFO] Compiling 2 source files to <https://hudson.eclipse.org/hudson/job/aether-core-nightly/./label=hudson-slave1/ws/aether-transport-file/target/test-classes>
[INFO] 
[INFO] --- maven-bundle-plugin:2.4.0:manifest (create-manifest) @ aether-transport-file ---
[WARNING] Manifest org.eclipse.aether:aether-transport-file:jar:1.1.0-SNAPSHOT : Unused Export-Package instructions: [org.eclipse.aether.internal.*] 
[INFO] 
[INFO] --- maven-surefire-plugin:2.9:test (default-test) @ aether-transport-file ---
[INFO] Surefire report directory: <https://hudson.eclipse.org/hudson/job/aether-core-nightly/./label=hudson-slave1/ws/aether-transport-file/target/surefire-reports>

-------------------------------------------------------
 T E S T S
-------------------------------------------------------
Running org.eclipse.aether.transport.file.FileTransporterTest
Tests run: 37, Failures: 0, Errors: 0, Skipped: 0, Time elapsed: 0.372 sec

Results :

Tests run: 37, Failures: 0, Errors: 0, Skipped: 0

[INFO] 
[INFO] --- maven-jar-plugin:2.3.2:jar (default-jar) @ aether-transport-file ---
[INFO] Building jar: <https://hudson.eclipse.org/hudson/job/aether-core-nightly/./label=hudson-slave1/ws/aether-transport-file/target/aether-transport-file-1.1.0-SNAPSHOT.jar>
[INFO] 
[INFO] --- maven-enforcer-plugin:1.2:enforce (qa) @ aether-transport-file ---
[INFO]                                                                         
[INFO] ------------------------------------------------------------------------
[INFO] Building Aether Transport HTTP 1.1.0-SNAPSHOT
[INFO] ------------------------------------------------------------------------
[INFO] 
[INFO] --- maven-clean-plugin:2.5:clean (default-clean) @ aether-transport-http ---
[INFO] Deleting <https://hudson.eclipse.org/hudson/job/aether-core-nightly/./label=hudson-slave1/ws/aether-transport-http/target>
[INFO] 
[INFO] --- build-helper-maven-plugin:1.7:timestamp-property (osgi-timestamp) @ aether-transport-http ---
[INFO] Setting property 'bundle.osgiTimestamp' to '20150325-1117'.
[INFO] 
[INFO] --- build-helper-maven-plugin:1.7:regex-property (osgi-version) @ aether-transport-http ---
[INFO] Setting property 'bundle.osgiVersion' to '1.1.0.20150325-1117'.
[INFO] 
[INFO] --- maven-resources-plugin:2.6:resources (default-resources) @ aether-transport-http ---
[INFO] Using 'UTF-8' encoding to copy filtered resources.
[INFO] Copying 1 resource
[INFO] 
[INFO] --- maven-compiler-plugin:2.5.1:compile (default-compile) @ aether-transport-http ---
[INFO] Compiling 15 source files to <https://hudson.eclipse.org/hudson/job/aether-core-nightly/./label=hudson-slave1/ws/aether-transport-http/target/classes>
[INFO] 
[INFO] --- animal-sniffer-maven-plugin:1.9:check (check-java-1.5-compat) @ aether-transport-http ---
[INFO] Checking unresolved references to org.codehaus.mojo.signature:java15:1.0
[INFO] 
[INFO] --- sisu-maven-plugin:0.0.0.M2:main-index (generate-index) @ aether-transport-http ---
[INFO] 
[INFO] --- maven-resources-plugin:2.6:testResources (default-testResources) @ aether-transport-http ---
[INFO] Using 'UTF-8' encoding to copy filtered resources.
[INFO] Copying 4 resources
[INFO] 
[INFO] --- maven-compiler-plugin:2.5.1:testCompile (default-testCompile) @ aether-transport-http ---
[INFO] Compiling 4 source files to <https://hudson.eclipse.org/hudson/job/aether-core-nightly/./label=hudson-slave1/ws/aether-transport-http/target/test-classes>
[INFO] 
[INFO] --- maven-bundle-plugin:2.4.0:manifest (create-manifest) @ aether-transport-http ---
[WARNING] Manifest org.eclipse.aether:aether-transport-http:jar:1.1.0-SNAPSHOT : Unused Export-Package instructions: [org.eclipse.aether.internal.*] 
[INFO] 
[INFO] --- maven-surefire-plugin:2.9:test (default-test) @ aether-transport-http ---
[INFO] Surefire report directory: <https://hudson.eclipse.org/hudson/job/aether-core-nightly/./label=hudson-slave1/ws/aether-transport-http/target/surefire-reports>

-------------------------------------------------------
 T E S T S
-------------------------------------------------------
Running org.eclipse.aether.transport.http.UriUtilsTest
Tests run: 7, Failures: 0, Errors: 0, Skipped: 0, Time elapsed: 0.072 sec
Running org.eclipse.aether.transport.http.HttpTransporterTest
Tests run: 69, Failures: 0, Errors: 0, Skipped: 0, Time elapsed: 30.339 sec

Results :

Tests run: 76, Failures: 0, Errors: 0, Skipped: 0

[INFO] 
[INFO] --- maven-jar-plugin:2.3.2:jar (default-jar) @ aether-transport-http ---
[INFO] Building jar: <https://hudson.eclipse.org/hudson/job/aether-core-nightly/./label=hudson-slave1/ws/aether-transport-http/target/aether-transport-http-1.1.0-SNAPSHOT.jar>
[INFO] 
[INFO] --- maven-enforcer-plugin:1.2:enforce (qa) @ aether-transport-http ---
[INFO]                                                                         
[INFO] ------------------------------------------------------------------------
[INFO] Building Aether Transport Wagon 1.1.0-SNAPSHOT
[INFO] ------------------------------------------------------------------------
[INFO] 
[INFO] --- maven-clean-plugin:2.5:clean (default-clean) @ aether-transport-wagon ---
[INFO] Deleting <https://hudson.eclipse.org/hudson/job/aether-core-nightly/./label=hudson-slave1/ws/aether-transport-wagon/target>
[INFO] 
[INFO] --- build-helper-maven-plugin:1.7:timestamp-property (osgi-timestamp) @ aether-transport-wagon ---
[INFO] Setting property 'bundle.osgiTimestamp' to '20150325-1118'.
[INFO] 
[INFO] --- build-helper-maven-plugin:1.7:regex-property (osgi-version) @ aether-transport-wagon ---
[INFO] Setting property 'bundle.osgiVersion' to '1.1.0.20150325-1118'.
[INFO] 
[INFO] --- maven-resources-plugin:2.6:resources (default-resources) @ aether-transport-wagon ---
[INFO] Using 'UTF-8' encoding to copy filtered resources.
[INFO] Copying 1 resource
[INFO] 
[INFO] --- maven-compiler-plugin:2.5.1:compile (default-compile) @ aether-transport-wagon ---
[INFO] Compiling 10 source files to <https://hudson.eclipse.org/hudson/job/aether-core-nightly/./label=hudson-slave1/ws/aether-transport-wagon/target/classes>
[INFO] 
[INFO] --- animal-sniffer-maven-plugin:1.9:check (check-java-1.5-compat) @ aether-transport-wagon ---
[INFO] Checking unresolved references to org.codehaus.mojo.signature:java15:1.0
[INFO] 
[INFO] --- plexus-component-metadata:1.5.5:generate-metadata (generate-components-xml) @ aether-transport-wagon ---
[INFO] Discovered 2 component descriptors(s)
[INFO] 
[INFO] --- sisu-maven-plugin:0.0.0.M2:main-index (generate-index) @ aether-transport-wagon ---
[INFO] 
[INFO] --- maven-resources-plugin:2.6:testResources (default-testResources) @ aether-transport-wagon ---
[INFO] Using 'UTF-8' encoding to copy filtered resources.
[INFO] Copying 1 resource
[INFO] 
[INFO] --- maven-compiler-plugin:2.5.1:testCompile (default-testCompile) @ aether-transport-wagon ---
[INFO] Compiling 9 source files to <https://hudson.eclipse.org/hudson/job/aether-core-nightly/./label=hudson-slave1/ws/aether-transport-wagon/target/test-classes>
[INFO] 
[INFO] --- maven-bundle-plugin:2.4.0:manifest (create-manifest) @ aether-transport-wagon ---
[INFO] 
[INFO] --- maven-surefire-plugin:2.9:test (default-test) @ aether-transport-wagon ---
[INFO] Surefire report directory: <https://hudson.eclipse.org/hudson/job/aether-core-nightly/./label=hudson-slave1/ws/aether-transport-wagon/target/surefire-reports>

-------------------------------------------------------
 T E S T S
-------------------------------------------------------
Running org.eclipse.aether.transport.wagon.WagonTransporterTest
Tests run: 30, Failures: 0, Errors: 0, Skipped: 0, Time elapsed: 0.357 sec
Running org.eclipse.aether.transport.wagon.StreamWagonTransporterTest
Tests run: 30, Failures: 0, Errors: 0, Skipped: 0, Time elapsed: 0.188 sec
Running org.eclipse.aether.transport.wagon.PlexusSupportTest
Tests run: 1, Failures: 0, Errors: 0, Skipped: 0, Time elapsed: 1.291 sec

Results :

Tests run: 61, Failures: 0, Errors: 0, Skipped: 0

[INFO] 
[INFO] --- maven-jar-plugin:2.3.2:jar (default-jar) @ aether-transport-wagon ---
[INFO] Building jar: <https://hudson.eclipse.org/hudson/job/aether-core-nightly/./label=hudson-slave1/ws/aether-transport-wagon/target/aether-transport-wagon-1.1.0-SNAPSHOT.jar>
[INFO] 
[INFO] --- maven-enforcer-plugin:1.2:enforce (qa) @ aether-transport-wagon ---
[INFO] ------------------------------------------------------------------------
[INFO] Reactor Summary:
[INFO] 
[INFO] Aether ............................................ SUCCESS [1.452s]
[INFO] Aether API ........................................ SUCCESS [12.527s]
[INFO] Aether SPI ........................................ SUCCESS [1.975s]
[INFO] Aether Test Utilities ............................. SUCCESS [2.300s]
[INFO] Aether Utilities .................................. SUCCESS [9.408s]
[INFO] Aether Implementation ............................. SUCCESS [37.841s]
[INFO] Aether Connector Basic ............................ FAILURE [1:13.113s]
[INFO] Aether Transport Classpath ........................ SUCCESS [2.376s]
[INFO] Aether Transport File ............................. SUCCESS [2.946s]
[INFO] Aether Transport HTTP ............................. SUCCESS [34.348s]
[INFO] Aether Transport Wagon ............................ SUCCESS [9.151s]
[INFO] ------------------------------------------------------------------------
[INFO] BUILD FAILURE
[INFO] ------------------------------------------------------------------------
[INFO] Total time: 3:08.201s
[INFO] Finished at: Wed Mar 25 07:18:23 EDT 2015
[INFO] Final Memory: 38M/739M
[INFO] ------------------------------------------------------------------------
[ERROR] Failed to execute goal org.apache.maven.plugins:maven-surefire-plugin:2.9:test (default-test) on project aether-connector-basic: There are test failures.
[ERROR] 
[ERROR] Please refer to <https://hudson.eclipse.org/hudson/job/aether-core-nightly/./label=hudson-slave1/ws/aether-connector-basic/target/surefire-reports> for the individual test results.
[ERROR] -> [Help 1]
org.apache.maven.lifecycle.LifecycleExecutionException: Failed to execute goal org.apache.maven.plugins:maven-surefire-plugin:2.9:test (default-test) on project aether-connector-basic: There are test failures.

Please refer to <https://hudson.eclipse.org/hudson/job/aether-core-nightly/./label=hudson-slave1/ws/aether-connector-basic/target/surefire-reports> for the individual test results.
	at org.apache.maven.lifecycle.internal.MojoExecutor.execute(MojoExecutor.java:213)
	at org.apache.maven.lifecycle.internal.MojoExecutor.execute(MojoExecutor.java:153)
	at org.apache.maven.lifecycle.internal.MojoExecutor.execute(MojoExecutor.java:145)
	at org.apache.maven.lifecycle.internal.LifecycleModuleBuilder.buildProject(LifecycleModuleBuilder.java:84)
	at org.apache.maven.lifecycle.internal.LifecycleModuleBuilder.buildProject(LifecycleModuleBuilder.java:59)
	at org.apache.maven.lifecycle.internal.LifecycleStarter.singleThreadedBuild(LifecycleStarter.java:183)
	at org.apache.maven.lifecycle.internal.LifecycleStarter.execute(LifecycleStarter.java:161)
	at org.apache.maven.DefaultMaven.doExecute(DefaultMaven.java:319)
	at org.apache.maven.DefaultMaven.execute(DefaultMaven.java:156)
	at org.apache.maven.cli.MavenCli.execute(MavenCli.java:537)
	at org.apache.maven.cli.MavenCli.doMain(MavenCli.java:196)
	at org.apache.maven.cli.MavenCli.main(MavenCli.java:141)
	at sun.reflect.NativeMethodAccessorImpl.invoke0(Native Method)
	at sun.reflect.NativeMethodAccessorImpl.invoke(NativeMethodAccessorImpl.java:39)
	at sun.reflect.DelegatingMethodAccessorImpl.invoke(DelegatingMethodAccessorImpl.java:25)
	at java.lang.reflect.Method.invoke(Method.java:597)
	at org.codehaus.plexus.classworlds.launcher.Launcher.launchEnhanced(Launcher.java:290)
	at org.codehaus.plexus.classworlds.launcher.Launcher.launch(Launcher.java:230)
	at org.codehaus.plexus.classworlds.launcher.Launcher.mainWithExitCode(Launcher.java:409)
	at org.codehaus.plexus.classworlds.launcher.Launcher.main(Launcher.java:352)
Caused by: org.apache.maven.plugin.MojoFailureException: There are test failures.

Please refer to <https://hudson.eclipse.org/hudson/job/aether-core-nightly/./label=hudson-slave1/ws/aether-connector-basic/target/surefire-reports> for the individual test results.
	at org.apache.maven.plugin.surefire.SurefireHelper.reportExecution(SurefireHelper.java:87)
	at org.apache.maven.plugin.surefire.SurefirePlugin.writeSummary(SurefirePlugin.java:631)
	at org.apache.maven.plugin.surefire.SurefirePlugin.handleSummary(SurefirePlugin.java:605)
	at org.apache.maven.plugin.surefire.AbstractSurefireMojo.executeAfterPreconditionsChecked(AbstractSurefireMojo.java:136)
	at org.apache.maven.plugin.surefire.AbstractSurefireMojo.execute(AbstractSurefireMojo.java:97)
	at org.apache.maven.plugin.DefaultBuildPluginManager.executeMojo(DefaultBuildPluginManager.java:101)
	at org.apache.maven.lifecycle.internal.MojoExecutor.execute(MojoExecutor.java:209)
	... 19 more
[ERROR] 
[ERROR] Re-run Maven using the -X switch to enable full debug logging.
[ERROR] 
[ERROR] For more information about the errors and possible solutions, please read the following articles:
[ERROR] [Help 1] http://cwiki.apache.org/confluence/display/MAVEN/MojoFailureException
[ERROR] 
[ERROR] After correcting the problems, you can resume the build with the command
[ERROR]   mvn <goals> -rf :aether-connector-basic
Recording test results

--
This message is automatically generated by Hudson. 
For more information on Hudson, see: http://hudson-ci.org/