[Date Prev][Date Next][Thread Prev][Thread Next][Date Index][Thread Index] [List Home]
[aether-build] Build failed in Hudson: aether-core-nightly  Java 6 R 21 64bit (SUN),windows7tests #13

See <https://hudson.eclipse.org/hudson/job/aether-core-nightly/./jdk=Java%206%20R%2021%2064bit%20(SUN),label=windows7tests/13/>

------------------------------------------
Started by upstream project "aether-core-nightly" build number 13
Building remotely on windows7tests
Checkout:windows7tests / <https://hudson.eclipse.org/hudson/job/aether-core-nightly/./jdk=Java%206%20R%2021%2064bit%20(SUN),label=windows7tests/ws/> - hudson.remoting.Channel@131b3b7f:windows7tests
Using strategy: Default
Last Built Revision: Revision d32099ede74f5413b4088481b7f82d1c15b22505 (origin/master)
Checkout:windows7tests / <https://hudson.eclipse.org/hudson/job/aether-core-nightly/./jdk=Java%206%20R%2021%2064bit%20(SUN),label=windows7tests/ws/> - hudson.remoting.LocalChannel@4274bf
Fetching changes from the remote Git repository
Fetching upstream changes from git://git.eclipse.org/gitroot/aether/aether-core.git
Commencing build of Revision d32099ede74f5413b4088481b7f82d1c15b22505 (origin/master)
Checking out Revision d32099ede74f5413b4088481b7f82d1c15b22505 (origin/master)
[windows7tests] $ "c:\Program Files\maven-3.0.3\bin\mvn.bat" -Dlabel=windows7tests "-Djdk=Java 6 R 21 64bit (SUN)" -Dsurefire.useFile=true "-Dmaven.repo.local=<https://hudson.eclipse.org/hudson/job/aether-core-nightly/./jdk=Java%206%20R%2021%2064bit%20(SUN),label=windows7tests/ws/.repository"> -B -e -V -U clean install
Apache Maven 3.0.3 (r1075438; 2011-02-28 12:31:09-0500)
Maven home: c:\Program Files\maven-3.0.3
Java version: 1.6.0_20, vendor: Sun Microsystems Inc.
Java home: c:\Java\jdk1.6.0_20\jre
Default locale: en_US, platform encoding: Cp1252
OS name: "windows 7", version: "6.1", arch: "x86", family: "windows"
[INFO] Error stacktraces are turned on.
[INFO] Scanning for projects...
Downloading: http://repo1.maven.org/maven2/org/sonatype/forge/forge-parent/10/forge-parent-10.pom
[ERROR] The build could not read 1 project -> [Help 1]
org.apache.maven.project.ProjectBuildingException: Some problems were encountered while processing the POMs:
[FATAL] Non-resolvable parent POM: Could not transfer artifact org.sonatype.forge:forge-parent:pom:10 from/to central (http://repo1.maven.org/maven2): Error transferring file: Connection timed out: connect and 'parent.relativePath' points at wrong local POM @ line 17, column 11

	at org.apache.maven.project.DefaultProjectBuilder.build(DefaultProjectBuilder.java:339)
	at org.apache.maven.DefaultMaven.collectProjects(DefaultMaven.java:632)
	at org.apache.maven.DefaultMaven.getProjectsForMavenReactor(DefaultMaven.java:581)
	at org.apache.maven.DefaultMaven.doExecute(DefaultMaven.java:233)
	at org.apache.maven.DefaultMaven.execute(DefaultMaven.java:156)
	at org.apache.maven.cli.MavenCli.execute(MavenCli.java:537)
	at org.apache.maven.cli.MavenCli.doMain(MavenCli.java:196)
	at org.apache.maven.cli.MavenCli.main(MavenCli.java:141)
	at sun.reflect.NativeMethodAccessorImpl.invoke0(Native Method)
	at sun.reflect.NativeMethodAccessorImpl.invoke(NativeMethodAccessorImpl.java:39)
	at sun.reflect.DelegatingMethodAccessorImpl.invoke(DelegatingMethodAccessorImpl.java:25)
	at java.lang.reflect.Method.invoke(Method.java:597)
	at org.codehaus.plexus.classworlds.launcher.Launcher.launchEnhanced(Launcher.java:290)
	at org.codehaus.plexus.classworlds.launcher.Launcher.launch(Launcher.java:230)
	at org.codehaus.plexus.classworlds.launcher.Launcher.mainWithExitCode(Launcher.java:409)
	at org.codehaus.plexus.classworlds.launcher.Launcher.main(Launcher.java:352)
[ERROR]   
[ERROR]   The project org.eclipse.aether:aether:0.9.0-SNAPSHOT (<https://hudson.eclipse.org/hudson/job/aether-core-nightly/./jdk=Java%206%20R%2021%2064bit%20(SUN),label=windows7tests/ws/pom.xml)> has 1 error
[ERROR]     Non-resolvable parent POM: Could not transfer artifact org.sonatype.forge:forge-parent:pom:10 from/to central (http://repo1.maven.org/maven2): Error transferring file: Connection timed out: connect and 'parent.relativePath' points at wrong local POM @ line 17, column 11 -> [Help 2]
org.apache.maven.model.resolution.UnresolvableModelException: Could not transfer artifact org.sonatype.forge:forge-parent:pom:10 from/to central (http://repo1.maven.org/maven2): Error transferring file: Connection timed out: connect
	at org.apache.maven.project.ProjectModelResolver.resolveModel(ProjectModelResolver.java:159)
	at org.apache.maven.model.building.DefaultModelBuilder.readParentExternally(DefaultModelBuilder.java:819)
	at org.apache.maven.model.building.DefaultModelBuilder.readParent(DefaultModelBuilder.java:670)
	at org.apache.maven.model.building.DefaultModelBuilder.build(DefaultModelBuilder.java:308)
	at org.apache.maven.model.building.DefaultModelBuilder.build(DefaultModelBuilder.java:232)
	at org.apache.maven.project.DefaultProjectBuilder.build(DefaultProjectBuilder.java:386)
	at org.apache.maven.project.DefaultProjectBuilder.build(DefaultProjectBuilder.java:355)
	at org.apache.maven.project.DefaultProjectBuilder.build(DefaultProjectBuilder.java:319)
	at org.apache.maven.DefaultMaven.collectProjects(DefaultMaven.java:632)
	at org.apache.maven.DefaultMaven.getProjectsForMavenReactor(DefaultMaven.java:581)
	at org.apache.maven.DefaultMaven.doExecute(DefaultMaven.java:233)
	at org.apache.maven.DefaultMaven.execute(DefaultMaven.java:156)
	at org.apache.maven.cli.MavenCli.execute(MavenCli.java:537)
	at org.apache.maven.cli.MavenCli.doMain(MavenCli.java:196)
	at org.apache.maven.cli.MavenCli.main(MavenCli.java:141)
	at sun.reflect.NativeMethodAccessorImpl.invoke0(Native Method)
	at sun.reflect.NativeMethodAccessorImpl.invoke(NativeMethodAccessorImpl.java:39)
	at sun.reflect.DelegatingMethodAccessorImpl.invoke(DelegatingMethodAccessorImpl.java:25)
	at java.lang.reflect.Method.invoke(Method.java:597)
	at org.codehaus.plexus.classworlds.launcher.Launcher.launchEnhanced(Launcher.java:290)
	at org.codehaus.plexus.classworlds.launcher.Launcher.launch(Launcher.java:230)
	at org.codehaus.plexus.classworlds.launcher.Launcher.mainWithExitCode(Launcher.java:409)
	at org.codehaus.plexus.classworlds.launcher.Launcher.main(Launcher.java:352)
Caused by: org.sonatype.aether.resolution.ArtifactResolutionException: Could not transfer artifact org.sonatype.forge:forge-parent:pom:10 from/to central (http://repo1.maven.org/maven2): Error transferring file: Connection timed out: connect
	at org.sonatype.aether.impl.internal.DefaultArtifactResolver.resolve(DefaultArtifactResolver.java:541)
	at org.sonatype.aether.impl.internal.DefaultArtifactResolver.resolveArtifacts(DefaultArtifactResolver.java:220)
	at org.sonatype.aether.impl.internal.DefaultArtifactResolver.resolveArtifact(DefaultArtifactResolver.java:197)
	at org.sonatype.aether.impl.internal.DefaultRepositorySystem.resolveArtifact(DefaultRepositorySystem.java:323)
	at org.apache.maven.project.ProjectModelResolver.resolveModel(ProjectModelResolver.java:155)
	... 22 more
Caused by: org.sonatype.aether.transfer.ArtifactTransferException: Could not transfer artifact org.sonatype.forge:forge-parent:pom:10 from/to central (http://repo1.maven.org/maven2): Error transferring file: Connection timed out: connect
	at org.sonatype.aether.connector.wagon.WagonRepositoryConnector$4.wrap(WagonRepositoryConnector.java:949)
	at org.sonatype.aether.connector.wagon.WagonRepositoryConnector$4.wrap(WagonRepositoryConnector.java:940)
	at org.sonatype.aether.connector.wagon.WagonRepositoryConnector$GetTask.flush(WagonRepositoryConnector.java:695)
	at org.sonatype.aether.connector.wagon.WagonRepositoryConnector$GetTask.flush(WagonRepositoryConnector.java:689)
	at org.sonatype.aether.connector.wagon.WagonRepositoryConnector.get(WagonRepositoryConnector.java:445)
	at org.sonatype.aether.impl.internal.DefaultArtifactResolver.resolve(DefaultArtifactResolver.java:460)
	... 26 more
Caused by: org.apache.maven.wagon.TransferFailedException: Error transferring file: Connection timed out: connect
	at org.apache.maven.wagon.providers.http.LightweightHttpWagon.fillInputData(LightweightHttpWagon.java:143)
	at org.apache.maven.wagon.StreamWagon.getInputStream(StreamWagon.java:116)
	at org.apache.maven.wagon.StreamWagon.getIfNewer(StreamWagon.java:88)
	at org.apache.maven.wagon.StreamWagon.get(StreamWagon.java:61)
	at org.sonatype.aether.connector.wagon.WagonRepositoryConnector$GetTask.run(WagonRepositoryConnector.java:608)
	at org.sonatype.aether.util.concurrency.RunnableErrorForwarder$1.run(RunnableErrorForwarder.java:64)
	at java.util.concurrent.ThreadPoolExecutor$Worker.runTask(ThreadPoolExecutor.java:886)
	at java.util.concurrent.ThreadPoolExecutor$Worker.run(ThreadPoolExecutor.java:908)
	at java.lang.Thread.run(Thread.java:619)
Caused by: java.net.ConnectException: Connection timed out: connect
	at java.net.PlainSocketImpl.socketConnect(Native Method)
	at java.net.PlainSocketImpl.doConnect(PlainSocketImpl.java:333)
	at java.net.PlainSocketImpl.connectToAddress(PlainSocketImpl.java:195)
	at java.net.PlainSocketImpl.connect(PlainSocketImpl.java:182)
	at java.net.SocksSocketImpl.connect(SocksSocketImpl.java:366)
	at java.net.Socket.connect(Socket.java:529)
	at java.net.Socket.connect(Socket.java:478)
	at sun.net.NetworkClient.doConnect(NetworkClient.java:163)
	at sun.net.www.http.HttpClient.openServer(HttpClient.java:394)
	at sun.net.www.http.HttpClient.openServer(HttpClient.java:529)
	at sun.net.www.http.HttpClient.<init>(HttpClient.java:233)
	at sun.net.www.http.HttpClient.New(HttpClient.java:306)
	at sun.net.www.http.HttpClient.New(HttpClient.java:323)
	at sun.net.www.protocol.http.HttpURLConnection.getNewHttpClient(HttpURLConnection.java:860)
	at sun.net.www.protocol.http.HttpURLConnection.plainConnect(HttpURLConnection.java:801)
	at sun.net.www.protocol.http.HttpURLConnection.connect(HttpURLConnection.java:726)
	at sun.net.www.protocol.http.HttpURLConnection.getInputStream(HttpURLConnection.java:1049)
	at java.net.HttpURLConnection.getResponseCode(HttpURLConnection.java:373)
	at org.apache.maven.wagon.providers.http.LightweightHttpWagon.fillInputData(LightweightHttpWagon.java:115)
	... 8 more
[ERROR] 
[ERROR] Re-run Maven using the -X switch to enable full debug logging.
[ERROR] 
[ERROR] For more information about the errors and possible solutions, please read the following articles:
[ERROR] [Help 1] http://cwiki.apache.org/confluence/display/MAVEN/ProjectBuildingException
[ERROR] [Help 2] http://cwiki.apache.org/confluence/display/MAVEN/UnresolvableModelException
Recording test results